{"text_format":"3","workbook":"xlsx","n_sheets":13,"sheets":["GUIA DE APLICAÇÃO","1 QUESTIONÁRIO","2 INDICADORES","3 RELATÓRIO","4 PLANO ADEQUAÇÃO","Plan1","Sheet3","Sheet4","Sheet5","Sheet6","Relatório de Assist (2)","FÓRMULAS","Base de dados"],"not_rendered":{"charts":8,"images":61,"defined_names":42,"comments":1},"read":"whole","date_system":"1900"}

{"sheet":"GUIA DE APLICAÇÃO","index":0,"n_rows":383,"n_cols":6,"rows_kept":383,"merged":[[0,1,1,2],[2,1,2,2],[12,1,13,12],[15,1,15,12],[17,1,17,12],[19,1,19,12],[21,1,22,12],[24,1,24,12],[27,1,27,12],[29,0,30,0],[29,1,30,12],[32,0,38,0],[32,1,38,12],[40,0,41,0],[40,1,41,12],[43,0,45,0],[43,1,45,12],[47,0,49,0],[47,1,49,12],[53,1,53,12],[54,1,63,12],[65,1,65,12],[66,1,72,12],[74,1,74,12],[75,1,80,12],[82,1,82,12],[83,1,87,12],[89,1,89,12],[90,1,106,12],[108,1,108,12],[109,1,116,12],[118,1,118,12],[119,1,124,12],[126,1,126,12],[127,1,137,12],[139,1,139,12],[140,1,149,12],[151,1,151,12],[152,1,163,12],[165,1,165,12],[166,1,173,12],[175,1,175,12],[176,1,187,12],[189,1,189,12],[190,1,209,12],[211,1,211,12],[212,1,229,12],[231,1,231,12],[232,1,240,12],[242,1,242,6],[243,3,243,4],[243,5,243,6],[244,3,244,4],[244,5,244,6],[245,3,245,4],[245,5,245,6],[246,3,246,4],[246,5,246,6],[248,1,248,12],[249,1,259,12],[261,1,265,12],[267,1,272,12],[274,1,295,12],[297,1,297,12],[298,1,306,12],[308,1,315,12],[317,1,317,12],[318,1,329,12],[331,1,337,12],[339,1,344,12],[346,1,351,12],[353,1,353,12],[354,1,359,12],[361,1,361,12],[362,1,368,12],[370,1,370,12],[371,1,380,12],[382,1,392,12]]}
[null," ISA"]
[{"$nulls":3},"GUIA DE APLICAÇÃO"]
[null,"ISBN 978-85-99764-26-8"]
[null,"Indicadores de Sustentabilidade em Agroecossistemas - ISA"]
[null,"O sistema ISA é composto por 7 pastas:"]
[null,"1ª - Guia de aplicação"]
[null,"2ª - Questionário"]
[null,"3ª - Indicadores"]
[null,"4ª - Relatório"]
[null,"5ª - Plano de adequação"]
[null,"6ª - Fórmulas utilizadas nos Indicadores"]
[null,"7ª - Base de dados"]
[null,"A ferramenta ISA tem como objetivo avaliar limitações, potencialidades e aptidões para os diversos usos e ocupações na escala de um estabelecimento rural, a partir de uma abordagem integrando as dimensões ambiental, social e econômica.  Para cada Indicador são atribuídos valores de 0 a 1. O valor 0,7 é considerado a linha de base de um bom desempenho ambiental, social e/ou econômico. São utilizadas funções em cada Indicador, comparando o valor aferido no estabelecimento rural com o valor de referência. No final é gerado um Índice Final (Aba Relatório) a partir da média dos 21 Indicadores de Sustentabilidade. A ferramenta auxilia o produtor e técnico no processo de tomada de decisão e no gerenciamento de riscos. Ela pode ser utilizada para elaboração de um diagnóstico, de um plano de ação e para o monitoramento do estabelecimento rural no decorrer do tempo. O preenchimento da planilha, software, aplicativo ou do formulário impresso se dará pelo entrevistador (colaborador), com base nas informações passadas pelo produtor (beneficiário) durante a entrevista, podendo contar com o auxílio de seus consultores ou responsáveis técnicos. "]
[]
[]
[null,"Cronograma proposto para o preenchimento do ISA"]
[]
[null,"1 - Fazer o croqui a partir do perímetro do imóvel rural. O perímetro é necessário para o preenchimento do CAR. Se o produtor não tiver, será necessário abrir o Google Earth, ou outro programa similar, para o levantamento do mesmo, incluindo, em alguns casos, a conferência no campo de algumas áreas limítrofes."]
[]
[null,"2 - A partir do perímetro, identificar no croqui do imóvel rural o uso e ocupação do solo e os remanescentes de vegetação nativa, áreas de pousio, nascentes, represas, lagos, cursos e corpos d'água, e áreas de servidão administrativa, como ferrovias, estradas municipais, linhas de transmissão de energia, entre outros, quando presentes no imóvel rural. Esses dados (polígonos, linhas ou pontos) poderão ser aproveitadas para gerar, retificar ou conferir o Cadastro Ambiental Rural (CAR)."]
[]
[null,"3 - A partir do croqui gerado, e de informações levantadas no CAR, como, por exemplo, as Áreas de Preservação Permanente (APPs) que necessitam de restauração, inicia-se o planejamento da visita de campo, definindo-se os locais que serão percorridos, com o objetivo de verificar o manejo das áreas produtivas, o estado de conservação das áreas com vegetação nativa,o estado de conservação das estradas, definir os locais para a coleta de amostras de solo, quando necessário, e os locais para a avaliação da qualidade da água e dos ecossistemas aquáticos, quando presentes. "]
[]
[]
[null,"Guia de preenchimento dos dados na planilha (incluindo exemplos)"]
[]
[null,"1 QUESTIONÁRIO"]
[1,"Colar os croquis do imóvel (croqui gerado no Google Earth ou outro programa similar, e o croqui gerado no CAR)."]
[]
[5,"Recomenda-se criar um código para salvar os arquivos gerados em cada visita para a aplicação do ISA no imóvel rural: 1º - Identificação do código do município do IBGE; 2º - Identificação do produtor rural; 3º - Data ou o ano da aplicação do ISA no imóvel rural. Exemplo: 3107109 Antônio da Silva 2023."]
[]
[]
[6,"O preenchimento da posse de terra diz respeito ao vínculo que o produtor possui com o imóvel rural. Proprietário é a pessoa física ou jurídica que possui o imóvel rural, válido e regularmente destacado do patrimônio público, com o registro imobiliário no seu nome. Ele detém o domínio pleno direto (direito de dispor do imóvel rural) e útil (direito de utilizar ou usufruir do imóvel rural).  O Posseiro é aquele que exerce o direito de posse por um ato translativo de domínio, por um documento de passagem de propriedade de um titular a outro, o que ocorre quando o título de propriedade ainda não foi levado a registro imobiliário. Arrendatário é aquele que arrenda (aluga) o imóvel rural para fins de exploração agrícola ou pecuária, nas condições de uma regular utilização. Parceiro, ou \"Meeiro\", é aquele que explora o imóvel rural, no todo ou em parte, mediante contrato agrário escrito ou verbal, remunerando o proprietário ou titular do domínio útil com um percentual da produção alcançada. Assentado, pessoa ou família contemplada por um projeto de Reforma Agrária; Usufrutuário é a pessoa que utiliza a terra como usufruto, geralmente com vínculo familiar, e não tem a posse ou propriedade."]
{"$rows_empty":7}
[7,"A planilha ISA foi concebida para ser aplicada em um imóvel rural em consonância com a declaração do Cadastro Ambiental Rural (CAR). Caso o produtor possua outras áreas que compõem a renda ou façam parte do seu empreendimento rural (áreas não contíguas ao imóvel, áreas de arrendamento, áreas destinadas para a compensação de Reserva Legal), as mesmas serão descritas na tabela localizada no último subitem."]
[]
[]
[8,"A caracterização do uso e ocupação do solo no imóvel rural tem como objetivo identificar as áreas de produção das culturas anuais, perenes, pastagens e florestas plantadas (silvicultura), além das áreas não agrícolas (construções, estradas, terreiros, etc.), áreas de pousio, espelho e cursos d'água (represas, lagos, lagoas, e cursos d'água), vegetação nativa e as áreas inaproveitáveis (vossorocas e outras áreas que no momento da avaliaçâo estavam inaproveitáveis para atividades econômicas). A somatória de todas as áreas lançadas neste item deve corresponder à área do imóvel rural lançada no item 7. "]
[]
[]
[]
[9,"No levantamento do uso e ocupação do solo gerado no CAR, os dados são preenchidos automaticamente a partir do item 8. Se houver qualquer diferença em qualquer categoria do uso e ocupação entre as informações levantadas com o produtor (item 8) e identificadas no CAR, basta fazer a alteração dos dados no campo correspondente.  É necessário fazer o lançamento da área de servidão administrativa, quando existente (Área de infraestrutura Pública; Área de Utilidade Pública; Reservatório para Abastecimento ou Geração de Energia; Entorno de Reservatório para Abastecimento ou Geração de Energia). Esta área será descontada no cálculo da Reserva Legal do Imóvel Rural. "]
[]
[]
[]
[null,"2 INDICADORES"]
[]
[1,"ÍNDICES DE PRODUTIVIDADE E PREÇOS DE VENDA"]
[null,"OBJETIVO\nLevantar a renda bruta anual proveniente das atividades agrossilvipastoris do imóvel rural; verificar a produtividade e o valor de venda do(s) produto(s) de maior peso gerados por estas atividades e compará-los com a média dos índices de produtividade e a média dos valores de venda identificados no município ou na região.\nAPLICAÇÃO\n1ª ETAPA - Identificar as principais fontes de renda de atividades agropecuárias executadas no imóvel rural. O lançamento dos dados da renda bruta anual estimada dessas atividades é feito em ordem decrescente, (se houver mais de 3 atividades, estas podem ser agrupadas na última linha, somando-se a receita correspondente) no campo 1.1.                                                                                                                                                                                                                                                     2ª ETAPA - Fazer o lançamento das principais atividades agrossilvipastoris e escoher a unidade de medida para avaliar a produtividade das mesmas (sc/ha; t/ha; @/ha/ano; L de leite/ha/dia, etc.). A unidade de medida pode ser modificada na Aba Fórmulas (qualquer uma das células K6 a K18).\n3ª ETAPA - Levantar os índices de produtividade com o entrevistado: Para culturas perenes considerar a média de produção das duas últimas safras; para culturas anuais considerar a média de produção da última safra; para a criação de animais, considerar a média de produção no período de um ano.\n4ª ETAPA - Levantar a média do preço de venda apurado na última safra ou no último ano (no caso de vendas parceladas, calcular o valor médio).\n5ª ETAPA - Lançar a média de produtividade e do preço de venda dos produtos levantados na região ou município (relatórios anuais do IBGE, dados de cooperativas, associações ou escritório local de ATER, dados de produtores rurais considerados como referência na região, etc.).                                                                                                                                                                                                                    Os fatores de ponderação utilizados para avaliar produtividade e preço de venda apurados no imóvel rural em relação aos dados da região estão descritos no lado direito da tabela do campo 1.2. O cálculo do resultado final é feito automaticamente, a partir da média dos índices gerados de cada atividade do empreendimento. Se a renda bruta média gerada no imóvel rural for menor que R$ 300,00/ha/ano ao considerar o total da renda bruta estimada e a somatória das áreas descritas no questionário, é gerado um rebate de 30% na nota final deste indicador (cálculo realizado automaticamente neste indicador)."]
{"$rows_empty":10}
[2,"DIVERSIDADE DE RENDA"]
[null,"OBJETIVO\nLevantar o perfil da renda anual gerada pelos familiares que possuem relação direta com as atividades produtivas no imóvel rural, incluindo a proporção da renda anual gerada por atividades agrícolas, pecuárias e florestais dentro do imóvel rural (indicador 1), de outras atividades e fontes de renda também geradas dentro do imóvel rural (turismo, artesanato, processamento de alimentos, produção de cachaça, queijo entre outros, item 2.1) e fora do imóvel rural (prestação de serviços, aposentadoria, bolsas de auxílio, aporte de recursos de outras atividades profissionais, locação de equipamentos, rendas de aluguel, entre outros, item 2.2). Verifica-se também a ocorrência de concentração da renda anual bruta estimada em uma única atividade agropecuária (acima de 80%, item 2.3).\nAPLICAÇÃO\nEstimar as outras fontes de renda dentro do imóvel rural (item 2.1) e as fontes de renda fora do imóvel rural (atividades agropecuárias, ou não, realizadas fora do imóvel rural e recebimentos de pensão, aposentadoria, bolsas e outras ajudas financeiras - item 2.2). Os porcentuais de cada fonte de renda são lançados automaticamente, assim como a verificação de concentração de renda em uma única atividade agropecuária (item 2.3)."]
{"$rows_empty":7}
[3,"EVOLUÇÃO PATRIMONIAL DO IMÓVEL RURAL"]
[null,"OBJETIVO\nFazer uma estimativa do valor patrimonial do imóvel rural e analisar a evolução ou regressão patrimonial ao longo do tempo, a partir do estabelecimento de um corte temporal, por meio da verificação da valorização do preço da terra na região durante este período, do levantamento das benfeitorias, equipamentos e semoventes (animais) existentes e adquiridos durante o período avaliado, além da ampliação ou diminuição das áreas de produção agrossilvipastoril e de agricultura irrigada. \nAPLICAÇÃO\n1ª ETAPA - (item 3.1) - Definir o tempo de aferição da evolução patrimonial - referência de 1 a 2 anos ou o período referente à última aplicação do ISA.                                           2ª ETAPA - (item 3.2) - Lançar o valor estimado das instalações, benfeitorias ou reformas realizadas recentemente (durante o período estabelecido na primeira etapa - item 3.1) e o valor estimado das instalações e benfeitorias existentes antes do período estabelecido (lançar o valor estimado ou resgatar o valor lançado na última aplicação do ISA). Lançar o valor estimado das máquinas e equipamentos adquiridos recentemente (durante o período estabelecido na primeira etapa - item 3.1) e o valor estimado das máquinas e equipamentos existentes antes do período.\n3ª ETAPA - (item 3.3) - Lançar o número de animais (semoventes) e a estimativa do valor de venda para cada categoria, como também o estoque de grãos existente no imóvel rural na ocasião da aplicação do ISA. Para o levantamento do valor histórico dos animais, verificar o número de animais e a estimativa do valor para cada categoria. O levantamento dos bens e semoventes do imóvel rural pode ser sincronizado com a atualização cadastral do produtor no banco, aproveitando os dados levantados pela instituição financeira para verificação do limite de crédito, na ocasião da obtenção de financiamentos para lavoura, custeio pecuário, investimentos, Pronaf, entre outros (realizado uma vez por ano). Se o produtor já possui estes dados, basta lançar o valor monetário de cada item sem fazer a descrição detalhada dos bens.                                                                                                                                                                                                                                                                             4ª ETAPA  - (item 3.4) -  Fazer o levantamento da área com agricultura irrigada no imóvel rural, quando presente, verificando-se também se houve alteração da área de agricultura irrigada na coluna \"Histórico área total\".\n5ª ETAPA  - (item 3.5) -  Verificar se houve alguma alteração no histórico de uso e ocupação do solo durante o período estabelecido no item 3.1 (os dados do histórico são preenchidos automaticamente, se houver alguma alteração em relação à ocupação atual descrita no questionário, basta substituir os dados).                                     6ª ETAPA  - (item 3.6) -  Lançar os valores estimados do preço da terra atual e histórico (referência do período no item 3.1). \n"]
[]
[]
[]
[]
[]
[]
[4,"GRAU DE ENDIVIDAMENTO"]
[null,"OBJETIVO\nEste indicador complementa as informações obtidas pelo indicador Evolução Patrimonial, e tem como objetivo verificar o grau de endividamento do produtor, por meio da avaliação da proporção do montante de empréstimos contraídos (custeio agrícola, pecuário, investimentos, Pronaf, entre outros) em relação à estimativa do valor patrimonial (valor do imóvel rural com todas as benfeitorias, equipamentos, semoventes e o uso e ocupação da terra, gerado no indicador 3). As notas atribuídas ao grau de endividamento (descritas nos fatores de ponderação) referem-se aos empreendimentos de menor escala ou familiares. Os empreendimentos de maior escala comportariam um grau de endividamento maior, considerando uma menor aversão ao risco financeiro e maior capacidade e lastro para o pagamento dos compromissos financeiros. \nAPLICAÇÃO\nLevantar todos os financiamentos de curto e longo prazos contraídos pelo produtor até o presente momento e lançar o valor no item 4.1 \n"]
[]
[]
[]
[]
[]
[5,"SERVIÇOS BÁSICOS DISPONÍVEIS PARA O IMÓVEL RURAL/SEGURANÇA ALIMENTAR"]
[null,"SERVIÇOS BÁSICOS - OBJETIVO\nVerificar, nas residências de familiares e de funcionários no imóvel rural, o acesso de alguns serviços básicos como: disponibilidade de água em quantidade e qualidade; energia elétrica; acesso regular para escoamento da produção e recebimento de insumos (trafegabilidade durante o ano);  acesso ao serviço de saúde (verificar se o produtor é atendido pelo Programa Saúde da Família PSF); acesso regular ao transporte escolar; segurança no campo; internet; e coleta pública de lixo (coleta do lixo reciclável ou coleta do lixo domiciliar pela prefeitura).\nAPLICAÇÃO\n1ª ETAPA - Verificar quantas residências com moradores regulares possui o estabelecimento (item 5.1).\n2ª ETAPA - Para cada residência, verificar a disponibilidade dos serviços listados no item 5.2. Para o preenchimento deste indicador, deve-se colocar 1 (se atende satisfatoriamente), 0,5 (se atende parcialmente), ou 0 (não atende ou inexistente).                        \nPRODUÇÃO PRÓPRIA DE ALIMENTOS - OBJETIVO\nPara os imóveis rurais classificados como familiares rurais (item 7 do questionário), avaliar a disponibilidade de alimentos (hortaliças, frutas, tubérculos e fontes de proteína animal) produzidos no próprio estabelecimento (verificar também o entorno das residências), e se estes são suficientes para complementar a oferta de alimentos a todas as pessoas envolvidas no empreendimento (item 5.3).\nAPLICAÇÃO\n1ª ETAPA - Verificar quantas residências com moradores regulares possui o estabelecimento.\n2ª ETAPA - Para cada residência ou conjunto de residências, verificar se há produção de hortaliças, tubérculos, frutas e criação de animais para o consumo dos residentes.\nOBS: Os valores utilizados no preenchimento de cada item são: 1 (presente); 0,5 (parcial) ou 0 (inexistente). Entende-se por parcial a presença do item, mas em quantidade insuficiente para atender à demanda da família. Valores de referência para uma família com 5 pessoas (demanda média de 2.630 kcal/dia), conforme trabalho realizado pela Emater/MG:\nCitros, 4 pés; Mamoeiros, 13 pés; Bananeiras, 18 pés; Vacas de leite, 2; Cevados (porcos)/ano, 4; Frangos/ano, 100; Galinhas, 50; Galos, 3; Mandioca, 200 kg; Hortaliças (folhosas, frutos e tubérculos)/ano, 600 kg.                                                                                                                                            \n"]
{"$rows_empty":17}
[6,"ESCOLARIDADE & CURSOS DIRECIONADOS ÀS PRINCIPAIS ATIVIDADES"]
[null,"OBJETIVO\nVerificar as informações relativas à escolaridade e participação em cursos de capacitação (curta e média duração) direcionados às atividades agropecuárias do imóvel rural, de todos os integrantes da família com vínculo direto com as atividades do imóvel rural, e da mão de obra contratada efetiva. Verificar também o acesso das crianças e jovens em idade escolar, que residem no imóvel rural, à rede básica de ensino.\nAPLICAÇÃO\n1ª ETAPA - Verificar o número de adultos com vínculo direto à produção e empregados permanentes. Levantar o número de dependentes em idade escolar que residem no estabelecimento.\n2ª ETAPA - Verificar com o entrevistado o grau de escolaridade dos integrantes família com vínculo direto com as atividades do imóvel rural, e da mão de obra contratada efetiva, e a participação dos mesmos em cursos de capacitação direcionado às atividades (no último ano), e se todos os dependentes em idade escolar estão frequentando a escola.\n"]
{"$rows_empty":8}
[7,"OCUPAÇÃO & EMPREGO"]
[null,"OBJETIVO\nVerificar o cumprimento da legislação trabalhista e uma série de recomendações e determinações do Ministério do Trabalho para os imóveis rurais que empregam pessoas nos sistemas de produção (mão de obra contratada efetiva e temporária).\nAPLICAÇÃO\n1ª ETAPA - Verificar o número de funcionários permanentes (contratação efetiva) e temporários (item 7.1). \n2ª ETAPA - A partir do levantamento do número de empregados permanentes e temporários, verificar quantas são atendidos pelo item 7.1 (referente às obrigações da legislação trabalhista) e item 7.2 (referente às recomendações e determinações do Ministério do Trabalho)."]
[]
[]
[]
[]
[]
[]
[8,"GESTÃO DO EMPREENDIMENTO"]
[null,"OBJETIVO\nAvaliar a capacidade de gestão do empreendedor com base no uso de instrumentos de administração, controle de custos, contabilidade, acesso ao crédito e à assistência técnica, cumprimento da legislação ambiental, e, também, no grau de organização dos produtores da região.\nAPLICAÇÃO\n1ª ETAPA - Verificar com o entrevistado se é feito um controle de receitas e despesas no empreendimento rural (fluxo de caixa).\n2ª ETAPA - Verificar se é feito um controle de custos de produção para as atividades desenvolvidas no imóvel rural.\n3ª ETAPA - Verificar se o produtor tem acesso à assistência técnica (assistência de revendas ou lojas de insumos agropecuários não são consideradas).\n4ª ETAPA - Verificar se o produtor participa ativamente ou de forma eventual das diversas formas de organização dos produtores rurais locais (Associações, Cooperativas, Sindicato, etc.).\n5ª ETAPA - Verificar a situação da regularização ambiental do produtor com relação a água, licença ambiental e regularização da Reserva Legal (RL) e das Áreas de Preservação Permanente (APP) a partir do Cadastro Ambiental Rural (CAR).\n6ª ETAPA - Verificar se o produtor tem acesso às linhas de crédito (custeio para o plantio de lavouras ou pecuário, financiamento de equipamentos e construções, reformas de pastos, entre outros, e crédito para a comercialização da produção). Para o preenchimento deste indicador, deve-se colocar o valor 1 (se a atividade é realizada satisfatoriamente), 0,5 (se a atividade é realizada parcialmente) ou 0 (se inexistente)."]
{"$rows_empty":11}
[9,"COMERCIALIZAÇÃO & INOVAÇÃO"]
[null,"OBJETIVO\nVerificar se o produtor busca informações de mercado para a comercialização de sua produção, e se acessa mercados que agregam valor (produtos certificados ou mercados que pagam um diferencial na qualidade) ou mercados institucionais (programas de governo com comercialização direta do produtor ao consumidor, programa de abastecimento para a merenda escolar no município, entre outros). Verificar a utilização de ferramentas de gestão direcionadas aos fatores críticos identificados nas principais atividades, com foco na adoção de técnicas inovadoras, ambientalmente adequadas, e na capacidade de inovação do produtor rural. \nAPLICAÇÃO\n1ª ETAPA - Verificar com o entrevistado como é feita a comercialização da produção e como ele obtem informações sobre o mercado (consultas em sites,  Cooperativas, Associações, jornal, etc.). Verificar também se há produção certificada ou direcionada para mercados institucionais (orgânica, cafés especiais, Programa de Aquisição de Alimentos - PAA, Programa Nacional de Alimentação Escolar - PNAE, entre outros).\n2ª ETAPA - Verificar com o entrevistado, durante as visitas aos talhões, quais são os principais problemas e quais as medidas tomadas para o seu controle, verificando previamente na região quais as tecnologias inovadoras identificadas e, se estas ou outras estão sendo adotadas pelo produtor (caso afirmativo, fazer a descrição da técnica inovadora adotadas pelo produtor). A partir do perfil do produtor, verificar se este tem capacidade de inovação ou tem uma posição de liderança na comunidade (caso afirmativo fazer a descrição). É feita também a verificação (opcional) da adoção de algumas práticas visando uma cobertura permanente e diversificada do solo.\n"]
{"$rows_empty":10}
[10,"GERENCIAMENTO DE RESÍDUOS E EFLUENTES NO IMÓVEL RURAL"]
[null,"OBJETIVO\nVerificar o índice de coleta e destinação adequada do lixo (reciclável e não reciclável) produzidos no imóvel rural; verificar a destinação adequada do esgoto doméstico; verificar o índice de reaproveitamento dos resíduos sólidos orgânicos gerados no imóvel rural (compostagem, adubação orgânica, alimentação de animais, etc.); e verificar o índice de tratamento e destinação adequada dos efluentes líquidos e gasosos, quando os mesmos forem gerados no imóvel rural.\nAPLICAÇÃO\n1ª ETAPA - Verificar com o entrevistado qual o destino do esgoto doméstico gerado em cada residência existente no imóvel rural (item 10.1).\n2ª ETAPA - Verificar com o entrevistado qual o destino do lixo doméstico e do lixo gerado nas unidades de produção (lixo reciclável – embalagens, plástico, papel, latas, e o lixo não reciclável) (item 10.2).\n3ª ETAPA - Estimar com o entrevistado qual a proporção (%) do total de resíduos orgânicos que são compostados ou reaproveitados nas unidades de produção (palhadas, esterco, cama de frango, entre outros).\n4ª ETAPA - Verificar com o entrevistado se há alguma unidade de produção (curral, galpões para criação de animais, unidades de compostagem) ou de beneficiamento (café despolpado, chorumeira, etc.) que geram efluentes líquidos. Estimar qual a proporção (%) dos efluentes gerados que recebem tratamento e destinação adequada.\n5ª ETAPA - Verificar com o entrevistado se há alguma unidade de produção que gere efluentes gasosos (caldeiras, carvoaria, biodigestores, etc.). Estimar qual a proporção (%) do total de efluentes gasosos gerados que possuem um tratamento adequado antes de serem lançados na atmosfera.\n6ª ETAPA - Verificar no imóvel rural se tem alguma situação crítica com relação ao gerenciamento de resíduos e efluentes:  fossa seca (negra) localizada próxima a um curso d'água ou poço artesiano; lançamento de efuentes (domésticos ou de criações) sem nehum tratamento em corpos d'água; esgoto a céu aberto, queima de resíduos plásticos, baterias, e outros materiais sintéticos no estabelecimento, entre outros."]
{"$rows_empty":12}
[11,"SEGURANÇA DO TRABALHO / GESTÃO DO USO DE AGROTÓXICOS"]
[null,"OBJETIVO\nVerificar se ocorre o uso de agrotóxicos no imóvel rural, levantar quantas pessoas manipulam ou estão expostas a esses produtos, se as mesmas utilizam equipamentos de proteção individual, e observar o armazenamento e disposição adequada das embalagens destes produtos (sugere-se fazer o mesmo procedimento para produtos veterinários, sobretudo os produtos utilizados para controle de parasitas, inseticidas e vacinas).\nAPLICAÇÃO\n1ª ETAPA - Verificar com o entrevistado se ocorre a utilização de agrotóxicos nos sistemas de produção agrossilvipastoris, quantas pessoas manuseiam esses produtos, e quantas utilizam o equipamento de proteção individual (preencher o número de pessoas).\n2ª ETAPA - Verificar se o imóvel rural possui um local adequado para o armazenamento das embalagens de agrotóxicos (local exclusivo com acesso restrito e ventilado) e se o produtor faz a devolução dessas embalagens no local indicado pela revenda, conforme a Lei 12.305/10 que institui a Política Nacional de Resíduos Sólidos e trata da logística reversa dos resíduos (excolher a opção \"sim\" quando for adequado e suficiente).\n"]
{"$rows_empty":8}
[12,"CAPACIDADE PRODUTIVA DO SOLO"]
[null,"OBJETIVO\nAvaliar aspectos relacionados a fertilidade e atividade biológica do solo, por meio de dez parâmetros relacionados às propriedades químicas e físicas do solo e de duas enzimas do solo relacionadas à atividade biológica (Arilsulfatase e Betaglicosidase). Para a interpretação dos dados relacionados à fertilidade do solo foram utilizadas as publicações: \"Recomendações para o uso de corretivos e fertilizantes em Minas Gerais - 5ª aproximação\" e \"Cerrado: correção do solo e adubação\" publicado pela Embrapa Cerrados. Os dados para análise da biologia do solo referem-se a tecnologia BioAS desenvolvida pela Embrapa (esta análise é opcional).\nAPLICAÇÃO\n1ª ETAPA - Verificar qual é a área mais representativa para a produção agrossilvipastoril (considerar o tamanho da área e o peso econômico - geração de renda), ou a área direcionada para as intervenções propostas no plano de adequação. Verificar se o entrevistado possui análises recentes de fertilidade do solo (período até 2 anos), e se as mesmas possuem análise granulométrica do solo (textura). \n2ª ETAPA - A partir das informações levantadas verificar a necessidade de fazer outras coletas de amostras de solos para análise química em laboratório de solo. Se necessário, fazer a coleta de amostras de solo evitando talhões que foram recentemente adubados, locais próximos a brejos, casas, galpões, formigueiros ou voçorocas. As coletas devem ser realizadas na profundidade de 0-20 cm, com auxílio de um trado, caminhando em zigue-zague pela área. Após a coleta de amostras, o solo deve ser bem misturado, para obtenção de uma amostra composta do talhão. Desta, separa-se uma porção da amostra composta de, aproximadamente, 300 g, em saco plástico limpo e identificado (nome do talhão, data e o código do estabelecimento), para ser encaminhada ao laboratório de solos. Para as análises da biologia do solo, realizar o mesmo procedimento, porém, na profundidade de 0-10 cm.\n3ª ETAPA - Ao lançar os dados da análise de solo, primeiro, fazer a descrição do talhão e a data da análise no laboratório (campo descrição do talhão). As interpretações dos teores de matéria orgânica e fósforo consideram a textura do solo. Pode ser inserido (opcional) dados sobre aspectos relacionados à atividade biológica do solo envolvendo a BioAS (análise das enzimas arilsulfatase e betaglicosidase em amostras de solo coletadas conforme a descrição da 2ª etapa, na profundidade de 0-10cm). As interpretações dos dados são baseados no sistema da Embrapa (Mendes et al., 2021).\n"]
{"$rows_empty":12}
[13,"AVALIAÇÃO DA QUALIDADE DA ÁGUA"]
[null,"AVALIAÇÃO DA QUALIDADE DA ÁGUA SUPERFICIAL - OBJETIVO\nAvaliar os ecossistemas aquáticos a partir de dois segmentos de um curso d'água, quando presente no imóvel rural, à montante e à jusante, utilizando um protocolo de avaliação rápida dos ecossistemas aquáticos (item 3.1). Análises complementares podem ser realizadas por meio de fitas de análise de pH, nitrato e coliformes, e equipamentos para análise da turbidez (item 13.2). \nAPLICAÇÃO\n1ª ETAPA - Identificar os corpos d'água que passam pelo imóvel rural. A partir destas informações, escolher o curso d'água mais representativo ou mais importante para o imóvel rural (abastecimento ou irrigação).\n2ª ETAPA - Definido o curso d'água, identificar os pontos de coleta de amostras de água (montante e jusante) para a realização das análises (Montante - local de entrada do curso d'água que passa dentro ou na divisa do imóvel rural, ou próximo de uma nascente; Jusante – local de saída do curso d'água que passa dentro ou na divisa do imóvel rural, ou próximo ao local onde um curso d'água deságua em outro corpo d'água). Para facilitar a coleta de amostras para a análise da qualidade da água em locais de dífícil acesso, recomenda-se utilizar um coletor com haste.  \n3ª ETAPA - item 13.1 - Para cada ponto de coleta aplicar o protocolo de avaliação rápida dos ecossistemas aquáticos.  Pode ser levado um notebook, tablet ou  o cheklist impresso para realizar o seu preenchimento no próprio local de avaliação. \n4ª ETAPA (opcional) - item 13.2 - Se for utilizar as fitas para leitura de pH e nitrato, os resultados devem ser anotados ou registrados in loco, no caso da cartela microbiológica para análise da presença de coliformes termotolerantes, fazer a leitura após incubação por 15 horas (para a sua coleta, não tocar na cartela, deixar o excesso de água escorrer e guardar a mesma envolta em um papel alumínio até o local de incubação. Após a incubação, proceder a contagem das colônias, considerando sempre os dois lados da cartela. Coliformes fecais são os pontos azuis. Multiplicar cada ponto por 60 para lançar na planilha). A avaliação da turbidez pode ser feita no local utilizando-se equipamentos portáteis para a sua avaliação. \n\nAVALIAÇÃO DA QUALIDADE DA ÁGUA SUBTERRÂNEA - OBJETIVO\nAvaliar a qualidade da água subterrânea no imóvel rural, quando presente (poço proveniente do lençol freático (mais raso), ou poço artesiano, proveniente de aquíferos que estão abaixo de uma camada impermeável, portanto, mais profundos). Para tanto, são utilizados três parâmetros: pH; coliformes termotolerantes e nitrato (item 13.3).\nAPLICAÇÃO\n1ª ETAPA (opcional) - Verificar se existem poços para utilização de água subterrânea no estabelecimento (incluindo a captação de água de nascentes) ou coletar a água utilizada para consumo, o mais próximo da fonte. Uma vez identificados, eleger o de maior importância ou o mais utilizado pelo produtor.\n2ª ETAPA (opcional) - Coletar amostras da água para realizar as análises no local. \n"]
{"$rows_empty":20}
[14,"RISCO DE CONTAMINAÇÃO DA ÁGUA POR AGROTÓXICOS "]
[null,"OBJETIVO\nEstimar o risco de contaminação de corpos d'água pelo uso de agrotóxicos no imóvel rural, considerando parâmetros relacionados à persistência do princípio ativo no ambiente, sua mobilidade no perfil do solo e a toxicidade da formulação. São considerados todos os agrotóxicos eventualmente utilizados no imóvel rural, o volume aplicado e a vulnerabilidade de cada talhão, levando em conta, a granulometria do solo, a proximidade dos corpos d´água e o tipo de manejo do solo (relacionado ao preparo para o plantio e o manejo das entrelinhas de culturas perenes e florestais).\nAPLICAÇÃO\n1ª ETAPA - Levantar com o entrevistado todos os produtos utilizados (nome comercial) nas áreas de produção e pastagens para o controle de pragas, doenças e plantas invasoras.\n2ª ETAPA - item 14.1 - Selecionar cada produto (lista do nome comercial dos produtos aparece em ordem alfabética ao clicar o campo Nome Comercial), descrever a cultura onde cada um foi aplicado, a área em ha e a dose utilizada (L ou kg/ha). Recomenda-se fazer o lançamento dos agrotóxicos agrupando-os por lavoura (café, milho, soja, etc.), mesmo que se repita um determinado produto em lavouras diferentes (as doses podem variar). Se houver mais de uma aplicação do mesmo produto na safra, lançar o volume total por hectare.\n3ª ETAPA - Os dados de cada produto escolhido na lista do item 14.1 são preenchidos automaticamente na planilha: princípio ativo (no caso de produtos com mais de um princípio ativo, é lançado apenas o que tiver o maior potencial de contaminação); toxicidade; mobilidade do produto no ambiente, correspondente ao coeficiente de sorção do agrotóxico pela matéria orgânica do solo (Koc); persistência do produto no ambiente, correspondente a meia-vida de campo do agrotóxico em dias (t1/2). Uma lista de referência com os dados descritos acima está disponibilizada na Aba \"Banco de dados\". Informações de outros princípios ativos que não se encontram na lista podem ser obtidas no site http://sitem.herts.ac.uk/aeru/iupac/. Informações sobre o risco de contaminação de cada ingrediente ativo para o trabalhador rural, consumidor e o meio ambiente foram incluídos (índice da Universidade de Cornell - IEQ), além de informações sobre quais produtos utilizados no país estão banidos na União Européia.                                                                                                                                                                    4ª ETAPA - Para cada produto inserido no indicador, identificar as características da área onde o mesmo foi aplicado, considerando a granulometria ou o teor de argila (1, 2 ou 3, conforme descrição no item 14.2), a distância do curso d'água mais próximo da referida área (1, 2 ou 3, conforme descrição no item 14.2) e o tipo de manejo do solo (1, 2 ou 3, conforme descrição no item 14.2). O objetivo deste levantamento é verificar a vulnerabilidade destas áreas com relação à contaminação dos corpos d'água por agrotóxicos.\n5ª ETAPA - O risco de contaminação é calculado automaticamente para cada produto. Para gerar uma nota no indicador, lançar no item 14.3 a identificação das culturas, a área respectiva de cada cultura ou talhão e lançar, para cada lavoura, e o maior risco de contaminação. O resultado desse indicador considera o risco máximo e a área equivalente de cada talhão ou cultura identificados no estabelecimento. \n"]
{"$rows_empty":18}
[15,"AVALIAÇÃO DE ÁREAS COM SOLO EM PROCESSO DE DEGRADAÇÃO"]
[null,"OBJETIVO\nVerificar a presença de solos em estágio de degradação, dimensionar a área, a intensidade do processo (escala e potencial de impacto) e avaliar a tendência de comportamento do processo de degradação (intensificação, estabilização ou diminuição).\nAPLICAÇÃO\n1ª ETAPA - Identificar no estabelecimento áreas com solos em estágio de degradação (presença de erosão laminar, em sulcos ou voçorocas).\n2ª ETAPA - Uma vez identificadas no campo, verificar qual a área apresenta maior intensidade e/ou maior estágio de degradação. A estimativa da área pode ser feita com o entrevistado ou com imagens de satélite, além da conferência no campo. Fazer o lançamento apenas da área com maior intensidade de estágio de degração e/ou de maior abrangência no item 15.1, lançando a área em hectares em uma das opções: estágio inicial; estágio intermediário; ou estágio avançado.\n3ª ETAPA - Marcar uma das opções de tendência de comportamento do processo de erosão identificado no item 15.2: redução do processo; processo inalterado; intensificação do processo de erosão."]
{"$rows_empty":9}
[null,"Indicativos da Intensidade do estágio de degradação"]
[null,null,"Inicial","Intermediário",null,"Avançado"]
[null,"Erosão laminar","Redução de infiltração de água Raízes expostas","Remoção do horizonte superficial do solo"]
[null,"Erosão em sulcos",null,"Presença de sulcos rasos localizados",null,"Sulcos profundos e disseminados em toda a área"]
[null,"Voçoroca",{"$nulls":3},"Presença de voçorocas, movimento de  massa (deslocamento de grandes volumes de solo)"]
[]
[16,"GRAU DE ADOÇÃO DE PRÁTICAS CONSERVACIONISTAS"]
[null,"OBJETIVO\nAvaliar o grau de adoção de uma série de medidas para a conservação do solo e água em todos os sistemas de produção no imóvel rural. A verificação é realizada em todos os talhões de lavouras e pastagens. Também é verificado com o produtor ou responsável pelo empreendimento quais estratégias vem sendo adotadas para o convívio com a seca ou estresse hídrico e para a conservação e reservação da água no imóvel rural.\nAPLICAÇÃO\n1ª ETAPA - Percorrer os talhões e pastegens, verificar o grau de adoção de práticas de conservação do solo e  água (a somatória das áreas de produção para cada categoria - lavouras permanentes, lavouras temporárias, pastagens e florestas, aparecem automaticamente no cabeçalho da tabela do item 16.1).\n2ª ETAPA - Após a verificação do grau de adoção de práticas conservacionistas, levando em conta a topografia do terreno, o tipo de cobertura vegetal, e, para as culturas permanentes e florestas plantadas o seu estágio de desenvolvimento, fazer o preenchimento das respectivas áreas de cada talhão e pastagem avaliado conforme as categorias do grau de adoção de práticas para a conservação dos solos (suficiente; insuficiente - as medidas adotadas não são suficientes para conter os processos erosivos, incluindo erosão laminar com baixo nível de intensidade; e situação inadequada - situações extremas de ausência de práticas de conservação dos solos e/ou presença de processos erosivos com alta intensidade).                                                                                                                                                                                                                       3ª ETAPA - Verificar com o produtor o grau de adoção de estratégias para a conservação e reservação das águas, considerando todo o imóvel rural, marcando uma das opções: suficiente; insuficiente; ou situação inadequada ou de alta fragilidade (item 16.2)."]
{"$rows_empty":11}
[null,"GRAU DE ADOÇÃO DE PRÁTICAS DE CONSERVAÇÃO DO SOLO (REFERÊNCIAS)\nSUFICIENTE - Plantio em nível; cobertura do solo permanente, diversificada e com raízes vivas; adoção do sistema de plantio direto na palha; terraceamento; rotação de culturas, consorciações, evitar a compactação do solo, etc.\nINSUFICIENTE - Solo desprotegido, plantio sem seguir as curvas de nível, uso de mecanização intensiva gerando compactação da área, sem rotação de culturas, etc.\nSITUAÇÃO INADEQUADA - Situação extrema de ausência de práticas de conservação dos solos, presença de erosão mais intensa, solos muito compactados, uso de grade e aração, presença de fogo, monocultivos sem rotação das culturas anuais, sem estratégias para manter o solo coberto na entresafra ou nas entrelinhas dos cultivos perenes, etc."]
[]
[]
[]
[]
[]
[null,"GRAU DE ADOÇÃO DE ESTRATÉGIAS PARA A CONSERVAÇÃO E RESERVAÇÃO DAS ÁGUAS NO IMÓVEL RURAL (REFERÊNCIAS)\nSUFICIENTE - Práticas adotadas são suficientes para garantir o fornecimento de água para o abastecimento, dessedentação e/ou para as atividades de agricultura irrigada; implantação de estruturas para minimizar o poder erosivo do escoamento superficial das águas pluviais (principalmente as enxurradas) nas áreas de produção e nas estradas; adoção de estratégias para a manutenção ou incremento da Matéria Orgânica do solo e ativação da biologia do solo visando a estabilidade dos agregados e aumentas a capacidade de infiltração e retenção de água.\nINSUFICIENTE - Práticas adotadas não são suficientes para garantir o fornecimento de água para o abastecimento, dessedentação, para as atividades de agricultura irrigada, bem como evitar processos erosivos.\nSITUAÇÃO INADEQUADA - Escassez de água para abastecimento humano; escassez de água para a dessedentação de animais no imóvel rural; ausência de estratégias para convívio com a seca; processos erosivos recorrentes no imóvel rural."]
[]
[]
[]
[]
[]
[]
[null,"PLANTIO EM CURVA DE NÍVEL - Preparo do solo é realizado seguindo a direção da curva de nível do terreno. Dessa forma, para terrenos com pequena declividade, são criados obstáculos à descida da enxurrada, propiciando a redução dos processos erosivos e aumento da infiltração de água no solo.                                                                                                                                                                                                                    PREPARO DO TERRENO COM O MÍNIMO DE REVOLVIMENTO - Consiste em abrir apenas um sulco no solo onde serão introduzidas as sementes e o adubo, dispensando assim, os processos convencionais de aração e gradagem. Este tipo de preparo mantém os restos da cultura anterior sobre o solo. Com isso, atenua-se a erosão e a compactação das camadas mais profundas do solo devido à redução do uso de máquinas pesadas.                                                                                                                                             PLANTIO DIRETO - É um sistema de semeadura, no qual a semente é colocada diretamente no solo não revolvido, usando-se máquinas específicas. Somente é aberto um pequeno sulco ou cova de largura e profundidade suficientes para a adequada cobertura e contato das sementes com o solo.\nMANTER O SOLO PROTEGIDO O ANO TODO - A permanência de palhadas de colheitas anteriores ou o uso de plantas de cobertura evitam que o solo fique exposto à insolação, reduz a evaporação, fornece também proteção contra o impacto das gotas de chuva, reduzindo o escoamento superficial e a erosão. Assim, a cobertura do solo apresenta como benefícios: a redução da incidência de plantas invasoras; promoção do equilíbrio da flora e da fauna do solo; favorecimento do manejo integrado de pragas e doenças; maior estabilização da taxa de reciclagem de nutrientes; e promoção da atividade biológica no solo.\nQUEBRA-VENTOS - Plantio de árvores em intervalos regulares no entorno de lavouras e pastagens em direção perpendicular aos ventos dominantes. Os quebra-ventos agem diretamente de duas formas sobre o ambiente: sombreando parcial e temporariamente as culturas e pastagens; diminuindo a velocidade do vento. Seus benefícios principais são as alterações no microclima, o que pode levar a incrementos na produção, reduzindo a necessidade por insumos externos. O sombreamento auxilia no aumento da umidade do solo, enquanto a redução dos ventos diminui a erosão eólica. A presença de árvores também funciona como um fator atrativo para diversas espécies. \nFAIXAS COM VEGETAÇÃO NATURAL, ROÇADAS ALTERNADAS - Supressão da vegetação nativa em faixas alternadas na abertura de novas áreas para cultivos ou revegetação com especies nativas nas áreas consolidadas. Para as culturas perenes, as roçadas alternadas permitem o estabelecimento de espécies atrativas para inimigos naturais de pragas.\nCULTURAS INTERCALARES - Podem ser utilizadas culturas comerciais ou não. O plantio de culturas de porte, ciclo e comportamento agronômico diferentes pode ser benéfico, pois, além do benefício direto do aumento da biodiversidade, possibilita um melhor aproveitamento dos nutrientes do solo, explorando diferentes camadas do solo.\nTERRACEAMENTO -  Os terraços podem ser locados em nível, em desnível ou de forma mista. Os terraços em nível possuem as extremidades bloqueadas e têm a função de acumular e infiltrar a água, e são recomendados para áreas com boa permeabilidade e declividade de até 12%. Os terraços em desnível apresentam pequeno gradiente ao longo de seu comprimento e conduzem a água para as laterais, sendo mais adequados, para áreas com menor permeabilidade e/ou declividades superiores a 12%. Os terraços mistos englobam os dois tipos anteriores, ou seja, são projetados em pequeno desnível e com capacidade de acumulação de água que, ao ser excedida, escoa pelas laterais. Em encostas ou morros onde o volume e a velocidade da enxurrada são grandes, dependendo do comprimento de rampa e da declividade, o terraço em desnível é mais recomendado para se evitar que estes se rompam, podendo ser construídos com menor largura. A seleção do tipo de terraço a ser construído, assim como seu dimensionamento, sua locação e sua construção devem ser feitas por profissionais qualificados. Os terraços classificam-se ainda quanto a sua largura, em base estreita (menos de 3 m), base média (3 a 6 m) e base larga (6 a 12 m), e, quanto ao seu perfil, em terraço do tipo comum, embutido, murundu, e patamar (plataforma). \n\n\n"]
{"$rows_empty":22}
[17,"ESTADO DE CONSERVAÇÃO DAS ESTRADAS QUE CORTAM OU MARGEIAM O IMÓVEL RURAL"]
[null,"OBJETIVO\nVerificar a presença de estruturas para a drenagem e escoamento das águas pluviais (enxurradas) das estradas localizadas dentro do imóvel rural ou que tangenciam o imóvel rural, observando a presença de abaulamentos ou declividade transversal das mesmas, a presença de lombadas para o desvio de enxurrada, quando necessário, a presença de bacias ou caixas de infiltração para captar a água proveniente do escoamento das estradas, quando necessário, e o estado de conservação das estradas observando a presença de buracos e sulcos de erosão.\nAPLICAÇÃO\n1ª ETAPA - Percorrer as estradas de acesso que cortam ou margeiam o imóvel rural, e as estradas internas, observando o estado de conservação dessas e a adoção de práticas conservacionistas.\n2ª ETAPA - Depois de percorrer as estradas, fazer o preenchimento dos campos, por meio da estimativa do percentual da adoção de medidas de conservação das estradas (item 17.1) e do percentual da presença de buracos e sulcos de erosão nas estradas (item 17.2).                                                                                                                                                               3ª ETAPA - Verificar a presença de pontos críticos nas estradas que podem comprometer o acesso e escoamento da produção e recebimento de insumos, ou que podem gerar significativos impactos ambientais como o assoreamento de corpos d'água. Caso afirmativo, fazer a descrição no campo abaixo do item 17.3.\n"]
{"$rows_empty":9}
[null,"DECLIVIDADE TRANSVERSAL DA ESTRADA - É uma inclinação da seção transversal, a partir do eixo da estrada, para permitir o escoamento das águas superficiais para as valas laterais. \nLOMBADAS PARA DESVIO DE ENXURRADA - São elevações construídas transversalmente ao longo de toda a largura da plataforma da estrada, com o objetivo de conduzir adequadamente as águas superficiais, direcionando-as aos dispositivos encarregados de absorvê-las e ou armazená-las, tais como: terraços, caixas de retenção, etc. \nCAIXAS DE CAPTAÇÃO DE ÁGUA OU BARRAGINHAS - O objetivo dessa técnica é proporcionar a captação da águas de chuva, por meio da construção de pequenas barragens ou miniaçudes, nos locais de ocorrência de enxurradas volumosas e erosivas, barrando-as e amenizando seus efeitos erosivos. \nBACIAS DE INFILTRAÇÃO - Bacia ou caixa de infiltração é uma depressão no terreno construída, geralmente às margens da estrada, com o objetivo de reduzir o volume das enxurradas e promover a recarga da água subterrânea. \n"]
{"$rows_empty":8}
[18,"VEGETAÇÃO NATIVA - FITOFISIONOMIAS E ESTADO DE CONSERVAÇÃO"]
[null,"OBJETIVO\nAvaliar o estado de preservação dos remanescentes de vegetação nativa e o nível de fragmentação desses habitats no imóvel rural. Verifica-se também se estes fragmentos de vegetação nativa têm ligação com outros fragmentos nos estabelecimentos rurais vizinhos, formando corredores ecológicos. São identificadas as fitofisionomias (campo rupestre/campo de altitude; campo higrófilo de várzea; cerrado ralo; cerrado típico; cerradão; mata de galeria; veredas; mata atlântica/mata seca; e vegetação de caatinga) e o estado de conservação com base nas referências para os estágios sucessionais das principais fitofisionomias dos biomas Mata Atlântica, Cerrado e Caatinga.\nAPLICAÇÃO\n1ª ETAPA - Identificar os diferentes tipos de vegetação nativa (selecionar o tipo de fitofisionomia no cabeçalho da tabela do Indicador  - clicar com o mouse no cabeçalho, clicar novamente na seta que aparece no canto inferior direito, e, escolher uma das fitofisionomias listadas)\n2ª ETAPA - Estimar a área correspondente de cada fragmento com vegetação nativa. Lançar as áreas no item 18.1 de acordo com o estágio sucessional (inicial, intermediário ou avançado).\n3ª ETAPA - Verificar o número de fragmentos com vegetação nativa presentes no imóvel rural, conferindo no campo e a partir das imagens de satélite, (item 18.2).\n4ª ETAPA - Verificar se algum fragmento de vegetação nativa tem conexão com a vegetação nativa de imoveis rurais vizinhos. Caso afirmativo, marcar a opção \"sim\" no item 18.3.                                                                                                                                                                                                                                                      5ª ETAPA - Verificar se todos os fragmentos com vegetação nativa estão protegidos do pastoreio (com cercamento se necessário) e do fogo (presença de aceiros com manutenção anual). Caso afirmativo, marcar a opção \"sim\" no item 18.4.\n "]
{"$rows_empty":12}
[null,"BIOMA MATA ATLÂNTICA - Estágio avançado\n1. estratificação definida com a formação de três estratos: dossel, sub-dossel e sub-bosque;\n2. dossel superior a 12 (doze) metros de altura e com ocorrência frequente de árvores emergentes;\n3. sub-bosque normalmente menos expressivo do que no estágio intermediário;\n4. menor densidade de cipós e arbustos em relação ao estágio intermediário;\n5. riqueza e abundância de epífitas, especialmente nas Florestas Ombrófilas;\n6. trepadeiras geralmente lenhosas, com maior frequência e riqueza de espécies na Floresta Estacional;\n7. serapilheira presente variando em função da localização;\n8. espécies lenhosas com distribuição diamétrica de grande amplitude com DAP médio superior a 18 (dezoito) centímetros.\n"]
{"$rows_empty":7}
[null,"BIOMA MATA ATLÂNTICA - Estágio intermediário\n1. estratificação incipiente com formação de dois estratos: dossel e sub-bosque;\n2. predominância de espécies arbóreas formando um dossel definido entre 5 (cinco) e 12 (doze) metros de altura, com redução gradativa da densidade de arbustos e arvoretas;\n3. presença marcante de cipós;\n4. maior riqueza e abundância de epífitas em relação ao estágio inicial, sendo mais abundantes nas Florestas Ombrófilas;\n5. trepadeiras, quando presentes, podem ser herbáceas ou lenhosas;\n6. serapilheira presente variando de espessura de acordo com as estações do ano e a localização;\n7. espécies lenhosas com distribuição diamétrica de moderada amplitude com DAP médio entre 10 (dez) centímetros e 20 (vinte) centímetros.\n"]
[]
[]
[]
[]
[]
[]
[null,"BIOMA MATA ATLÂNTICA - Estágio Inicial\n1. ausência de estratificação definida;\n2. predominância de indivíduos jovens de espécies arbóreas, arbustivas e cipós, formando um adensamento (paliteiro) com altura de até 5 (cinco) metros;\n3. espécies lenhosas com distribuição diamétrica de pequena amplitude com DAP médio de até 10 (dez) centímetros;\n4. espécies pioneiras abundantes;\n5. dominância de poucas espécies indicadoras;\n6. epífitas, se existentes, são representadas principalmente por líquens, briófitas e pteridófitas com baixa diversidade;\n7. serapilheira, quando existente, forma uma fina camada, pouco decomposta, contínua ou não;\n8. trepadeiras, se presentes, geralmente herbáceas.\n\n"]
[]
[]
[]
[]
[]
[]
[19,"ADEQUAÇÃO DAS ÁREAS DE PRESERVAÇÃO PERMANENTE (APPs) DO IMÓVEL RURAL"]
[null,"OBJETIVO\nVerificar se o uso e ocupação do solo nas APPs está em conformidade com o Novo Código Florestal, e verificar o estado de conservação das APPs (entorno de nascentes e corpos d’água).\nAPLICAÇÃO\n1ª ETAPA - O lançamento dos dados é feito automaticamente no item 19.1, a partir da identificação do uso e ocupação do solo nas APPs (item 9 do questionário).  \n2ª ETAPA - Verificar no campo e na imagem de satélite o percentual das APPs efetivamente protegidas e com bom estado de conservação (item19.2)."]
[]
[]
[]
[]
[]
[]
[20,"ADEQUAÇÃO DA RESERVA LEGAL (RL) DO IMÓVEL RURAL"]
[null,"OBJETIVO\nAvaliar o cumprimento da exigência de Reserva Legal (RL) no imóvel rural, conforme o Novo Código Florestal. Verificar também se o imóvel rural possui área com vegetação nativa excedente à exigência para RL (considerado como um ativo ambiental). \nAPLICAÇÃO\nA Verificação do cumprimento da RL é feita automaticamente para imóveis com área menor que 4 Módulos Fiscais (para as regiões Sul, Sudeste, parte do Centro Oeste e Nordeste), no campo \"Áreas de/para RL não passíveis de recomposição\". Para os demais imóveis rurais (>4MF), o preenchimento não será feito de forma automátca, utilizando-se os campos do item 20.1: \"Área de RL fora do imóvel rural\" (Se a RL, ou parte da RL, estiver localizada fora do imóvel rural); \"Áreas de/para RL que necessitam de recomposição \" (se a RL estiver localizada dentro do imóvel rural, verificar se a mesma possui alguma área que necessita de recomposição); \"Áreas de/para RL não passíveis de recomposição\".\n\n"]
{"$rows_empty":7}
[21,"DIVERSIFICAÇÃO DA PAISAGEM AGROSSILVIPASTORIL NO IMÓVEL RURAL"]
[null,"OBJETIVO\nVerificar a diversificação da paisagem na escala de lavouras e talhões, e na escala do imóvel rural e seu entorno.\nAPLICAÇÃO\n1ª ETAPA - Avaliar, em cada talhão descrito no item 8 do questionário, o grau de adoção de práticas que auxiliem na indução da agrobiodiversidade (culturas intercalares, consórcios, integração LP, LPF, PF, policultivos, SAFs, adubação verde, roçadas em faixas alternadas, presença de barreiras vegetais no talhão, presença de corredores ecológicos no talhão, rotação de culturas, ativação da biologia do solo; diminuição dos distúrbios para a atividade biológica, como, por exemplo, uso indiscriminado de pesticidas e de adubos de alta solubilidade, mecanização intensa e pressão de monocultivos). O preenchimento do item 21.1 poderá ser realizado de forma similar ao item 16.1 do indicador 16 (grau de adoção de práticas conservacionistas).\n2ª ETAPA - A diversificação da paisagem na escala do imóvel rural é aferida automaticamente, por meio da avaliação da diversidade das fitofisionomias dos remanescentes de vegetação nativa, e da diversificação do uso do solo no imóvel rural, por meio de uma adaptação do índice de Shannon-Wiever. \n3ª ETAPA - O grau de diversificação do uso e ocupação do imóvel e das áreas no seu entorno é avaliado, ao considerar a proporção de cultivos e usos similares ao longo das áreas fronteiriças, com o objetivo de verificar se ocorre pressão de monocultivos. Se for identificado uma alta proporção das áreas limítrofes ao imóvel rural com o mesmo uso do solo (acima de 70%), marcar \"sim\" no item 21.3.\n"]
{"$rows_empty":10}
[null,"\nROTAÇÃO DE CULTURAS - A rotação de culturas consiste em alternar, anualmente, espécies vegetais, numa mesma área agrícola. As espécies escolhidas podem ter, ao mesmo tempo, propósito comercial e de recuperação do solo. A seleção de espécies baseia-se na diversidade botânica. Plantas com diferentes sistemas radiculares, hábitos de crescimento e exigências nutricionais podem ter efeito na interrupção dos ciclos de pragas e doenças. A diversidade de plantas influencia na diversidade da microbiota do solo, permitindo maior resiliência dos sistemas de produção.\nAGROFLORESTAS OU SISTEMAS DE POLICULTIVOS - Agrofloresta é a denominação do sistema de produção onde são introduzidas árvores e arbustos em áreas de produção agrícola ou pecuária. Dentro desse sistema estão reunidas diversas técnicas citadas acima, como: culturas em faixa, quebra-vento, culturas intercalares e rotação de culturas. Além das vantagens específicas a cada uma dessas técnicas, o uso mais amplo de espécies arbóreas otimiza o uso do espaço vertical do agroecossistema, reciclando nutrientes absorvidos pelas raízes profundas por meio da queda de folhas. \nCONSORCIAÇÃO - É o cultivo de duas ou mais espécies anuais e/ou perenes em uma mesma área em sistema de policultivo. O plantio nesse sistema é feito procurando distribuir o espaço da lavoura o mais conveniente possível, buscando uma baixa competição entre plantas pelos fatores de produção como luz, água e nutrientes. Assim, as características agronômicas de cada uma das culturas envolvidas na consorciação como o ciclo vegetativo, as épocas de cultivo, que devem ser distintas, e o porte das plantas devem ser considerados no planejamento da distribuição delas nas linhas de plantio.                                                                FAIXAS COM VEGETAÇÃO NATURAL, ROÇADAS ALTERNADAS - explanação no indicador 16.\nCULTURAS INTERCALARES - explanação no indicador 16"]

{"sheet":"1 QUESTIONÁRIO","index":1,"n_rows":202,"n_cols":10,"rows_kept":202,"merged":[[2,1,2,2],[32,1,32,3],[56,2,56,5],[58,2,58,3],[60,2,60,3],[64,1,64,6],[66,1,66,4],[68,1,68,5],[69,2,69,3],[70,1,70,8],[71,1,71,4],[73,1,73,6],[74,1,74,2],[74,4,74,6],[75,1,75,2],[76,1,76,2],[77,1,77,2],[78,1,78,2],[79,1,79,2],[80,1,80,2],[81,1,81,2],[82,1,82,2],[83,1,83,2],[84,1,84,6],[85,1,85,6],[86,1,86,2],[86,4,86,6],[87,1,87,2],[88,1,88,2],[89,1,89,2],[89,7,90,7],[90,1,90,2],[91,1,91,2],[92,1,92,2],[92,5,92,6],[93,1,93,8],[95,1,95,2],[95,4,95,6],[96,1,96,2],[97,1,97,2],[98,1,98,2],[98,5,98,6],[99,1,99,2],[101,1,101,5],[102,1,102,2],[104,1,104,6],[106,1,106,3],[107,1,107,3],[108,1,108,3],[109,1,109,3],[112,1,112,3],[112,5,112,6],[113,1,113,3],[113,5,113,6],[114,1,114,5],[115,1,115,8],[116,2,116,3],[119,1,119,6],[122,2,122,3],[125,2,125,3],[128,2,128,3],[129,1,129,8],[130,1,131,7],[132,1,133,7],[134,1,135,7],[175,1,175,6],[180,1,180,5],[181,1,181,5],[183,1,184,5],[183,6,184,6],[186,1,186,6],[198,1,198,7],[201,1,201,7]]}
[]
[null,"ISA",null,"QUESTIONÁRIO"]
[null,"ISBN 978-85-99764-26-8"]
[1,"CROQUI DO IMÓVEL RURAL (CAR)"]
{"$rows_empty":28}
[null,"Preencher todos os campos em amarelo"]
[]
[2,"DATA "]
[]
[3,"COLABORADOR(A)"]
[null,"Nome"]
[]
[null,"CPF"]
[]
[4,"BENEFICIÁRIO/A"]
[null,"Nome"]
[]
[null,"CPF / CNPJ"]
[]
[null,"Idade do/a responsavel e/ou proprietário/a (anos)"]
[]
[5,"LOCALIZAÇÃO E IDENTIFICAÇÃO DO IMÓVEL RURAL"]
[null,"Geolocalização (coordenadas graus decimais) "]
[{"$nulls":7},"Proprietário"]
[null,"Nome do município",null,null,"Estado",null,null,"Posseiro"]
[{"$nulls":7},"Assentado"]
[null,"Nome do curso d'água principal mais próximo do imóvel rural",{"$nulls":5},"Arrendatário"]
[{"$nulls":7},"Parceiro"]
[6,"POSSE DA TERRA",{"$nulls":5},"Usufrutuário"]
[null,null,"Escolha uma opção ao clicar no campo ao lado",{"$nulls":4},"sim"]
[null,"Sucessão - processo sucessório da gestão do imóvel rural em andamento*",{"$nulls":5},"não"]
[null,null,"Escolha uma opção  ",null,"*Envolvimento dos filhos nos negócios; participação dos filhos em cursos de capacitação."]
[null,"Participação da mulher na gestão do imóvel rural"]
[null,null,"Escolha uma opção  "]
[7,"DESCRIÇÃO DO IMÓVEL RURAL"]
[null,"Nome do imóvel rural"]
[]
[null,"Área (ha)"]
[]
[null,"Tamanho do módulo fiscal no município (ha)",{"$nulls":3},"Módulos Fiscais"]
[{"$nulls":5},{"$f":"'3 RELATÓRIO'!G10","v":""}]
[null,"Enquadramento como Agricultura Familiar ( verificar se tem CAF)"]
[null,null,"Escolha uma opção  "]
[null,"Áreas não contíguas ao imóvel rural e/ou áreas de arrendamento que integram a renda do produtor"]
[null,"Identificação dos locais",{"$nulls":3},"Área (ha)"]
[]
[8,"USO E OCUPAÇÃO DO SOLO NO IMÓVEL RURAL "]
[null,"Descrição (Questionário)",null,"Uso atual Área (ha) ","Proporção em relação a área total%",{"$nulls":4},"                 "]
[null,"Lavouras permanentes",null,null,{"$f":"(D76/'3 RELATÓRIO'!$G$9)","v":{"$error":"#DIV/0!"}}]
[null,"Lavouras temporárias",null,null,{"$f":"(D77/'3 RELATÓRIO'!$G$9)","v":{"$error":"#DIV/0!"}}]
[null,"Pastagens",null,null,{"$f":"(D78/'3 RELATÓRIO'!$G$9)","v":{"$error":"#DIV/0!"}}]
[null,"Silvicultura",null,null,{"$f":"(D79/'3 RELATÓRIO'!$G$9)","v":{"$error":"#DIV/0!"}}]
[null,"Área não agrícola",null,null,{"$f":"(D80/'3 RELATÓRIO'!$G$9)","v":{"$error":"#DIV/0!"}}]
[null,"Pousio",null,null,{"$f":"(D81/'3 RELATÓRIO'!$G$9)","v":{"$error":"#DIV/0!"}},"Verificação"]
[null,"Espelho/cursos d'água",null,null,{"$f":"(D82/'3 RELATÓRIO'!$G$9)","v":{"$error":"#DIV/0!"}}]
[null,"Vegetação nativa",null,null,{"$f":"(D83/'3 RELATÓRIO'!$G$9)","v":{"$error":"#DIV/0!"}}]
[null,"Áreas inaproveitáveis*",null,null,{"$f":"(D84/'3 RELATÓRIO'!$G$9)","v":{"$error":"#DIV/0!"}},{"$f":"IF(H84>0,(H84/'3 RELATÓRIO'!$G$9),\"\")","v":""},"Total (ha)",{"$f":"SUM(D76:D84)","v":{"v":0,"d":"0.00"}}]
[null,"*Vossorocas e outras áreas que no momento da avaliação são inaproveitáveis para atividades econômicas"]
[9,"USO E OCUPAÇÃO DO SOLO / APP NO IMÓVEL RURAL (CAR)"]
[null,"Descrição (CAR)",null,"Uso CAR (ha) ","Proporção em relação a área total%"]
[null,"Área correspondente ao uso consolidado",null,{"$f":"SUM(D76:D80,D84)","v":{"v":0,"d":"0.00"}},{"$f":"D88/'1 QUESTIONÁRIO'!$G$92","v":{"$error":"#DIV/0!"}}]
[null,"Uso não consolidado / outros usos",null,{"v":0,"d":"0.00"},{"$f":"D89/'1 QUESTIONÁRIO'!$G$92","v":{"$error":"#DIV/0!"}}]
[null,"Pousio",null,{"$f":"D81","v":{"v":0,"d":"0.00"}},{"$f":"D90/'1 QUESTIONÁRIO'!$G$92","v":{"$error":"#DIV/0!"}},null,null,"Diferença entre a área descrita no Imóvel Rural e a área do CAR"]
[null,"Espelho/cursos d'água",null,{"$f":"D82","v":{"v":0,"d":"0.00"}},{"$f":"D91/'1 QUESTIONÁRIO'!$G$92","v":{"$error":"#DIV/0!"}}]
[null,"Vegetação nativa",null,{"$f":"D83","v":{"v":0,"d":"0.00"}},{"$f":"D92/'1 QUESTIONÁRIO'!$G$92","v":{"$error":"#DIV/0!"}},"Total (ha)",{"$f":"D88+D90+D91+D92+D89","v":{"v":0,"d":"0.00"}},{"$f":"1-'1 QUESTIONÁRIO'!G92/'1 QUESTIONÁRIO'!H84","v":{"$error":"#DIV/0!"}}]
[null,"Servidão administrativa*",{"$nulls":3},"Nª de módulos Fiscais",null,{"$f":"+'1 QUESTIONÁRIO'!G92/'1 QUESTIONÁRIO'!B68","v":{"$error":"#DIV/0!"}}]
[null,"* Estrada municipal, Ferrovia, área de infraestrutura pública; área de utilidade pública; reservatório e entorno de reservatório  p/ abastecimento ou geração de energia"]
[null,"ÁREAS DE PRESERVAÇÃO PERMANENTE - APPs (CAR)"]
[{"$nulls":3},"Área (ha) ","Proporção em relação a área total (%)",null,null,"20% do imóvel rural",{"$f":"IF(B103=H96,0.2,0)","v":{"v":0,"d":"0.0%"}}]
[null,"Área total de APPs",null,null,{"$f":"IF(D97>0,D97/'1 QUESTIONÁRIO'!$G$92,0)","v":{"v":0,"d":"0.0%"}},null,null,"35% do imóvel rural ",{"$f":"IF(B103=H97,0.35,0)","v":{"v":0,"d":"0.0%"}}]
[null,"Área da APP a ser recuperada",null,null,{"$f":"IF(D98>0,D98/'1 QUESTIONÁRIO'!$G$92,0)","v":{"v":0,"d":"0.0%"}},null,null,"80% do imóvel rural ",{"$f":"IF(B103=H98,0.8,0)","v":{"v":0,"d":"0.0%"}}]
[null,"Área de uso consolidado + vegetação nativa na APP",null,{"$f":"D97-D98","v":{"v":0,"d":"0.00"}},{"$f":"IF(D99>0,D99/'1 QUESTIONÁRIO'!$G$92,\"\")","v":""},{"$nulls":3},{"$f":"IF(B103=H99,0.8,0)","v":{"v":0.8,"d":"80.0%"}}]
[null,"*Área a ser recuperada para imóveis até 4MF",null,{"$f":"IF(AND(E98>0.1,'1 QUESTIONÁRIO'!H93<2),'1 QUESTIONÁRIO'!G92*0.1,IF(AND(E98>0.2,'1 QUESTIONÁRIO'!H93<4),'1 QUESTIONÁRIO'!G92*0.2,D98))","v":{"$error":"#DIV/0!"}}]
[10,"ÁREA DE RESERVA LEGAL (RL) "]
[null,"Escolha uma opção ao clicar no campo abaixo"]
[]
[null,"Área com vegetação nativa excedente à area exigida para RL no imóvel rural",{"$nulls":4},{"$f":"IF(D92>'2 INDICADORES'!D392,'1 QUESTIONÁRIO'!D92-'2 INDICADORES'!D392,0)","v":{"v":0,"d":"0.00"}},{"$f":"SUM(I96:I99)","v":{"v":0.8,"d":"80.0%"}}]
[11,"RECURSOS HÍDRICOS NO IMÓVEL RURAL"]
[{"$nulls":4},"Quantidade"]
[null,"Cursos d´água "]
[null,"Nascentes e olhos d'água perenes*"]
[null,"Lagos e lagoas naturais"]
[null,"Represas"]
[null,"* Afloramento natural do lençol freático que apresenta perenidade e dá início a um curso d'água"]
[null,"Fonte de água utilizada no imóvel rural:"]
[null,"Superficial",{"$nulls":3},"Escolha uma opção  "]
[null,"Subterrânea*",{"$nulls":3},"Escolha uma opção  "]
[null,"* Nascentes, cisternas, poço tubular (artesiano)"]
[null,"Problemas relacionados à qualidade e disponibilidade de água (para consumo humano e atividades)"]
[null,null,"Escolha uma opção  "]
[null,"Especificar"]
[]
[12,"REGULARIZAÇÃO AMBIENTAL DO IMÓVEL RURAL"]
[null,"Possui regularização do uso da água (outorga ou uso insignificante)"]
[null,"Outorga; ou cadastro de uso insignificante; ou cadastro na campanha \"água: faça uso legal\"; ou cadastro de pequeno núcleo populacional rural."]
[null,null,"Escolha uma opção  "]
[null,"Possui licenciamento ambiental ou certidão de não passível ou AAF "]
[null,"Certidão de não passível (dispensa de licenciamento), Autorização Ambiental de Funcionamento (AAF), Licenciamento Ambiental."]
[null,null,"Escolha uma opção  "]
[null,"Possui regularização da Reserva Legal e das Áreas de Preservação Permanente"]
[null,"Cadastro Ambiental Rural - CAR."]
[null,null,"Escolha uma opção  "]
[13,"PONTOS CRÍTICOS - principais problemas enfrentados pelo produtor rural (na visão dele)"]
{"$rows_empty":7}
[18]
{"$rows_empty":37}
[19,"ATIVIDADE PECUÁRIA (opcional)"]
[]
[null,"19.1 - Utiliza pastagens plantadas para a atividade pecuária",{"$nulls":5},"caso afirmativo marque x"]
[null,"Estimativa da área, considerando áreas próprias e arrendadas (ha)"]
[]
[null,"Total de UA (Unidade Animal) do empreendimento - item 12.3 =>",{"$nulls":4},{"$f":"('2 INDICADORES'!C60*1.5)+'2 INDICADORES'!#REF!+'2 INDICADORES'!#REF!+('2 INDICADORES'!#REF!*0.75)+('2 INDICADORES'!#REF!*0.75)+('2 INDICADORES'!#REF!*0.5)+('2 INDICADORES'!#REF!*0.5)","v":{"$error":"#REF!"}}]
[null,"Estimativa da taxa média de lotação das áreas com pastagem",{"$nulls":4},{"$f":"IF(G178=\"x\",(G181/G179),\"\")","v":""}]
[]
[null,"Proporção das pastagens no imóvel rural que apresentam processo de  degradação dos solos e baixa capacidade de suporte de animais (%)"]
[]
[]
[20,"ADUBAÇÃO NITROGENADA NA LAVOURA DE MILHO (opcional)"]
[]
[null,"20.1 - Possui lavoura de milho para produção de grãos"]
[null,"Estimativa da área (ha)"]
[]
[null,"20.2 - Possui lavoura de milho para produção de silagem"]
[null,"Estimativa da área (ha)"]
[]
[null,"20.3 - Estimativa da adubação nitrogenada para a lavoura de milho (kg de N/ha)*"]
[null,"*Considerar apenas os adubos nitrogenados solúveis (NPK, ureia, sulfato de amônia, etc.)"]
[]
[null,"20.4 - Produtividade da lavoura de milho para grãos (sc/ha)*"]
[null,"Estimativa da relação: sc milho produzido (60 Kg)/kg de N via adubação/ha ",{"$nulls":6},{"$f":"IF(I189=\"x\",(I198/I195),\"\")","v":""}]
[]
[null,"20.5 - Produtividade da lavoura de milho para silagem (t/ha)*"]
[null,"Estimativa da relação: tonelada (t) de milho produzido (silagem)/kg de N via adubação/ha ",{"$nulls":6},{"$f":"IF(I192=\"x\",(I201/I195),\"\")","v":""}]

{"sheet":"2 INDICADORES","index":2,"n_rows":416,"n_cols":9,"rows_kept":416,"merged":[[0,1,1,1],[0,2,1,2],[2,1,2,2],[6,1,6,4],[7,1,7,2],[7,3,7,4],[11,1,11,2],[12,1,12,5],[12,6,12,7],[13,1,13,2],[13,6,13,7],[14,1,14,2],[15,1,15,2],[15,6,16,6],[15,7,16,7],[16,1,16,2],[17,1,17,2],[18,1,18,2],[24,1,24,4],[25,1,25,2],[25,3,25,4],[34,1,34,4],[35,1,35,4],[36,1,36,4],[37,1,37,4],[38,1,38,4],[39,1,39,4],[44,1,44,4],[46,1,46,5],[47,1,47,3],[47,4,47,5],[47,6,47,7],[48,6,48,7],[49,1,49,3],[49,4,49,5],[49,6,49,7],[50,6,50,7],[52,1,52,3],[52,4,52,5],[52,6,52,7],[53,6,53,7],[54,1,54,3],[54,4,54,5],[54,6,54,7],[55,6,55,7],[57,1,57,3],[57,4,57,5],[67,3,68,3],[85,1,86,1],[87,1,87,4],[87,5,87,7],[88,1,89,4],[88,5,89,5],[88,6,89,6],[90,2,90,4],[91,1,94,1],[91,2,91,4],[92,2,92,4],[93,2,93,4],[94,2,94,4],[95,1,95,4],[96,1,96,4],[97,1,97,5],[102,1,102,3],[102,6,102,7],[103,1,103,3],[103,6,103,7],[104,1,104,2],[104,6,104,7],[110,3,110,6],[111,1,111,2],[112,1,112,2],[113,1,113,2],[114,1,114,2],[115,1,115,2],[116,1,116,2],[117,1,117,2],[118,1,118,2],[119,1,119,2],[120,1,120,2],[120,3,120,7],[122,1,123,2],[122,3,122,6],[124,1,124,2],[125,1,125,2],[126,1,126,2],[132,1,133,2],[132,3,133,3],[132,4,133,4],[134,1,134,2],[135,1,135,2],[136,1,136,2],[137,1,137,2],[138,1,138,2],[140,1,140,2],[141,1,141,2],[142,1,142,2],[145,1,146,2],[145,3,146,3],[145,4,146,4],[145,5,146,5],[147,1,147,2],[148,1,148,2],[149,1,149,3],[154,1,155,3],[154,4,155,4],[154,5,155,5],[154,6,155,6],[156,1,156,3],[157,1,157,3],[158,1,158,3],[159,1,160,3],[159,4,160,4],[159,5,160,5],[161,1,161,3],[162,1,162,3],[163,1,163,3],[164,1,164,3],[165,1,165,3],[166,1,166,3],[167,1,167,3],[168,1,168,3],[169,1,169,3],[173,2,173,4],[174,1,175,1],[174,2,174,3],[175,2,175,3],[176,1,176,3],[177,1,177,3],[178,1,178,3],[179,1,181,1],[179,2,179,3],[180,2,180,3],[181,2,181,3],[186,3,186,4],[187,1,187,3],[188,1,188,3],[189,3,189,4],[190,1,190,3],[192,1,192,3],[194,1,194,7],[195,1,195,2],[195,4,195,7],[196,1,196,2],[197,1,197,2],[198,1,198,7],[203,3,203,4],[203,7,204,7],[204,3,204,4],[205,1,205,2],[206,1,206,2],[207,1,207,4],[208,1,208,4],[209,1,209,4],[210,1,210,4],[211,1,211,4],[212,3,212,5],[213,1,213,4],[218,1,218,3],[219,1,219,3],[220,1,220,3],[221,3,221,4],[222,1,222,3],[223,1,223,3],[241,1,241,2],[256,6,257,7],[260,1,261,1],[262,1,263,1],[264,1,265,1],[266,1,267,1],[268,1,269,1],[270,1,271,1],[272,1,273,1],[275,1,275,5],[278,1,279,1],[280,1,281,1],[282,1,283,1],[284,1,285,1],[287,1,288,1],[290,1,291,1],[292,1,292,5],[293,1,293,2],[298,1,298,2],[303,1,303,2],[304,1,304,2],[305,1,305,2],[306,1,306,2],[307,1,307,2],[308,1,308,2],[309,1,309,2],[310,1,310,2],[311,1,311,2],[312,1,312,2],[313,1,313,2],[314,1,314,2],[315,1,315,2],[316,1,316,2],[317,1,317,2],[318,1,318,2],[319,1,319,2],[322,1,322,2],[323,1,323,2],[324,1,324,2],[325,1,325,2],[326,1,326,2],[328,1,328,2],[329,1,329,2],[330,1,330,2],[333,17,333,18],[333,19,333,20],[335,1,335,2],[336,1,336,5],[337,1,337,2],[338,1,338,5],[342,2,343,2],[344,1,346,1],[348,5,348,6],[349,1,349,2],[355,3,355,4],[356,1,358,1],[356,2,356,3],[357,2,357,3],[358,2,358,3],[359,3,359,4],[360,1,361,1],[360,2,360,3],[360,6,360,7],[361,2,361,3],[363,1,363,3],[370,1,372,1],[375,1,375,3],[378,1,378,5],[379,1,379,5],[382,7,383,7],[384,1,385,1],[384,2,384,5],[385,2,385,5],[387,1,387,5],[391,1,391,2],[392,1,392,2],[392,6,393,6],[393,1,393,2],[394,1,397,1],[394,2,394,4],[395,2,395,4],[396,2,396,4],[397,2,397,4],[398,1,398,3],[402,2,403,2],[402,27,402,28],[404,1,406,1],[408,1,408,4],[408,5,408,6],[409,1,409,7],[411,1,411,3],[414,1,414,5]]}
[null,"ISA","INDICADORES"]
[]
[null,"Preencher todos os campos em amarelo"]
[]
[1,"ÍNDICES DE PRODUTIVIDADE E PREÇOS DE VENDA"]
[]
[null,"1.1 Renda bruta anual estimada de atividades agrossilvipastoris no imóvel rural "]
[null,"Descrição das atividades agrícolas, pecuárias e florestais ",null,"Valor estimado anual (R$)*"]
[{"$nulls":5},{"$f":"(D9/($D$9+$D$10+$D$11+D27+$D$28+$D$29+'2 INDICADORES'!$D$32+'2 INDICADORES'!D33))","v":{"$error":"#DIV/0!"}}]
[{"$nulls":5},{"$f":"(D10/($D$9+$D$10+$D$11+D27+$D$28+$D$29+'2 INDICADORES'!$D$32+'2 INDICADORES'!D33))","v":{"$error":"#DIV/0!"}}]
[{"$nulls":5},{"$f":"(D11/($D$9+$D$10+$D$11+$D$27+$D$28+$D$29+'2 INDICADORES'!$D$32+D33))","v":{"$error":"#DIV/0!"}}]
[null,"* Ordem decrescente (do maior para o menor)"]
[null,"1.2 Principais atividades executadas no imóvel rural"]
[null,"Descrição das atividades",{"$nulls":4},"Fator de ponderação "]
[null,"Unidades de medida (selecione a unidade)",{"$nulls":4},"> 20%",0.9]
[null,"Produtividade média atual",{"$nulls":4},"produção ou preço de venda = ao regional",0.7]
[null,"Preço médio de venda  (R$/unidade de venda)"]
[null,"Produtividade média na região*",{"$nulls":4},"< 20%",0.5]
[null,"Média de preço da região (R$/unidade de venda)*",{"$nulls":4},"< 40%",0.3]
[null,"* Base de dados  - Cooperativa no município, Emater, IBGE, etc."]
[null,"Resultado",{"$f":"IF(D16>0,FÓRMULAS!K22,0)","v":{"v":0,"d":"0.00"}},"Referência -  Depontti (2001); Correa (2007); Mattos Filho (2004); Lopez e Ridaura (2001)."]
[]
[2,"DIVERSIDADE DE RENDA"]
[]
[null,"2.1 Renda bruta anual estimada de outras atividades gerada dentro do imóvel rural* "]
[null,"Descrição das atividades",null,"Valor estimado no ano (R$)"]
[{"$nulls":5},{"$f":"(D27/($D$9+$D$10+$D$11+$D$28+$D$29+'2 INDICADORES'!$D$32+D27+D33))","v":{"$error":"#DIV/0!"}}]
[{"$nulls":5},{"$f":"(D28/($D$9+$D$10+$D$11+$D$28+$D$29+'2 INDICADORES'!$D$32+'2 INDICADORES'!D33+D27))","v":{"$error":"#DIV/0!"}}]
[{"$nulls":5},{"$f":"(D29/($D$9+$D$10+$D$11+$D$27+$D$28+$D$29+'2 INDICADORES'!$D$32+'2 INDICADORES'!D33))","v":{"$error":"#DIV/0!"}}]
[null,"*Turismo, artesanato, agroindústria, produção de cachaça, alimentos processados, etc."]
[null,"2.2 Renda bruta anual estimada fora imóvel rural*"]
[null,"Pensão, aposentadoria, ajudas financeiras (R$)",{"$nulls":3},{"$f":"(D32/('2 INDICADORES'!$D$9+'2 INDICADORES'!$D$10+'2 INDICADORES'!$D$11+$D$27+'2 INDICADORES'!$D$28+'2 INDICADORES'!$D$29+$D$32+'2 INDICADORES'!D33))","v":{"$error":"#DIV/0!"}}]
[null,"Outras atividades/prestação de serviços (R$)",{"$nulls":3},{"$f":"(D33/('2 INDICADORES'!$D$9+'2 INDICADORES'!$D$10+'2 INDICADORES'!$D$11+$D$27+'2 INDICADORES'!$D$28+'2 INDICADORES'!$D$29+$D$33+'2 INDICADORES'!D32))","v":{"$error":"#DIV/0!"}}]
[null,"*De todas as rendas das pessoas com vínculo direto com o estabelecimento (locação de máquinas, emprego fora do estabelecimento, prestação de serviços, etc.)"]
[null,"2.3 Diversidade de Renda",{"$nulls":3},"Proporção da renda (%)","Fator de ponderação"]
[null,"Atividades agrícolas, pecuárias e florestais realizadas no estabelecimento",{"$nulls":3},{"$f":"(F11+F10+F9)","v":{"$error":"#DIV/0!"}},{"v":2,"d":"2.0"}]
[null,"Outras atividades realizadas no estabelecimento",{"$nulls":3},{"$f":"(F29+F28+F27)","v":{"$error":"#DIV/0!"}},{"v":2,"d":"2.0"}]
[null,"Atividades realizadas fora do estabelecimento",{"$nulls":3},{"$f":"'2 INDICADORES'!F33","v":{"$error":"#DIV/0!"}},{"v":1,"d":"1.0"}]
[null,"Aposentadoria; Pensão; Ajuda Financeira; Outras fontes de renda",{"$nulls":3},{"$f":"'2 INDICADORES'!F32","v":{"$error":"#DIV/0!"}},0.3]
[null,"Verificação - ocorrência de concentração da renda agropecuária em uma única atividade (> 80% da renda total apurada dentro e fora do empreendimento rural)",{"$nulls":3},{"$f":"IF('2 INDICADORES'!F9>0.8,\"sim\",\"não\")","v":{"$error":"#DIV/0!"}},"Verificação da proporção de renda"]
[null,"Resultado",{"$f":"IF(G41<0.99,\"\",FÓRMULAS!H29)","v":{"$error":"#DIV/0!"}},"Adaptação APOIA-NovoRural (Rodrigues et al, 2003), também sugerido por Depontti (2001).",null,null,{"$f":"F36+F37+F38+F39","v":{"$error":"#DIV/0!"}}]
[]
[3,"EVOLUÇÃO PATRIMONIAL DO IMÓVEL RURAL"]
[]
[null,"3.1 Definição do período de tempo para avaliação da evolução patrimonial (anos)*",{"$nulls":3},{"v":2,"d":"2.0"}]
[null,"*Mudar em caso de reaplicação do ISA por um período inferior ou superior a 2 anos"]
[null,"3.2 Avaliação dos bens do imóvel rural"]
[null,"Construções/reformas realizadas no período recente (período de avaliação definido no item 3.1)",null,null,"Valor estimado (R$)",null,"Valor histórico*"]
[{"$nulls":4},{"v":1E-3,"d":"R$ 0.00"}]
[null,"Demais instalações e outras benfeitorias já existentes no imóvel rural*",null,null,"Valor estimado (R$)",null,"Valor histórico*"]
[{"$nulls":4},{"v":1E-3,"d":"R$ 0.00"},null,{"$f":"IF(E51>0,((1+0.04167)^'2 INDICADORES'!$F$45*E51),\" \")","v":{"v":1.0850763889000002E-3,"d":"R$ 0.00"}}]
[null,"*Depreciação vida útil 40 anos",null,"Total",{"$f":"SUM(E49:E51)","v":{"v":2E-3,"d":"R$ 0.00"}},null,{"$f":"SUM(G51:G51)","v":{"v":1.0850763889000002E-3,"d":"R$ 0.00"}}]
[null,"Máquinas e equipamentos adquiridos (período de avaliação item 3.1)",null,null,"Valor estimado (R$)",null,"Valor histórico*"]
[{"$nulls":4},{"v":1E-3,"d":"R$ 0.00"}]
[null,"Demais máquinas e equipamentos já existentes no imóvel rural*",null,null,"Valor estimado (R$)",null,"Valor histórico*"]
[{"$nulls":4},{"v":1E-3,"d":"R$ 0.00"},null,{"$f":"IF(E56>0,((1+0.052632)^'2 INDICADORES'!$F$45*E56),\" \")","v":{"v":0.001108034127424,"d":"R$ 0.00"}}]
[null,"*Depreciação vida útil 20 anos",null,"Total",{"$f":"SUM(E54:E56)","v":{"v":2E-3,"d":"R$ 0.00"}},null,{"$f":"SUM(G56:G56)","v":{"v":0.001108034127424,"d":"R$ 0.00"}}]
[null,"3.3 Avaliação semoventes / estoque*",null,null,"Valor estimado - Histórico (período de avaliação item 3.1)"]
[null,"Descrição","Quantidade (un.)","Valor estimado (R$)","Quantidade (un.)","Valor histórico (R$)"]
[null,"Estoque de grãos/produtos"]
[null,"Bovinos"]
[null,"Equinos/Muares"]
[null,"Suínos"]
[null,"Caprinos / ovinos"]
[null,"Aves"]
[null,"Outros",null,{"v":1E-3,"d":"R$ 0.00"},null,{"v":1E-3,"d":"R$ 0.00"}]
[null,"*Milho, soja, café, entre outros. ","Total",{"$f":"SUM(D60:D66)","v":{"v":1E-3,"d":"R$ 0.00"}},"Total",{"$f":"SUM(F60:F66)","v":{"v":1E-3,"d":"R$ 0.00"}}]
[null,"3.4 Irrigação (caso afirmativo preencha os dados abaixo)",null,"Histórico Área Total (ha)*"]
[null,"Tipo de irrigação","Área total (ha)"]
[{"$nulls":3},{"$f":"'2 INDICADORES'!C70","v":0}]
[]
[null,"3.5 Uso e ocupação do solo","Uso atual (ha)","Uso histórico (ha)*"]
[null,"Lavouras permanentes",{"$f":"'1 QUESTIONÁRIO'!D76","v":0},{"$f":"C73","v":{"v":0,"d":"0.00"}}]
[null,"Lavouras temporárias",{"$f":"'1 QUESTIONÁRIO'!D77","v":0},{"v":0,"d":"0.00"}]
[null,"Pastagens",{"$f":"'1 QUESTIONÁRIO'!D78","v":0},{"v":0,"d":"0.00"}]
[null,"Silvicultura",{"$f":"'1 QUESTIONÁRIO'!D79","v":0},{"v":0,"d":"0.00"}]
[null,"Área não agrícola",{"$f":"'1 QUESTIONÁRIO'!D80","v":0},{"v":0,"d":"0.00"}]
[null,"Pousio",{"$f":"'1 QUESTIONÁRIO'!D81","v":0},{"v":0,"d":"0.00"}]
[null,"Espelho/cursos d'água",{"$f":"'1 QUESTIONÁRIO'!D82","v":0},{"v":0,"d":"0.00"}]
[null,"Vegetação nativa",{"$f":"'1 QUESTIONÁRIO'!D83","v":0},{"v":0,"d":"0.00"}]
[null,"Áreas inaproveitáveis",{"$f":"'1 QUESTIONÁRIO'!D84","v":0},{"v":0,"d":"0.00"}]
[null,"Total (ha)",{"$f":"SUM(C73:C81)","v":{"v":0,"d":"0.00"}},{"$f":"SUM(D73:D81)","v":{"v":0,"d":"0.00"}}]
[null,"3.6 Valor da terra","Atual (R$/ha)","Histórico (R$/ha)*"]
[null,"Valor de referência na região "]
[null,"*período de avaliação item 3.1"]
[null,"Estimativa patrimonial do imóvel rural**","Atual (R$)","Histórico (R$)* "]
[null,null,{"$f":"FÓRMULAS!E44+FÓRMULAS!E45+FÓRMULAS!E46+FÓRMULAS!E47+FÓRMULAS!E48+'2 INDICADORES'!D67+'2 INDICADORES'!E57+'2 INDICADORES'!E52+FÓRMULAS!J52","v":{"$error":"#DIV/0!"}},{"$f":"FÓRMULAS!I44+FÓRMULAS!I45+FÓRMULAS!I46+FÓRMULAS!I47+FÓRMULAS!I48+'2 INDICADORES'!G52+'2 INDICADORES'!G57+'2 INDICADORES'!F67","v":{"$error":"#DIV/0!"}}]
[null,"** (Somatória de benfeitorias, máquinas, equipamentos, animais e valor da terra)"]
[null,"Evolução Patrimonial",{"$nulls":3},"Evolução no período (%)","Fator de ponderação"]
[]
[null,"Fator externo","Valor da terra na região",null,null,{"$f":"IF('2 INDICADORES'!C84>0,('2 INDICADORES'!C84/'2 INDICADORES'!D84-1),\"\")","v":""},0.6]
[null,"Fatores internos em relação ao imóvel rural","Benfeitorias",null,null,{"$f":"IF('2 INDICADORES'!E52>0,('2 INDICADORES'!E52/'2 INDICADORES'!G52-1),\"\")","v":{"v":0.8431882035766225,"d":"84.3%"}},{"v":1,"d":"1.0"}]
[null,null,"Equipamentos",null,null,{"$f":"IF('2 INDICADORES'!E57>0,('2 INDICADORES'!E57/'2 INDICADORES'!G57-1),\"\")","v":{"v":0.8049985560008663,"d":"80.5%"}},{"v":1,"d":"1.0"}]
[null,null,"Semoventes / Estoque de grãos",null,null,{"$f":"IF('2 INDICADORES'!D67>0,('2 INDICADORES'!D67/'2 INDICADORES'!F67-1),\"\")","v":{"v":0,"d":"0.0%"}},{"v":1,"d":"1.0"}]
[null,null,"Ampliação da área de lavoura e/ou agricultura irrigada",null,null,{"$f":"+FÓRMULAS!H52","v":{"$error":"#DIV/0!"}},{"v":1,"d":"1.0"}]
[null,"Média anual da Evolução Patrimonial total (%)",{"$nulls":3},{"$f":"(+FÓRMULAS!H56)/F45","v":{"$error":"#DIV/0!"}}]
[null,"Média anual da Evolução Patrimonial (sem valorização da terra) (%)",{"$nulls":3},{"$f":"(FÓRMULAS!H54)/F45","v":{"$error":"#DIV/0!"}}]
[]
[null,"Resultado",{"$f":"IF(FÓRMULAS!I36>1,1,FÓRMULAS!I36)","v":{"$error":"#DIV/0!"}},"Adaptação APOIA-NovoRural (Rodrigues et al, 2003); Gitman (1987)."]
[]
[4,"GRAU DE ENDIVIDAMENTO"]
[{"$nulls":5},"% dívidas/valor pat.","Fator de ponderação"]
[null,"4.1 Valor da dívida financeira em relação à estimativa patrimonial",{"$nulls":3},"0-7,5%","07 - 1 (y = 0,04x + 0,7)"]
[null,"Valor Total - financiamentos e outros compromissos financeiros ",{"$nulls":3},"7,5-30%","1 - 01 (y = -0,04x + 1,3)"]
[null,"Total de dívidas/valor patrimonial estimado (%)",null,null,{"$f":"E104/C87","v":{"$error":"#DIV/0!"}},">30%",0.1]
[null,"Resultado",{"$f":"FÓRMULAS!G63","v":{"$error":"#DIV/0!"}},"Adaptação APOIA-NovoRural (Rodrigues et al, 2003), também sugerido por Depontti (2001)."]
[]
[5,"SERVIÇOS BÁSICOS DISPONÍVEIS PARA O IMÓVEL RURAL"]
[]
[null,"5.1 Total de residências no imóvel rural"]
[{"$nulls":3},"Escolha uma opção: 1 (atende satisfatoriamente); 0,5 (parcialmente); 0 (inexistente)           "]
[null,"5.2 Serviços básicos disponíveis",null,"Residência rural (1)","Outras residências","Fator de ponderação"]
[null,"Disponibilidade de água (quantidade e qualidade)",{"$nulls":3},"1,0 ou 3,0**"]
[null,"Acesso a energia elétrica",{"$nulls":3},{"v":1,"d":"1.0"}]
[null,"Acesso regular para escoamento da produção",{"$nulls":3},{"v":1,"d":"1.0"}]
[null,"Acesso ao serviço de saúde*",{"$nulls":3},{"v":1,"d":"1.0"}]
[null,"Acesso regular ao transporte escolar",{"$nulls":3},{"v":1,"d":"1.0"}]
[null,"Segurança no campo ",{"$nulls":3},{"v":1,"d":"1.0"}]
[null,"Internet ",{"$nulls":3},{"v":1,"d":"1.0"}]
[null,"Coleta pública de lixo",{"$nulls":3},{"v":1,"d":"1.0"}]
[null,"* Produtor atendido pelo Programa Saúde da Família - PSF ",null,"** Se o produtor tem problemas de escasses de água (item 10.6 do questionário) o peso será = 3,0"]
[null,"Resultado Parcial",{"$f":"IF('1 QUESTIONÁRIO'!B117=\"sim\",(FÓRMULAS!H72/10),(FÓRMULAS!H72/8))","v":{"v":0,"d":"0.00"}},"Adaptação APOIA-NovoRural (Rodrigues et al, 2003)."]
[null,"5.3 Produção própria de alimentos (para imóveis rurais menores que 4 MF)",null,"Escolha uma opção: 1 (atende satisfatoriamente); 0,5 (parcialmente); 0 (inexistente)           "]
[{"$nulls":3},"Residência rural (1)","Outras residências","Fator de ponderação"]
[null,"Hortaliças, grãos e tubérculos",{"$nulls":3},{"v":1,"d":"1.0"}]
[null,"Pomar",{"$nulls":3},{"v":1,"d":"1.0"}]
[null,"Criação de animais (carne, leite, ovos)",{"$nulls":3},{"v":1,"d":"1.0"}]
[null,"Resultado Parcial",{"$f":"IF('1 QUESTIONÁRIO'!F68>4,\"\",FÓRMULAS!F84/3)","v":""},"Referência - Correa (2007)."]
[null,"Resultado",{"$f":"IF(C128=\"\",C122,(((C122*2)+C128)/3))","v":{"v":0,"d":"0.00"}}]
[]
[6,"ESCOLARIDADE & CURSOS DIRECIONADOS ÀS PRINCIPAIS ATIVIDADES"]
[{"$nulls":3},"Marque o nº de pessoas em cada campo"]
[null,"6.1 Grau de escolaridade ",null,"Integrantes da família com vínculo direto","Trabalhadores permanentes"]
[]
[null,"Número de adultos no imóvel rural",{"$nulls":3},"Fator de ponderação"]
[null,"Menos de 9 anos de estudo",{"$nulls":3},0.7]
[null,"Ensino Fundamental completo",{"$nulls":3},{"v":1,"d":"1.0"}]
[null,"Ensino Médio completo",{"$nulls":3},1.2]
[null,"Curso superior",{"$nulls":3},1.5]
[{"$nulls":3},"Marque o nº de pessoas em cada campo"]
[null,"6.2 Cursos direcionados às principais atividades geradas no imóvel rural",null,"Integrantes da família com vínculo direto","Trabalhadores permanentes"]
[null,"Capacitação curta temporada*",{"$nulls":3},0.5]
[null,"Capacitação longa temporada**",{"$nulls":3},0.8]
[null,"* nº de pessoas que fizeram cursos de especialização direcionados às atividades.",null,null,"** nº de pessoas que fizeram cursos técnicos em agropecuária ou afins. "]
[{"$nulls":3},"Marque o nº de pessoas em cada campo"]
[null,"6.3 Frequência da rede de ensino dos dependentes",null,"Dependentes (6 a 18 anos) dos integrantes***","Dependentes (6 a 18 anos) de trabalhadores residentes***","Fator de ponderação"]
[]
[null,"Número de dependentes no imóvel rural***"]
[null,"Frequenta rede de ensino ",{"$nulls":3},{"v":1,"d":"1.0"}]
[null,"*** Dependentes que residem no estabelecimento (até o 2º grau)."]
[null,"Resultado",{"$f":"IF(FÓRMULAS!K97>1,1,FÓRMULAS!K97)","v":{"$error":"#DIV/0!"}},"Referência: Calorio (1997), Correa (2007) e Rodrigues et al. (2003)."]
[]
[7,"OCUPAÇÃO & EMPREGO"]
[{"$nulls":4},"Marque o nº de pessoas em cada campo"]
[null,"7.1 Cumprimento da Legislação Trabalhista",null,null,"Contratação efetiva ","Contratação temporária ","Fator de ponderação"]
[]
[null,"Número de funcionários no imóvel rural"]
[null,"Registro de funcionários (carteira de trabalho)",{"$nulls":4},{"v":1,"d":"1.0"}]
[null,"Pagamento de hora extra / banco de horas* / ausência de hora extra",{"$nulls":4},{"v":1,"d":"1.0"}]
[null,"7.2 Adoção de benefícios / observância das recomendações/determinações do Ministério do Trabalho",null,null,"Contratação efetiva ","Contratação temporária "]
[]
[null,"Acima de 1 salário mínimo",{"$nulls":4},{"v":1,"d":"1.0"}]
[null,"Auxílio alimentação",{"$nulls":4},{"v":1,"d":"1.0"}]
[null,"Auxílio moradia",{"$nulls":4},{"v":1,"d":"1.0"}]
[null,"Auxílio educação e transporte",{"$nulls":4},{"v":1,"d":"1.0"}]
[null,"Participação nos lucros",{"$nulls":4},{"v":5,"d":"5.0"}]
[null,"Seguro contra acidentes",{"$nulls":4},{"v":3,"d":"3.0"}]
[null,"Acesso a lazer",{"$nulls":4},{"v":1,"d":"1.0"}]
[null,"Espaço para cultivo de alimentos ",{"$nulls":4},{"v":3,"d":"3.0"}]
[null,"* Permitido em contrato sindical."]
[null,"Resultado",{"$f":"IF(FÓRMULAS!H105>1,1,FÓRMULAS!H105)","v":{"v":0.7,"d":"0.70"}},"Adaptação APOIA-NovoRural (Rodrigues et al, 2003)."]
[]
[8,"GESTÃO DO EMPREENDIMENTO"]
[null,null,"Escolha uma opção: 1 (atende satisfatoriamente); 0,5 (parcialmente); 0 (inexistente)           \t\t\t         ",null,null,"Fator de ponderação"]
[null,"8.1 Controle administrativo","Fluxo de caixa (receita/despesa)",null,null,{"v":1,"d":"1.0"}]
[null,null,"Custo de produção das atividades",null,null,{"v":1,"d":"1.0"}]
[null,"8.2 Acesso à assistência técnica (particular ou pública)*",{"$nulls":3},{"v":1,"d":"1.0"}]
[null,"8.3 Participação - formas associativas - ativa (1) ou passiva (0,5)",{"$nulls":3},{"v":1,"d":"1.0"}]
[null,"8.4 Regularização ambiental (Uso da água, CAR e Licenciamento)**",{"$nulls":3},{"v":2,"d":"2.0"}]
[null,"8.5 Acesso as linhas de financiamento ","Utiliza crédito para investimento",null,null,0.4]
[null,null,"Utiliza crédito para custeio",null,null,0.4]
[null,null,"Utiliza crédito para comercialização",null,null,0.2]
[null,"* Não considerar assistência técnica de revendas de insumos.",null,"** Verificar item 12 do Questionário"]
[null,"Resultado",{"$f":"((+E175*F175+E176*F176+E177+E178+E179*2+E180*F180+E181*F181+E182*F182)/7)","v":{"v":0,"d":"0.00"}},"Referência: Correa (2007)."]
[]
[9,"COMERCIALIZAÇÃO & INOVAÇÃO "]
[null,"9.1 Comercialização",null,"Escolha uma opção",null,"Fator de ponderação"]
[null,"Busca informação para comercialização / diversificar compradores  ",{"$nulls":3},0.4]
[null,"Gera produtos certificados e/ou mercado institucional",{"$nulls":3},0.4]
[null,"9.2 Inovação",null,"Escolha uma opção"]
[null,"Adoção de técnicas inovadoras*",{"$nulls":3},0.3]
[null,"Descrição "]
[null,"Capacidade de inovação ou liderança na comunidade",{"$nulls":3},0.4]
[null,"Descrição "]
[null,"* Conceito, ideia, prática ou tecnologia, percebidas como nova pelo indivíduo e/ou grupo social. Conhecimento científico e tecnológico transformados em boas práticas."]
[null,"Práticas regenerativas (opcional)",null,"Escolha uma opção  ","Caso afirmativo, qual a proporção da área de produção que adota esta prática (%)"]
[null,"Uso de bioinsumos nas áreas de produção agropecuária"]
[null,"Uso de plantas de cobertura / plantas perenes para sombreamento**"]
[null,"** Estratégias para cobertura permanente do solo; aumentar a biodiversidade e/ou bem estar animal"]
[null,"Resultado",{"$f":"IF(FÓRMULAS!F126>1,1,FÓRMULAS!F126)","v":{"v":0,"d":"0.00"}}]
[]
[10,"GERENCIAMENTO DE RESÍDUOS E EFLUENTES GERADOS NO IMÓVEL RURAL"]
[]
[{"$nulls":3},"Escolha uma opção ao clicar no campo abaixo",{"$nulls":3},"Fator de ponderação"]
[{"$nulls":3},"Residência rural (1)",null,"Outras residências"]
[null,"10.1.Esgoto residências - destinação",{"$nulls":4},{"$f":"FÓRMULAS!M141","v":{"$error":"#DIV/0!"}},{"v":1,"d":"1.0"}]
[null,"10.2.Lixo domiciliar e das atividades - destinação",{"$nulls":4},{"$f":"FÓRMULAS!M147","v":{"$error":"#DIV/0!"}},{"v":1,"d":"1.0"}]
[null,"Preenchimento obrigatório",{"$nulls":3},"Dados: (%)"]
[null,"10.3.Resíduos sólidos orgânicos - compostagem e/ou reaproveitamento no campo",{"$nulls":5},{"v":1,"d":"1.0"}]
[null,"Deixar o campo em branco quando não houver geração de efluentes líquidos e/ou gasosos",{"$nulls":3},"Dados: (%)"]
[null,"10.4.Efluentes líquidos (quando existentes) - tratamento / destinação adequada ",{"$nulls":4},{"$f":"IF(ISBLANK(F211),FÓRMULAS!$K$134,\" \")","v":"Não se aplica"},{"v":1,"d":"1.0"}]
[null,"10.5.Efluentes gasosos (quando existentes) - tratamento / destinação adequada ",{"$nulls":4},{"$f":"IF(ISBLANK(F212),FÓRMULAS!$K$134,\" \")","v":"Não se aplica"},{"v":1,"d":"1.0"}]
[null,"* Estação de tratamento; biodigestor; compostagem; etc.",null,"Escolha uma opção"]
[null,"10.6 Imóvel rural possui pontos críticos com relação à gestão de resíduos e efluentes"]
[null,"Caso afirmativo - Especificar"]
[null,"Resultado",{"$f":"IF(FÓRMULAS!H134=0,0.7,+FÓRMULAS!F135)","v":{"v":0.7,"d":"0.70"}},"Adaptação APOIA-NovoRural (Rodrigues et al, 2003)."]
[]
[11,"SEGURANÇA DO TRABALHO REFERENTE AO USO DE AGROTÓXICOS"]
[{"$nulls":4},"Número de pessoas","Fator de ponderação"]
[null,"Quantas pessoas fazem o manuseio de agrotóxicos",{"$nulls":3},{"v":1,"d":"1.0"}]
[null,"Quantas pessoas utilizam EPI adequadamente",{"$nulls":3},{"v":1,"d":"1.0"}]
[{"$nulls":3},"Escolha uma opção"]
[null,"Armazenamento adequado das embalagens",{"$nulls":3},{"v":1,"d":"1.0"},"sim"]
[null,"Devolução das embalagens de agrotóxicos",{"$nulls":3},{"v":1,"d":"1.0"},"não"]
[null,"Resultado",{"$f":"FÓRMULAS!G154","v":{"v":0.7,"d":"0.70"}},"Adaptação APOIA-NovoRural (Rodrigues et al, 2003)."]
[]
[12,"CAPACIDADE PRODUTIVA DO SOLO"]
[]
[null,"Descrição do talhão "]
[{"$nulls":4},"Resultado"]
[null,"Teor de argila",null,"dag kg-1 (%) Argila",{"$f":"IF(ISBLANK(C231),0,IF(C231<=15,FÓRMULAS!H159,IF(AND(C231>15,C231<35),FÓRMULAS!H160,IF(AND(C231>=35,C231<=60),FÓRMULAS!H161,IF(C231>60,FÓRMULAS!H162)))))","v":{"v":0,"d":"0.00"}}]
[null,"Matéria Orgânica",null,"(dag kg-1)",{"$f":"IF(FÓRMULAS!M170>1,1,IF(FÓRMULAS!M170<0,0,FÓRMULAS!M170))","v":{"v":0,"d":"0.00"}}]
[null,"P disponível",null,"(mg dm-3) (Mehlich-1)",{"$f":"IF(FÓRMULAS!F209>1,1,IF(FÓRMULAS!F209<0,0,FÓRMULAS!F209))","v":{"v":0,"d":"0.00"}}]
[null,"Ca trocável",null,"(cmolc dm-3)",{"$f":"IF(ISBLANK(C234),0,IF(FÓRMULAS!I232>1,1,IF(FÓRMULAS!I232<0,0,FÓRMULAS!I232)))","v":{"v":0,"d":"0.00"}}]
[null,"Mg trocável",null,"(cmolc dm-3)",{"$f":"IF(ISBLANK(C235),0,IF(FÓRMULAS!I247>1,1,IF(FÓRMULAS!I247<0,0,FÓRMULAS!I247)))","v":{"v":0,"d":"0.00"}}]
[null,"K trocável",null,"(mg dm-3)",{"$f":"IF(ISBLANK(C236),0,IF(FÓRMULAS!I263>1,1,IF(FÓRMULAS!I263<0,0,FÓRMULAS!I263)))","v":{"v":0,"d":"0.00"}}]
[null,"Acidez ativa (pH)",null,"Índice",{"$f":"IF(ISBLANK(C237),0,IF(FÓRMULAS!I280>1,1,IF(FÓRMULAS!I280<0,0,FÓRMULAS!I280)))","v":{"v":0,"d":"0.00"}}]
[null,"Al trocável",null,"(cmolc dm-3)",{"$f":"IF(C238>2,0,IF(ISBLANK(C238),0,IF(FÓRMULAS!H296>1,1,IF(FÓRMULAS!H296<0,0,FÓRMULAS!H296))))","v":{"v":0,"d":"0.00"}}]
[null,"CTC efetiva",null,"(cmolc dm-3)",{"$f":"IF(ISBLANK(C239),0,IF(FÓRMULAS!H313>1,1,IF(FÓRMULAS!H313<0,0,FÓRMULAS!H313)))","v":{"v":0,"d":"0.00"}}]
[null,"Saturação por bases",null,"(%)",{"$f":"IF(C240>61,1,IF(ISBLANK(C240),0,IF(FÓRMULAS!H330>1,1,IF(FÓRMULAS!H330<0,0,FÓRMULAS!H330))))","v":{"v":0,"d":"0.00"}}]
[null,"Resultado Parcial",{"$f":"AVERAGE(E232,E233,E240)","v":{"v":0,"d":"0.00"}}]
[null,"Avaliação da biologia do solo - BioAS* (opcional)"]
[null,"Arilsulfatase",null,"(mg p-nitrofenol kg-1 h-1)"]
[null,"Betaglicosidase",null,"(mg p-nitrofenol kg-1 h-1)"]
[null,"Matéria Orgânica (0-10cm)",null,"(dag kg-1)","Resultado"]
[null,"IQS Biológico ",null,"Índice",{"$f":"IF(C246>0,C246,\"\")","v":""}]
[null,"Índice Armaz. nutrientes",null,"Índice"]
[null,"Índice Sup. nutrientes",null,"Índice"]
[null,"IQS Químico",null,"Índice"]
[null,"IQS FertBio",null,"Índice"]
[null,"Resultado Parcial",{"$f":"C246","v":{"v":0,"d":"0.00"}}]
[null,"* Bioanálise do Solo (Embrapa)"]
[null,"Resultado",{"$f":"IF(C251>0,(2*C241+C251)/3,C241)","v":{"v":0,"d":"0.00"}},"Análise de regressão gerada pelo programa SigmaPlot."]
[null,"Adaptação da interpretação de análises de solos da EMBRAPA (2003) e interpretação de análises de solos pela Comissão de Fertilidade do Solo do Estado de Minas Gerais."]
[]
[13,"QUALIDADE DA ÁGUA"]
[{"$nulls":6},"*Adaptação CALLISTO et al., 2002 - Aplicação de um protocolo de avaliação rápida de habitats em atividades de ensino e pesquisa."]
[null,"13.1 Avaliação dos ecossistemas aquáticos nos trechos de coleta de amostras de água*"]
[]
[null,null,"Localização ","Escolha uma opção  ",null,null,"Fator de ponderação"]
[null,"Tipo de ocupação das margens do corpo d'água ","Montante",null,null,{"$f":"SUM((IF('2 INDICADORES'!D261=FÓRMULAS!L370,4,0))+(IF('2 INDICADORES'!D261=FÓRMULAS!L371,2,0)))","v":{"v":0,"d":"0.0"}},{"v":4,"d":"4.0"},{"$f":"'2 INDICADORES'!G261*'2 INDICADORES'!F261","v":{"v":0,"d":"0.0"}}]
[null,null,"Jusante",null,null,{"$f":"SUM((IF('2 INDICADORES'!D262=FÓRMULAS!L370,4,0))+(IF('2 INDICADORES'!D262=FÓRMULAS!L371,2,0)))","v":{"v":0,"d":"0.0"}},{"v":4,"d":"4.0"},{"$f":"'2 INDICADORES'!G262*'2 INDICADORES'!F262","v":{"v":0,"d":"0.0"}}]
[null,"Alterações antrópicas","Montante",null,null,{"$f":"SUM((IF('2 INDICADORES'!D263=FÓRMULAS!L373,4,0))+(IF('2 INDICADORES'!D263=FÓRMULAS!L374,2,0)))","v":{"v":0,"d":"0.0"}},{"v":2,"d":"2.0"},{"$f":"'2 INDICADORES'!G263*'2 INDICADORES'!F263","v":{"v":0,"d":"0.0"}}]
[null,null,"Jusante",null,null,{"$f":"SUM((IF('2 INDICADORES'!D264=FÓRMULAS!L373,4,0))+(IF('2 INDICADORES'!D264=FÓRMULAS!L374,2,0)))","v":{"v":0,"d":"0.0"}},{"v":2,"d":"2.0"},{"$f":"'2 INDICADORES'!G264*'2 INDICADORES'!F264","v":{"v":0,"d":"0.0"}}]
[null,"Sombreamento a partir da cobertura vegetal no leito ","Montante",null,null,{"$f":"SUM((IF('2 INDICADORES'!D265=FÓRMULAS!L376,4,0))+(IF('2 INDICADORES'!D265=FÓRMULAS!L377,2,0)))","v":{"v":0,"d":"0.0"}},{"v":4,"d":"4.0"},{"$f":"'2 INDICADORES'!G265*'2 INDICADORES'!F265","v":{"v":0,"d":"0.0"}}]
[null,null,"Jusante",null,null,{"$f":"SUM((IF('2 INDICADORES'!D266=FÓRMULAS!L376,4,0))+(IF('2 INDICADORES'!D266=FÓRMULAS!L377,2,0)))","v":{"v":0,"d":"0.0"}},{"v":4,"d":"4.0"},{"$f":"'2 INDICADORES'!G266*'2 INDICADORES'!F266","v":{"v":0,"d":"0.0"}}]
[null,"Erosão próxima e/ou nas margens do corpo d'água e assoreamento em seu leito","Montante",null,null,{"$f":"SUM((IF('2 INDICADORES'!D267=FÓRMULAS!L379,4,0))+(IF('2 INDICADORES'!D267=FÓRMULAS!L380,2,0)))","v":{"v":0,"d":"0.0"}},{"v":4,"d":"4.0"},{"$f":"'2 INDICADORES'!G267*'2 INDICADORES'!F267","v":{"v":0,"d":"0.0"}}]
[null,null,"Jusante",null,null,{"$f":"SUM((IF('2 INDICADORES'!D268=FÓRMULAS!L379,4,0))+(IF('2 INDICADORES'!D268=FÓRMULAS!L380,2,0)))","v":{"v":0,"d":"0.0"}},{"v":4,"d":"4.0"},{"$f":"'2 INDICADORES'!G268*'2 INDICADORES'!F268","v":{"v":0,"d":"0.0"}}]
[null,"Transparência da água","Montante",null,null,{"$f":"SUM((IF('2 INDICADORES'!D269=FÓRMULAS!L382,4,0))+(IF('2 INDICADORES'!D269=FÓRMULAS!L383,2,0)))","v":{"v":0,"d":"0.0"}},{"v":3,"d":"3.0"},{"$f":"'2 INDICADORES'!G269*'2 INDICADORES'!F269","v":{"v":0,"d":"0.0"}}]
[null,null,"Jusante",null,null,{"$f":"SUM((IF('2 INDICADORES'!D270=FÓRMULAS!L382,4,0))+(IF('2 INDICADORES'!D270=FÓRMULAS!L383,2,0)))","v":{"v":0,"d":"0.0"}},{"v":3,"d":"3.0"},{"$f":"'2 INDICADORES'!G270*'2 INDICADORES'!F270","v":{"v":0,"d":"0.0"}}]
[null,"Odor da água","Montante",null,null,{"$f":"SUM((IF('2 INDICADORES'!D271=FÓRMULAS!L385,4,0))+(IF('2 INDICADORES'!D271=FÓRMULAS!L386,2,0)))","v":{"v":0,"d":"0.0"}},{"v":2,"d":"2.0"},{"$f":"'2 INDICADORES'!G271*'2 INDICADORES'!F271","v":{"v":0,"d":"0.0"}}]
[null,null,"Jusante",null,null,{"$f":"SUM((IF('2 INDICADORES'!D272=FÓRMULAS!L385,4,0))+(IF('2 INDICADORES'!D272=FÓRMULAS!L386,2,0)))","v":{"v":0,"d":"0.0"}},{"v":2,"d":"2.0"},{"$f":"'2 INDICADORES'!G272*'2 INDICADORES'!F272","v":{"v":0,"d":"0.0"}}]
[null,"Tipo de fundo","Montante",null,null,{"$f":"SUM((IF('2 INDICADORES'!D273=FÓRMULAS!L388,4,0))+(IF('2 INDICADORES'!D273=FÓRMULAS!L389,2,0)))","v":{"v":0,"d":"0.0"}},{"v":4,"d":"4.0"},{"$f":"'2 INDICADORES'!G273*'2 INDICADORES'!F273","v":{"v":0,"d":"0.0"}}]
[null,null,"Jusante",null,null,{"$f":"SUM((IF('2 INDICADORES'!D274=FÓRMULAS!L388,4,0))+(IF('2 INDICADORES'!D274=FÓRMULAS!L389,2,0)))","v":{"v":0,"d":"0.0"}},{"v":4,"d":"4.0"},{"$f":"'2 INDICADORES'!G274*'2 INDICADORES'!F274","v":{"v":0,"d":"0.0"}}]
[]
[null,"13.2 Avaliação da qualidade da água superficial (opcional)"]
[null,"Descrição dos locais das coletas da água"]
[{"$nulls":5},"Resultado","Fator de ponderação"]
[null,"pH da água","Montante",null,"Unidade",{"$f":"IF(D279>0,FÓRMULAS!B375,\"\")","v":""},{"v":1,"d":"1.0"}]
[null,null,"Jusante",null,"Unidade",{"$f":"IF(D280>0,FÓRMULAS!C375,\"\")","v":""},{"v":1,"d":"1.0"}]
[null,"Coliformes Termotolerantes","Montante",null,"(UFC 100 mL-1)",{"$f":"IF(D281=\"\",\"\",FÓRMULAS!B384)","v":""},{"v":3,"d":"3.0"}]
[null,null,"Jusante",null,"(UFC 100 mL-1)",{"$f":"IF(D282=\"\",\"\",FÓRMULAS!C384)","v":""},{"v":3,"d":"3.0"}]
[null,"Nitrato Total","Montante",null,"(mg L-1 de NO3)",{"$f":"IF(D283=\"\",\"\",FÓRMULAS!B401)","v":""},{"v":2,"d":"2.0"}]
[null,null,"Jusante",null,"(mg L-1 de NO3)",{"$f":"IF(D284=\"\",\"\",FÓRMULAS!C401)","v":""},{"v":2,"d":"2.0"}]
[null,"Turbidez da água","Montante",null,"Unidade (UNT)",{"$f":"IF(D285=\"\",\"\",FÓRMULAS!B393)","v":""},{"v":4,"d":"4.0"}]
[null,null,"Jusante",null,"Unidade (UNT)",{"$f":"IF(D286=\"\",\"\",FÓRMULAS!C393)","v":""},{"v":4,"d":"4.0"}]
[]
[null,"Avaliação do Ecossistema Aquático","Montante",{"$f":"(H261+H263+H265+H267+H269+H271+H273)/92","v":{"v":0,"d":"0.00"}},null,null,{"v":4,"d":"4.0"}]
[null,null,"Jusante",{"$f":"(H262+H264+H266+H268+H270+H272+H274)/92","v":{"v":0,"d":"0.00"}},null,null,{"v":4,"d":"4.0"}]
[]
[null,"Resultado Parcial Qualidade da água superficial","Montante",{"$f":"+FÓRMULAS!L405","v":{"v":0,"d":"0.00"}}]
[null,null,"Jusante",{"$f":"+FÓRMULAS!L406","v":{"v":0,"d":"0.00"}}]
[null,"13.3 Avaliação da qualidade da água subterrânea / consumo humano (opcional)"]
[null,"Descrição dos locais da coleta da amostra da água"]
[{"$nulls":4},"Resultado","Fator de ponderação"]
[null,"pH da água",null,"Unidade",{"$f":"IF(C296>0,FÓRMULAS!B418,\"\")","v":""},{"v":1,"d":"1.0"}]
[null,"Coliformes Termotolerantes",null,"(UFC 100 mL-1)",{"$f":"IF(C297=\"\",\"\",FÓRMULAS!B424)","v":""},{"v":1,"d":"1.0"}]
[null,"Nitrato Total",null,"(mg L-1 de NO3)",{"$f":"IF(C298=\"\",\"\",FÓRMULAS!B432)","v":""},{"v":1,"d":"1.0"}]
[null,"Resultado parcial  - Qualidade da água subterrânea",null,null,{"$f":"IF(AND(C296>0),AVERAGE(E296,E297,E298),\"\")","v":""}]
[null,"Resultado",{"$f":"IF(E299=\"\",FÓRMULAS!F411,(((FÓRMULAS!F411*2)+E299)/3))","v":{"v":0,"d":"0.00"}}]
[]
[14,"RISCO DE CONTAMINAÇÃO DA ÁGUA POR AGROTÓXICOS"]
[null,"14.1 Potencial de contaminação do produto",{"$nulls":3},"Para incluir mais produtos clique aqui"]
[null,"Nome comercial do produto (selecione)"]
[null,"Descrição da cultura "]
[null,"Área aplicada (ha)"]
[null,"Volume aplicado L/ha ou kg/ha "]
[null,"Volume total aplicado por produto",null,{"$f":"+D307*D306","v":{"v":0,"d":"0.0"}},{"$f":"+E307*E306","v":{"v":0,"d":"0.0"}},{"$f":"+F307*F306","v":{"v":0,"d":"0.0"}},{"$f":"+G307*G306","v":{"v":0,"d":"0.0"}},{"$f":"+H307*H306","v":{"v":0,"d":"0.0"}}]
[null,"Ingrediente ativo do produto ",null,{"$f":"IF(D$306>0,(HLOOKUP(D$304,'Base de dados'!$B$5:$AIN$11,$I309,0)),\"\")","v":""},{"$f":"IF(E$306>0,(HLOOKUP(E$304,'Base de dados'!$B$5:$AIN$11,$I309,0)),\"\")","v":""},{"$f":"IF(F$306>0,(HLOOKUP(F$304,'Base de dados'!$B$5:$AIN$11,$I309,0)),\"\")","v":""},{"$f":"IF(G$306>0,(HLOOKUP(G$304,'Base de dados'!$B$5:$AIN$11,$I309,0)),\"\")","v":""},{"$f":"IF(H$306>0,(HLOOKUP(H$304,'Base de dados'!$B$5:$AIN$11,$I309,0)),\"\")","v":""},2]
[null,"Toxicidade para peixes - 96h LC50 (mg L-1)",null,{"$f":"IF(D$306>0,(HLOOKUP(D$304,'Base de dados'!$B$5:$AIN$11,$I310,0)),\"\")","v":""},{"$f":"IF(E$306>0,(HLOOKUP(E$304,'Base de dados'!$B$5:$AIN$11,$I310,0)),\"\")","v":""},{"$f":"IF(F$306>0,(HLOOKUP(F$304,'Base de dados'!$B$5:$AIN$11,$I310,0)),\"\")","v":""},{"$f":"IF(G$306>0,(HLOOKUP(G$304,'Base de dados'!$B$5:$AIN$11,$I310,0)),\"\")","v":""},{"$f":"IF(H$306>0,(HLOOKUP(H$304,'Base de dados'!$B$5:$AIN$11,$I310,0)),\"\")","v":""},3]
[null,"Toxicidade - DAH (mg kg-1 dia-1)",null,{"$f":"IF(D$306>0,(HLOOKUP(D$304,'Base de dados'!$B$5:$AIN$11,$I311,0)),\"\")","v":""},{"$f":"IF(E$306>0,(HLOOKUP(E$304,'Base de dados'!$B$5:$AIN$11,$I311,0)),\"\")","v":""},{"$f":"IF(F$306>0,(HLOOKUP(F$304,'Base de dados'!$B$5:$AIN$11,$I311,0)),\"\")","v":""},{"$f":"IF(G$306>0,(HLOOKUP(G$304,'Base de dados'!$B$5:$AIN$11,$I311,0)),\"\")","v":""},{"$f":"IF(H$306>0,(HLOOKUP(H$304,'Base de dados'!$B$5:$AIN$11,$I311,0)),\"\")","v":""},4]
[null,"Índice para toxicidade do produto",null,{"$f":"IF(D$306>0,(HLOOKUP(D$304,'Base de dados'!$B$5:$AIN$11,$I312,0)),\"\")","v":""},{"$f":"IF(E$306>0,(HLOOKUP(E$304,'Base de dados'!$B$5:$AIN$11,$I312,0)),\"\")","v":""},{"$f":"IF(F$306>0,(HLOOKUP(F$304,'Base de dados'!$B$5:$AIN$11,$I312,0)),\"\")","v":""},{"$f":"IF(G$306>0,(HLOOKUP(G$304,'Base de dados'!$B$5:$AIN$11,$I312,0)),\"\")","v":""},{"$f":"IF(H$306>0,(HLOOKUP(H$304,'Base de dados'!$B$5:$AIN$11,$I312,0)),\"\")","v":""},5]
[null,"Koc",null,{"$f":"IF(D$306>0,(HLOOKUP(D$304,'Base de dados'!$B$5:$AIN$11,$I313,0)),\"\")","v":""},{"$f":"IF(E$306>0,(HLOOKUP(E$304,'Base de dados'!$B$5:$AIN$11,$I313,0)),\"\")","v":""},{"$f":"IF(F$306>0,(HLOOKUP(F$304,'Base de dados'!$B$5:$AIN$11,$I313,0)),\"\")","v":""},{"$f":"IF(G$306>0,(HLOOKUP(G$304,'Base de dados'!$B$5:$AIN$11,$I313,0)),\"\")","v":""},{"$f":"IF(H$306>0,(HLOOKUP(H$304,'Base de dados'!$B$5:$AIN$11,$I313,0)),\"\")","v":""},6]
[null,"t1/2 (DT50)",null,{"$f":"IF(D$306>0,(HLOOKUP(D$304,'Base de dados'!$B$5:$AIN$11,$I314,0)),\"\")","v":""},{"$f":"IF(E$306>0,(HLOOKUP(E$304,'Base de dados'!$B$5:$AIN$11,$I314,0)),\"\")","v":""},{"$f":"IF(F$306>0,(HLOOKUP(F$304,'Base de dados'!$B$5:$AIN$11,$I314,0)),\"\")","v":""},{"$f":"IF(G$306>0,(HLOOKUP(G$304,'Base de dados'!$B$5:$AIN$11,$I314,0)),\"\")","v":""},{"$f":"IF(H$306>0,(HLOOKUP(H$304,'Base de dados'!$B$5:$AIN$11,$I314,0)),\"\")","v":""},7]
[null,"Índice de vulnerabilidade águas subterrâneas (GUS)",null,{"$f":"IF(D306=0,\"\",IF(LOG10(D314)*(4-LOG10(D313))<=0,0,IF(OR(LOG10(D314)*(4-LOG10(D313))>0,),(LOG10(D314)*(4-LOG10(D313))),IF((LOG10(D314)*(4-LOG10(D313))>0),(LOG10(D314)*(4-LOG10(D313)))))))","v":""},{"$f":"IF(E306=0,\"\",IF(LOG10(E314)*(4-LOG10(E313))<=0,0,IF(OR(LOG10(E314)*(4-LOG10(E313))>0,),(LOG10(E314)*(4-LOG10(E313))),IF((LOG10(E314)*(4-LOG10(E313))>0),(LOG10(E314)*(4-LOG10(E313)))))))","v":""},{"$f":"IF(F306=0,\"\",IF(LOG10(F314)*(4-LOG10(F313))<=0,0,IF(OR(LOG10(F314)*(4-LOG10(F313))>0,),(LOG10(F314)*(4-LOG10(F313))),IF((LOG10(F314)*(4-LOG10(F313))>0),(LOG10(F314)*(4-LOG10(F313)))))))","v":""},{"$f":"IF(G306=0,\"\",IF(LOG10(G314)*(4-LOG10(G313))<=0,0,IF(OR(LOG10(G314)*(4-LOG10(G313))>0,),(LOG10(G314)*(4-LOG10(G313))),IF((LOG10(G314)*(4-LOG10(G313))>0),(LOG10(G314)*(4-LOG10(G313)))))))","v":""},{"$f":"IF(H306=0,\"\",IF(LOG10(H314)*(4-LOG10(H313))<=0,0,IF(OR(LOG10(H314)*(4-LOG10(H313))>0,),(LOG10(H314)*(4-LOG10(H313))),IF((LOG10(H314)*(4-LOG10(H313))>0),(LOG10(H314)*(4-LOG10(H313)))))))","v":""}]
[null,"Potencial de contaminação",null,{"$f":"IF(D306>0,(IF(OR(FÓRMULAS!C449=0.83,FÓRMULAS!C449<0.83),1,IF(OR(AND(0.83<FÓRMULAS!C449,FÓRMULAS!C449<=1.66)),2,IF(FÓRMULAS!C449>1.66,3,\"\")))),\"\")","v":""},{"$f":"IF(E306>0,(IF(OR(FÓRMULAS!D449=0.83,FÓRMULAS!D449<0.83),1,IF(OR(AND(0.83<FÓRMULAS!D449,FÓRMULAS!D449<=1.66)),2,IF(FÓRMULAS!D449>1.66,3,\"\")))),\"\")","v":""},{"$f":"IF(F306>0,(IF(OR(FÓRMULAS!E449=0.83,FÓRMULAS!E449<0.83),1,IF(OR(AND(0.83<FÓRMULAS!E449,FÓRMULAS!E449<=1.66)),2,IF(FÓRMULAS!E449>1.66,3,\"\")))),\"\")","v":""},{"$f":"IF(G306>0,(IF(OR(FÓRMULAS!F449=0.83,FÓRMULAS!F449<0.83),1,IF(OR(AND(0.83<FÓRMULAS!F449,FÓRMULAS!F449<=1.66)),2,IF(FÓRMULAS!F449>1.66,3,\"\")))),\"\")","v":""},{"$f":"IF(H306>0,(IF(OR(FÓRMULAS!G449=0.83,FÓRMULAS!G449<0.83),1,IF(OR(AND(0.83<FÓRMULAS!G449,FÓRMULAS!G449<=1.66)),2,IF(FÓRMULAS!G449>1.66,3,\"\")))),\"\")","v":""}]
[null,"EIQ Impacto ao trabalhador rural",null,{"$f":"IF(D$306>0,(HLOOKUP(D$304,'Base de dados'!$B$5:$AIN$18,$I317,0)),\"\")","v":""},{"$f":"IF(E$306>0,(HLOOKUP(E$304,'Base de dados'!$B$5:$AIN$18,$I317,0)),\"\")","v":""},{"$f":"IF(F$306>0,(HLOOKUP(F$304,'Base de dados'!$B$5:$AIN$18,$I317,0)),\"\")","v":""},null,null,12]
[null,"EIQ Impacto ao consumidor",null,{"$f":"IF(D$306>0,(HLOOKUP(D$304,'Base de dados'!$B$5:$AIN$18,$I318,0)),\"\")","v":""},{"$f":"IF(E$306>0,(HLOOKUP(E$304,'Base de dados'!$B$5:$AIN$18,$I318,0)),\"\")","v":""},{"$f":"IF(F$306>0,(HLOOKUP(F$304,'Base de dados'!$B$5:$AIN$18,$I318,0)),\"\")","v":""},null,null,13]
[null,"EIQ Impacto ao meio ambiente",null,{"$f":"IF(D$306>0,(HLOOKUP(D$304,'Base de dados'!$B$5:$AIN$18,$I319,0)),\"\")","v":""},{"$f":"IF(E$306>0,(HLOOKUP(E$304,'Base de dados'!$B$5:$AIN$18,$I319,0)),\"\")","v":""},{"$f":"IF(F$306>0,(HLOOKUP(F$304,'Base de dados'!$B$5:$AIN$18,$I319,0)),\"\")","v":""},null,null,14]
[null,"Índice Final (Quociente do Impacto Ambiental - EIQ)",null,{"$f":"IF(D$306>0,(HLOOKUP(D$304,'Base de dados'!$B$5:$AIN$18,$I320,0)),\"\")","v":""},{"$f":"IF(E$306>0,(HLOOKUP(E$304,'Base de dados'!$B$5:$AIN$18,$I320,0)),\"\")","v":""},{"$f":"IF(F$306>0,(HLOOKUP(F$304,'Base de dados'!$B$5:$AIN$18,$I320,0)),\"\")","v":""},null,null,11]
[null,"Produto banido na União Européia (X)",null,{"$f":"IF(D$306>0,(HLOOKUP(D$304,'Base de dados'!$B$5:$AIN$19,$I321,0)),\"\")","v":""},{"$f":"IF(E$306>0,(HLOOKUP(E$304,'Base de dados'!$B$5:$AIN$19,$I321,0)),\"\")","v":""},{"$f":"IF(F$306>0,(HLOOKUP(F$304,'Base de dados'!$B$5:$AIN$19,$I321,0)),\"\")","v":""},null,null,15]
[null,"14.2 Vulnerabilidade ambiental do talhão",null,"Escolha uma opção  "]
[null,"Conteúdo de argila no solo (no talhão)                        > 60% (1);     30% - 60% (2);        <30% (3)"]
[null,"Distância do curso d' água (borda do talhão)     >1.000m (1);  300 - 1.000m (2);  <300m (3)"]
[null,"Tipo de manejo do solo: Solo protegido (1); Solo sem revolvimento (2); Solo com revolvimento (3)"]
[null,"Vulnerabilidade do talhão ",null,{"$f":"IF(D307>0,(IF(OR(AND(1<=FÓRMULAS!C450,FÓRMULAS!C450<=3)),1,IF(OR(AND(3<FÓRMULAS!C450,FÓRMULAS!C450<=9)),2,IF(FÓRMULAS!C450>9,3)))),\"\")","v":""},{"$f":"IF(E307>0,(IF(OR(AND(1<=FÓRMULAS!D450,FÓRMULAS!D450<=3)),1,IF(OR(AND(3<FÓRMULAS!D450,FÓRMULAS!D450<=9)),2,IF(FÓRMULAS!D450>9,3)))),\"\")","v":""},{"$f":"IF(F307>0,(IF(OR(AND(1<=FÓRMULAS!E450,FÓRMULAS!E450<=3)),1,IF(OR(AND(3<FÓRMULAS!E450,FÓRMULAS!E450<=9)),2,IF(FÓRMULAS!E450>9,3)))),\"\")","v":""},{"$f":"IF(G307>0,(IF(OR(AND(1<=FÓRMULAS!F450,FÓRMULAS!F450<=3)),1,IF(OR(AND(3<FÓRMULAS!F450,FÓRMULAS!F450<=9)),2,IF(FÓRMULAS!F450>9,3)))),\"\")","v":""},{"$f":"IF(H307>0,(IF(OR(AND(1<=FÓRMULAS!G450,FÓRMULAS!G450<=3)),1,IF(OR(AND(3<FÓRMULAS!G450,FÓRMULAS!G450<=9)),2,IF(FÓRMULAS!G450>9,3)))),\"\")","v":""}]
[null," Risco de contaminação (1 (baixo), 2 (médio) ou 3 (alto))",null,{"$f":"IF(D307>0,(IF(OR(AND(1<=FÓRMULAS!C452,FÓRMULAS!C452<=2)),1,IF(OR(AND(2<FÓRMULAS!C452,FÓRMULAS!C452<=4)),2,IF(FÓRMULAS!C452>4,3)))),\"\")","v":""},{"$f":"IF(E307>0,(IF(OR(AND(1<=FÓRMULAS!D452,FÓRMULAS!D452<=2)),1,IF(OR(AND(2<FÓRMULAS!D452,FÓRMULAS!D452<=4)),2,IF(FÓRMULAS!D452>4,3)))),\"\")","v":""},{"$f":"IF(F307>0,(IF(OR(AND(1<=FÓRMULAS!E452,FÓRMULAS!E452<=2)),1,IF(OR(AND(2<FÓRMULAS!E452,FÓRMULAS!E452<=4)),2,IF(FÓRMULAS!E452>4,3)))),\"\")","v":""},{"$f":"IF(G307>0,(IF(OR(AND(1<=FÓRMULAS!F452,FÓRMULAS!F452<=2)),1,IF(OR(AND(2<FÓRMULAS!F452,FÓRMULAS!F452<=4)),2,IF(FÓRMULAS!F452>4,3)))),\"\")","v":""},{"$f":"IF(H307>0,(IF(OR(AND(1<=FÓRMULAS!G452,FÓRMULAS!G452<=2)),1,IF(OR(AND(2<FÓRMULAS!G452,FÓRMULAS!G452<=4)),2,IF(FÓRMULAS!G452>4,3)))),\"\")","v":""}]
[null,"14.3 Risco de contaminação"]
[null,"Identificação da cultura",null,{"$f":"D305","v":{"v":0,"d":"0.0"}}]
[null,"Área (ha)",null,{"$f":"D306","v":{"v":0,"d":"0.0"}}]
[null,"Risco máximo identificado (1 - baixo), (2 - médio) ou (3 - alto)",null,{"$f":"MAX(D327:F327,FÓRMULAS!D498:L498,FÓRMULAS!D526:L526,FÓRMULAS!D553:I553)","v":0}]
[null,"Resultado",{"$f":"IF(D306=0,1,FÓRMULAS!D558)","v":{"v":1,"d":"1.00"}},"Referência: Chaves (2010); Kovach et al. (1992)"]
[]
[15,"AVALIAÇÃO DE ÁREAS COM SOLO EM PROCESSO DE DEGRADAÇÃO"]
[{"$nulls":3},"Escolha uma opção  ","Área (ha)","Proporção (%) área total","Fator de ponderação"]
[null,"15.1 Intensidade do estágio de degradação*",{"$nulls":3},{"$f":"IF(E336>0,E336/FÓRMULAS!$I$587,\" \")","v":" "},{"v":1,"d":"1.0"},"Inicial"]
[null,"* Evidências de erosão: Inicial - redução de infiltração de água, raízes expostas; Intermediário - remoção do horizonte superficial, presença de sulcos rasos localizados; Avançado - sulcos profundos e disseminados na área, voçorocas, movimento de massa (deslocamento de um volume de solo).",{"$nulls":4},0.8,"Intermediário"]
[null,"15.2 Tendência de comportamento do processo",null,null,"Escolha uma opção  ",null,0.5,"Avançado"]
[null,"** Adoção de medidas de recuperação ou mitigação como terraceamentos, barreiras físicas, barramentos, revegetação, etc."]
[null,"Resultado",{"$f":"IF(FÓRMULAS!E576>0,(FÓRMULAS!E576*FÓRMULAS!E577*1.2)+(FÓRMULAS!E576*FÓRMULAS!F577)+(FÓRMULAS!E576*FÓRMULAS!G577*0.8),0.7)","v":{"v":0.7,"d":"0.70"}},"Adaptação APOIA-NovoRural (Rodrigues et al, 2003); Fidalski (1997)."]
[]
[16,"GRAU DE ADOÇÃO DE PRÁTICAS CONSERVACIONISTAS"]
[null,null,"Área existente (ha)","Lavoura permanente                      ","Lavoura temporária","Pastagem","Silvicultura","Fator de ponderação"]
[{"$nulls":3},{"$f":"+'1 QUESTIONÁRIO'!D76","v":0},{"$f":"+'1 QUESTIONÁRIO'!D77","v":0},{"$f":"+'1 QUESTIONÁRIO'!D78","v":0},{"$f":"+'1 QUESTIONÁRIO'!D79","v":0}]
[null,"16.1 Grau de adoção de práticas para a conservação dos solos","Suficiente",{"$nulls":4},0.9]
[null,null,"Insuficiente",{"$nulls":4},0.3]
[null,null,"Situação crítica*",{"$nulls":4},0.1]
[null,"*Situação crítica (solo/água) - ESPECIFICAR"]
[{"$nulls":3},"Escolha uma opção  ","Fator de ponderação","Verificação (questionário) =>",null,{"$f":"SUM(D345:G347)/('1 QUESTIONÁRIO'!D76+'1 QUESTIONÁRIO'!D77+'1 QUESTIONÁRIO'!D78+'1 QUESTIONÁRIO'!D79)","v":{"$error":"#DIV/0!"}}]
[null,"16.2  Estratégias conservação/reservação das águas ",null,null,{"v":1,"d":"1.0"},"Suficiente"]
[{"$nulls":4},0.4,"Insuficiente"]
[{"$nulls":4},0.1,"Situação crítica"]
[null,"Resultado",{"$f":"IF(FÓRMULAS!F590=0,\"\",(((FÓRMULAS!E590*2)+FÓRMULAS!F590)/3))","v":""},"Adaptação APOIA-NovoRural (Rodrigues et al, 2003)."]
[]
[17,"ESTADO DE CONSERVAÇÃO DAS ESTRADAS QUE CORTAM E MARGEIAM O IMÓVEL RURAL"]
[{"$nulls":3},"Porcentual das estradas (%)",null,"Fator de ponderação"]
[null,"17.1 Avaliação do estado de conservação e drenagem ","Presença de declividade transversal ou abaulamento das estradas",null,null,{"v":1,"d":"1.0"}]
[null,null,"Presença de lombadas para desvio de enxurrada",null,null,{"v":1,"d":"1.0"},{"$f":"IF(ISBLANK(E358),FÓRMULAS!M595,\" \")","v":"Não se aplica"}]
[null,null,"Presença de caixas de infiltração",null,null,{"v":1,"d":"1.0"},{"$f":"IF(ISBLANK(E359),FÓRMULAS!M595,\" \")","v":"Não se aplica"}]
[{"$nulls":3},"Porcentual das estradas (%)"]
[null,"17.2 Conservação das estradas","Presença de buracos nas estradas",null,null,{"v":1,"d":"1.0"},"Fator de ponderação"]
[null,null,"Presença de sulcos de erosão nas estradas",null,null,{"v":1,"d":"1.0"},{"v":2,"d":"2.0"},{"v":1,"d":"1.0"}]
[{"$nulls":4},"Escolha uma opção  "]
[null,"17.3 O imóvel rural possui algum ponto crítico nas estradas*",{"$nulls":3},{"v":1,"d":"1.0"}]
[null,"*Situação crítica - ESPECIFICAR"]
[null,"Resultado",{"$f":"IF(AND(E361=\"\",E357=\"\"),0,FÓRMULAS!J596)","v":{"v":0,"d":"0.00"}}]
[]
[18,"VEGETAÇÃO NATIVA - FITOFISIONOMIAS E ESTADO DE CONSERVAÇÃO"]
[]
[null,null,"Fitofisionomias (selecione)",{"$nulls":4},"Fator de ponderação"]
[null,"18.1 Estágios sucessionais da vegetação nativa","Estágio avançado (área ha)",{"$nulls":4},{"v":1,"d":"1.0"}]
[null,null,"Estágio médio (área ha)",{"$nulls":4},0.9]
[null,null,"Estágio inicial (área ha)",{"$nulls":4},0.7]
[null,"Resultado parcial",{"$f":"IF('1 QUESTIONÁRIO'!D92=0,0,FÓRMULAS!C608)","v":{"v":0,"d":"0.00"}},"Total da área com vegetação nativa",{"$f":"+'1 QUESTIONÁRIO'!D92","v":{"v":0,"d":"0.00"}},null,"                                       Verificação (CAR) =>",{"$f":"SUM(FÓRMULAS!F605:F607)","v":{"v":0,"d":"0.0%"}}]
[{"$nulls":4},"Unidade",null,"Fator de ponderação",{"v":1,"d":"1.0"}]
[null,"18.2 Nº de fragmentos com vegetação nativa (no imóvel rural) ",{"$nulls":5},{"v":1,"d":"1.0"}]
[null,"Resultado parcial",{"$f":"IF(E376=\"\",\"\",(FÓRMULAS!D616))","v":""}]
[{"$nulls":6},"Escolha uma opção  "]
[null,"18.3 Fragmento(s) tem conexão com a vegetação nativa de imóveis rurais vizinhos"]
[null,"18.4 Fragmento(s) protegidos do pastoreio e do fogo (aceiros com manutenção anual)"]
[null,"Resultado",{"$f":"IF(H374=0,0,(FÓRMULAS!B611))","v":{"v":0,"d":"0.00"}},"Adaptação APOIA-NovoRural (Rodrigues et al, 2003)."]
[]
[19,"ADEQUAÇÃO DAS ÁREAS DE PRESERVAÇÃO PERMANENTE (APPs)",{"$nulls":5},"Fator de ponderação"]
[{"$nulls":6},"Unidade (ha)"]
[null,"19.1 Uso e ocupação do solo nas APPs","Área antropizada com uso consolidado passível de ser explorada + vegetação nativa",{"$nulls":3},{"$f":"+'1 QUESTIONÁRIO'!D99","v":{"v":0,"d":"0.00"}},0.7]
[null,null,"Área com supressão vegetal com obrigação de recomposição da veg. nativa",{"$nulls":3},{"$f":"'1 QUESTIONÁRIO'!D98","v":{"v":0,"d":"0.00"}},0.1]
[{"$nulls":5},"Somatório =>",{"$f":"+G385+G386","v":{"v":0,"d":"0.00"}}]
[null,"19.2 Proporção das APPs efetivamente protegidas e com bom estado de conservação (%) ",{"$nulls":5},"Unidade (%)"]
[null,"Resultado",{"$f":"IF(G388=\"\",0,FÓRMULAS!F632)","v":{"v":0,"d":"0.00"}},"Adaptação APOIA-NovoRural (Rodrigues et al, 2003)."]
[]
[20,"ADEQUAÇÃO DA RESERVA LEGAL (RL)"]
[null,"Área de Reserva Legal (ha)  =>",null,{"$f":"('1 QUESTIONÁRIO'!G92-'1 QUESTIONÁRIO'!D93)*'1 QUESTIONÁRIO'!H104","v":{"v":0,"d":"0.00"}}]
[null,"Áreas de/para RL que necessitam de recomposição",null,{"$f":"+FÓRMULAS!L661","v":{"$error":"#DIV/0!"}},null,null,"Fator de ponderação"]
[null,"Área com vegetação nativa excedente =>",null,{"$f":"'1 QUESTIONÁRIO'!G104","v":{"v":0,"d":"0.00"}},null,"Unidade (ha)"]
[null,"20.1 Adequação da RL","Vegetação nativa excedente à RL",null,null,{"$f":"+'1 QUESTIONÁRIO'!G104","v":{"v":0,"d":"0.00"}},{"v":1,"d":"1.0"}]
[null,null,"Área de RL fora do imóvel rural*",{"$nulls":3},0.7]
[null,null,"Áreas de/para RL não passíveis de recomposição",null,null,{"$f":"IF('1 QUESTIONÁRIO'!H93<=4,'2 INDICADORES'!D392,\"\")","v":{"$error":"#DIV/0!"}},0.7]
[null,null,"Áreas de/para RL que necessitam de recomposição",{"$nulls":3},0.1]
[null,"*Reserva Legal, ou parte da Reserva Legal, localizada fora do imóvel rural.",null,null,"Verificação =>",{"$f":"(F396+F397+F398)/D392","v":{"$error":"#DIV/0!"}}]
[null,"Resultado",{"$f":"IF(F399<0.99,\"\",FÓRMULAS!F645)","v":{"$error":"#DIV/0!"}},"Adaptação APOIA-NovoRural (Rodrigues et al, 2003)."]
[]
[21,"DIVERSIFICAÇÃO DA PAISAGEM RURAL"]
[null,null,"Área existente (ha)","Lavoura permanente                      ","Lavoura temporária","Pastagem","Silvicultura","Fator de ponderação"]
[{"$nulls":3},{"$f":"+D344","v":0},{"$f":"+E344","v":0},{"$f":"+F344","v":0},{"$f":"+G344","v":0}]
[null,"21.1 Grau de adoção de práticas que auxiliam na agrobiodiversidade*","Suficiente",{"$nulls":4},0.9]
[null,null,"Insuficiente",{"$nulls":4},0.5]
[null,null,"Situação crítica**",{"$nulls":4},0.1]
[null,"**Situação crítica - ESPECIFICAR"]
[null,"*Culturas intercalares, consórcio, rotações, integração, adubação verde; roçadas em faixas alternadas; barreiras vegetais; arborização; bioinsumos; biofertilizantes.",{"$nulls":3},"Verificação (questionário) =>",null,{"$f":"SUM(D405:G407)/('1 QUESTIONÁRIO'!D76+'1 QUESTIONÁRIO'!D77+'1 QUESTIONÁRIO'!D78+'1 QUESTIONÁRIO'!D79)","v":{"$error":"#DIV/0!"}}]
[null,"** Uso de fogo em pastagens ou nas palhadas; áreas sem nenhuma cobertura vegetal; sucessões com a mesma cultura."]
[null,"Resultado parcial",{"$f":"(FÓRMULAS!M670*FÓRMULAS!C668)+(FÓRMULAS!M671*FÓRMULAS!C669)+(FÓRMULAS!M672*FÓRMULAS!C670)","v":{"$error":"#DIV/0!"}},"Adaptação APOIA-NovoRural (Rodrigues et al, 2003)."]
[null,"21.2 Índice Shannon (áreas produtivas e vegetação nativa)",null,null,{"$f":"FÓRMULAS!L687","v":{"$error":"#DIV/0!"}}]
[null,"Resultado parcial",{"$f":"FÓRMULAS!F682*(1-EXP((-FÓRMULAS!F683)*(E412*100)))","v":{"$error":"#DIV/0!"}},"Adaptação APOIA-NovoRural (Rodrigues et al, 2003)."]
[{"$nulls":6},"Escolha uma opção  "]
[null," 21.3 Ocorrência de uma alta proporção (> 70% do perímetro) de monoculturas limítrofes ao imóvel rural "]
[null,"Resultado",{"$f":"IF(G415=\"sim\",((((C411*3)+(C413*2))/5)*0.9),(((C411*3)+(C413*2))/5))","v":{"$error":"#DIV/0!"}}]

{"sheet":"3 RELATÓRIO","index":3,"n_rows":143,"n_cols":15,"rows_kept":143,"merged":[[0,1,2,2],[1,3,2,6],[44,0,64,0],[97,0,105,0],[106,0,117,0]]}
[null,"ISA"]
[{"$nulls":3},"RELATÓRIO"]
[]
[]
[null,"DATA DA APLICAÇÃO",{"$nulls":4},{"$f":"IF('1 QUESTIONÁRIO'!B36=\"\",\"\",'1 QUESTIONÁRIO'!B36)","v":""}]
[null,"TÉCNICO",{"$nulls":4},{"$f":"IF('1 QUESTIONÁRIO'!B39=\"\",\"\",'1 QUESTIONÁRIO'!B39)","v":""}]
[null,"MUNICÍPIO",{"$nulls":4},{"$f":"IF('1 QUESTIONÁRIO'!B53=\"\",\"\",'1 QUESTIONÁRIO'!B53)","v":""}]
[null,"PRODUTOR",{"$nulls":4},{"$f":"IF('1 QUESTIONÁRIO'!B44=\"\",\"\",'1 QUESTIONÁRIO'!B44)","v":""}]
[null,"Área total do estabelecimento (ha)",{"$nulls":4},{"$f":"'1 QUESTIONÁRIO'!B66","v":{"v":0,"d":"0.0"}}]
[null,"Nº de módulos fiscais rurais ",{"$nulls":4},{"$f":"IF(G9>0,('3 RELATÓRIO'!G9/'1 QUESTIONÁRIO'!B68),\"\")","v":""}]
[null,"Área (arrendamento/áreas não contíguas)",{"$nulls":4},{"$f":"'1 QUESTIONÁRIO'!F73","v":{"v":0,"d":"0.0"}},{"$nulls":3}," "]
[null,"ÍNDICE DE SUSTENTABILIDADE",{"$nulls":4},{"$f":"G97","v":{"$error":"#DIV/0!"}}]
[]
[null,"ÍNDICE DE SUSTENTABILIDADE",{"$nulls":4},{"$f":"G97","v":{"$error":"#DIV/0!"}}]
{"$rows_empty":14}
[null,"Posse da terra",{"$nulls":4},{"$f":"'1 QUESTIONÁRIO'!B57","v":{"v":0,"d":"0.0%"}}]
[null,"Tipologia do produtor(a)",{"$nulls":4},{"$f":"IF('1 QUESTIONÁRIO'!B70=\"x\",\"Agricultura Familiar\",\"Patronal\")","v":"Patronal"}]
[null,"Idade do proprietário (anos)",{"$nulls":4},{"$f":"'1 QUESTIONÁRIO'!B48","v":0}]
[]
[null,"APPs (% área total)",{"$nulls":4},{"$f":"'1 QUESTIONÁRIO'!E97","v":{"v":0,"d":"0.0%"}}]
[null,"Área a ser recuperada - APPs (% área total)",{"$nulls":4},{"$f":"FÓRMULAS!G663","v":{"$error":"#DIV/0!"}}]
[null,"Área a ser recuperada - APPs (ha)",{"$nulls":4},{"$f":"'1 QUESTIONÁRIO'!D98","v":0}]
[null,"Área com vegetação nativa excedente a RL(ha)",{"$nulls":4},{"$f":"'1 QUESTIONÁRIO'!G104","v":0}]
[null,"Nº de fragmentos com vegetação nativa",{"$nulls":4},{"$f":"+'2 INDICADORES'!E376","v":0}]
[null,"Nº de cursos d'água",{"$nulls":4},{"$f":"'1 QUESTIONÁRIO'!E107","v":0}]
[null,"Nº de nascentes",{"$nulls":4},{"$f":"'1 QUESTIONÁRIO'!E108","v":0}]
[null,"Nº de lagos e lagoas naturais",{"$nulls":4},{"$f":"'1 QUESTIONÁRIO'!E109","v":0}]
[null,"Nº de represas",{"$nulls":4},{"$f":"'1 QUESTIONÁRIO'!E110","v":0}]
[null,"Área com irrigação (ha)",{"$nulls":4},{"$f":"+'2 INDICADORES'!C71","v":0}]
[null,"Problemas com abastecimento de água",{"$nulls":4},{"$f":"IF('1 QUESTIONÁRIO'!B117=\"x\",\"sim\",\"não\")","v":"não"}]
[{"$nulls":6},"Resultados",null,"Indices"]
["Capacidade produtiva do solo","Matéria orgânica do solo (dag kg-1)",{"$nulls":4},{"$f":"'2 INDICADORES'!C232","v":{"v":0,"d":"0.00"}},0.7,{"$f":"+'2 INDICADORES'!E232","v":{"v":0,"d":"0.00"}},0.7]
[null,"Fósforo disponível (mg dm-3)",{"$nulls":4},{"$f":"'2 INDICADORES'!C233","v":{"v":0,"d":"0.00"}},0.7,{"$f":"+'2 INDICADORES'!E233","v":{"v":0,"d":"0.00"}},0.7]
[null,"Cálcio trocável (cmolc dm-3)",{"$nulls":4},{"$f":"'2 INDICADORES'!C234","v":{"v":0,"d":"0.00"}},0.7,{"$f":"+'2 INDICADORES'!E234","v":{"v":0,"d":"0.00"}},0.7]
[null,"Magnésio trocável (cmolc dm-3)",{"$nulls":4},{"$f":"'2 INDICADORES'!C235","v":{"v":0,"d":"0.00"}},0.7,{"$f":"+'2 INDICADORES'!E235","v":{"v":0,"d":"0.00"}},0.7]
[null,"Potássio trocável (mg dm-3)",{"$nulls":4},{"$f":"'2 INDICADORES'!C236","v":{"v":0,"d":"0.00"}},0.7,{"$f":"+'2 INDICADORES'!E236","v":{"v":0,"d":"0.00"}},0.7]
[null,"Acidez ativa (pH)",{"$nulls":4},{"$f":"'2 INDICADORES'!C237","v":{"v":0,"d":"0.00"}},0.7,{"$f":"+'2 INDICADORES'!E237","v":{"v":0,"d":"0.00"}},0.7]
[null,"Alumínio trocável (cmolc dm-3)",{"$nulls":4},{"$f":"'2 INDICADORES'!C238","v":{"v":0,"d":"0.00"}},0.7,{"$f":"+'2 INDICADORES'!E238","v":{"v":0,"d":"0.00"}},0.7]
[null,"CTC efetiva (cmolc dm-3)",{"$nulls":4},{"$f":"'2 INDICADORES'!C239","v":{"v":0,"d":"0.00"}},0.7,{"$f":"+'2 INDICADORES'!E239","v":{"v":0,"d":"0.00"}},0.7]
[null,"Saturação por bases (%)",{"$nulls":4},{"$f":"'2 INDICADORES'!C240","v":{"v":0,"d":"0.00"}},0.7,{"$f":"+'2 INDICADORES'!E240","v":{"v":0,"d":"0.00"}},0.7]
[null,"Arilsulfatase (mg p-nitrofenol kg-1 h-1)",{"$nulls":4},{"$f":"'2 INDICADORES'!C243","v":0}]
[null,"Betaglicosidase (mg p-nitrofenol kg-1 h-1)",{"$nulls":4},{"$f":"'2 INDICADORES'!C244","v":0}]
[null,"IQS Biológico",{"$nulls":4},{"$f":"'2 INDICADORES'!C246","v":{"v":0,"d":"0.00"}},0.7,{"$f":"G56","v":{"v":0,"d":"0.00"}}]
[null,"IQS Químico",{"$nulls":4},{"$f":"'2 INDICADORES'!C249","v":{"v":0,"d":"0.00"}}]
[null,"IQS FertBio",{"$nulls":4},{"$f":"'2 INDICADORES'!C250","v":0}]
[null,"Erosão do solo - área",{"$nulls":4},{"$f":"SUM('2 INDICADORES'!D336:D338)","v":0}]
[null,"Erosão do solo - intensidade",{"$nulls":4},{"$f":"'Base de dados'!UW28","v":0}]
[null,"Erosão do solo - tendência de comportamento ",{"$nulls":4},{"$f":"'Base de dados'!UZ28","v":0}]
[null,"Erosão do solo",{"$nulls":4},{"$f":"'2 INDICADORES'!C340","v":{"v":0.7,"d":"0.70"}},null,{"$f":"G62","v":{"v":0.7,"d":"0.70"}}]
[null,"Conservação solo/água",{"$nulls":4},{"$f":"'2 INDICADORES'!C353","v":""},null,{"$f":"G63","v":""}]
[null,"Indução agrobiodiversidade",{"$nulls":4},{"$f":"'2 INDICADORES'!C411","v":{"$error":"#DIV/0!"}},null,{"$f":"G64","v":{"$error":"#DIV/0!"}}]
[null,"Produtividade ",{"$nulls":4},{"$f":"'2 INDICADORES'!C21","v":0},null,{"$f":"G65","v":{"v":0,"d":"0.00"}}]
[null,"Capacidade produtiva do solo (subíndice)",{"$nulls":4},{"$f":"IF(I56>0,AVERAGE(I45:I46,I53,I56,I62:I65),AVERAGE(I45:I46,I53,I62:I65))","v":{"$error":"#DIV/0!"}}]
{"$rows_empty":16}
[null,"Adoção de técnicas inovadoras",{"$nulls":3},{"$f":"IF('2 INDICADORES'!C192=\"\",\"\",'2 INDICADORES'!C192)","v":""}]
[null,"Capacidade de inovação ou liderança \t",{"$nulls":3},{"$f":"IF('2 INDICADORES'!C194=\"\",\"\",'2 INDICADORES'!C194)","v":""}]
[]
[null,"Renda bruta (R$/ano)",{"$nulls":4},{"$f":"SUM('2 INDICADORES'!D9:E11)+SUM('2 INDICADORES'!D27:E29)","v":0},{"$nulls":3},"Média anual evolução patrimonial total (%)",{"$nulls":3},{"$f":"'2 INDICADORES'!F96","v":{"$error":"#DIV/0!"}}]
[null,"Renda bruta  (R$/ha/ano)",{"$nulls":4},{"$f":"+G86/('1 QUESTIONÁRIO'!B66+'1 QUESTIONÁRIO'!F73)","v":{"$error":"#DIV/0!"}},{"$nulls":3},"Média anual evol. Pat. (s/ valor. da terra) (%)",{"$nulls":3},{"$f":"'2 INDICADORES'!F97","v":{"$error":"#DIV/0!"}}]
[null,"Proporção principal atividade/renda bruta",{"$nulls":4},{"$f":"+'2 INDICADORES'!F9","v":{"$error":"#DIV/0!"}},{"$nulls":3},"Qte de agrotóxicos / área cultivada (L/ha/ano)",{"$nulls":3},{"$f":"FÓRMULAS!D562","v":""}]
[null,"Instalações e outras benfeitorias  (R$)",{"$nulls":4},{"$f":"+'2 INDICADORES'!E52","v":{"v":2E-3,"d":"R$ 0.00"}},{"$f":"G89/$G$93","v":{"$error":"#DIV/0!"}},null,null,"Índice Final EIQ cumulativo (agrotóxicos)",{"$nulls":3},{"$f":"SUM('2 INDICADORES'!D320:F320,FÓRMULAS!D490:L490,FÓRMULAS!D518:L518,FÓRMULAS!D545:I545)","v":0}]
[null,"Máquinas e Equipamentos (R$)",{"$nulls":4},{"$f":"+'2 INDICADORES'!E57","v":{"v":2E-3,"d":"R$ 0.00"}},{"$f":"G90/$G$93","v":{"$error":"#DIV/0!"}},null,null,"Identificaçao da principal atvidade agropecuária",{"$nulls":3},{"$f":"'2 INDICADORES'!D14","v":{"v":0,"d":"0.0%"}}]
[null,"Animais (semoventes) (R$)",{"$nulls":4},{"$f":"+'2 INDICADORES'!D67","v":{"v":1E-3,"d":"R$ 0.00"}},{"$f":"G91/$G$93","v":{"$error":"#DIV/0!"}},null,null,"Unidade",{"$nulls":3},{"$f":"'2 INDICADORES'!D15","v":0}]
[null,"Valor da terra na região (R$/ha)",{"$nulls":4},{"$f":"+'2 INDICADORES'!C84","v":0},{"$f":"(G92*G9)/$G$93","v":{"$error":"#DIV/0!"}},null,null,"Produtividade",{"$nulls":3},{"$f":"'2 INDICADORES'!D16","v":0}]
[null,"Estimativa Patrimonial do imóvel rural",{"$nulls":4},{"$f":"'2 INDICADORES'!C87","v":{"$error":"#DIV/0!"}},{"$nulls":3},"Participação da mulher na gestão",{"$nulls":3},{"$f":"'1 QUESTIONÁRIO'!B61","v":{"v":0,"d":"0.0%"}}]
[null,"Receita bruta anual / estimativa patrimonial",{"$nulls":4},{"$f":"G86/G93","v":{"$error":"#DIV/0!"}},{"$nulls":3},"Processo sucessório em andamento",{"$nulls":3},{"$f":"'1 QUESTIONÁRIO'!B59","v":{"v":0,"d":"0.0%"}}]
[]
[null,"Desvio - padrão",{"$f":"STDEV(G98:G108,G109:G118)","v":{"$error":"#DIV/0!"}},{"$nulls":3},{"$f":"G5","v":""}]
[null,"ÍNDICE DE SUSTENTABILIDADE",{"$nulls":4},{"$f":"AVERAGE(G98:G118)","v":{"$error":"#DIV/0!"}}]
["Aspectos socioeconômicos","1.Produtividade",{"$nulls":4},{"$f":"'2 INDICADORES'!C21","v":{"v":0,"d":"0.00"}},null,null,0.7]
[null,"2.Diversificação da renda",{"$nulls":4},{"$f":"'2 INDICADORES'!C41","v":{"$error":"#DIV/0!"}},null,null,0.7]
[null,"3.Evolução patrimonial",{"$nulls":4},{"$f":"'2 INDICADORES'!C99","v":{"$error":"#DIV/0!"}},null,null,0.7]
[null,"4.Grau de endividamento",{"$nulls":4},{"$f":"'2 INDICADORES'!C106","v":{"$error":"#DIV/0!"}},null,null,0.7]
[null,"5.Serviços básicos / Seg. alimentar",{"$nulls":4},{"$f":"'2 INDICADORES'!C129","v":{"v":0,"d":"0.00"}},null,null,0.7]
[null,"6.Escolaridade & capacitação",{"$nulls":4},{"$f":"'2 INDICADORES'!C151","v":{"$error":"#DIV/0!"}},null,null,0.7]
[null,"7.Ocupação & emprego",{"$nulls":4},{"$f":"'2 INDICADORES'!C171","v":{"v":0.7,"d":"0.70"}},null,null,0.7]
[null,"8.Gestão ",{"$nulls":4},{"$f":"'2 INDICADORES'!C184","v":{"v":0,"d":"0.00"}},null,null,0.7]
[null,"9.Comercialização & Inovação",{"$nulls":4},{"$f":"'2 INDICADORES'!C200","v":{"v":0,"d":"0.00"}},null,null,0.7]
["Aspectos ambientais","10.Gerenciamento de resíduos",{"$nulls":4},{"$f":"'2 INDICADORES'!C216","v":{"v":0.7,"d":"0.70"}},null,null,0.7]
[null,"11.Segurança do trabalho",{"$nulls":4},{"$f":"'2 INDICADORES'!C225","v":{"v":0.7,"d":"0.70"}},null,null,0.7]
[null,"12.Capacidade produtiva do solo",{"$nulls":4},{"$f":"'2 INDICADORES'!C253","v":{"v":0,"d":"0.00"}},null,null,0.7]
[null,"13.Qualidade da água",{"$nulls":4},{"$f":"'2 INDICADORES'!C300","v":{"v":0,"d":"0.00"}},null,null,0.7]
[null,"14.Risco de contaminação da água",{"$nulls":4},{"$f":"'2 INDICADORES'!C332","v":{"v":1,"d":"1.00"}},null,null,0.7]
[null,"15.Solos degradados",{"$nulls":4},{"$f":"'2 INDICADORES'!C340","v":{"v":0.7,"d":"0.70"}},null,null,0.7]
[null,"16.Práticas de conservação",{"$nulls":4},{"$f":"'2 INDICADORES'!C353","v":""},null,null,0.7]
[null,"17.Estradas",{"$nulls":4},{"$f":"'2 INDICADORES'!C366","v":{"v":0,"d":"0.00"}},null,null,0.7]
[null,"18.Vegetação nativa",{"$nulls":4},{"$f":"'2 INDICADORES'!C381","v":{"v":0,"d":"0.00"}},null,null,0.7]
[null,"19.APPs",{"$nulls":4},{"$f":"'2 INDICADORES'!C389","v":{"v":0,"d":"0.00"}},null,null,0.7]
[null,"20.Reserva Legal",{"$nulls":4},{"$f":"'2 INDICADORES'!C400","v":{"$error":"#DIV/0!"}},null,null,0.7]
[null,"21.Diversificação da paisagem",{"$nulls":4},{"$f":"'2 INDICADORES'!C416","v":{"$error":"#DIV/0!"}},null,null,0.7]
[]
[]
[{"$nulls":6},"Histórico I","Histórico II"]
[null,"ÍNDICE DE SUSTENTABILIDADE",{"$nulls":4},{"v":0.6111360048497472,"d":"0.61"},{"v":0.5452380952380951,"d":"0.55"}]
[null,"1.Produtividade",{"$nulls":4},{"v":0.6554,"d":"0.66"},0.63]
[null,"2.Diversificação da renda",{"$nulls":4},{"v":0.6338400000000001,"d":"0.63"},{"v":0.6,"d":"0.60"}]
[null,"3.Evolução patrimonial",{"$nulls":4},{"v":1,"d":"1.00"},{"v":0.7,"d":"0.70"}]
[null,"4.Grau de endividamento",{"$nulls":4},{"v":0.7,"d":"0.70"},{"v":0.7,"d":"0.70"}]
[null,"5.Serviços básicos / Seg. alimentar",{"$nulls":4},{"v":0.8,"d":"0.80"},{"v":0.8,"d":"0.80"}]
[null,"6.Escolaridade & capacitação",{"$nulls":4},{"v":0.8099999999999999,"d":"0.81"},{"v":0.6,"d":"0.60"}]
[null,"7.Ocupação & emprego",{"$nulls":4},{"v":0.5,"d":"0.50"},{"v":0.5,"d":"0.50"}]
[null,"8.Gestão ",{"$nulls":4},0.69,{"v":0.4,"d":"0.40"}]
[null,"9.Comercialização & Inovação",{"$nulls":4},{"v":0.6,"d":"0.60"},{"v":0.5,"d":"0.50"}]
[null,"10.Gerenciamento de resíduos",{"$nulls":4},0.13,0.13]
[null,"11.Segurança do trabalho",{"$nulls":4},0.35,0.35]
[null,"12.Capacidade produtiva do solo",{"$nulls":4},{"v":0.4838291666666667,"d":"0.48"},0.48]
[null,"13.Qualidade da água",{"$nulls":4},{"v":0.5371428571428571,"d":"0.54"},0.54]
[null,"14.Risco de contaminação da água",{"$nulls":4},{"v":0.3,"d":"0.30"},{"v":0.6,"d":"0.60"}]
[null,"15.Solos degradados",{"$nulls":4},{"v":0.5,"d":"0.50"},0.34]
[null,"16.Práticas de conservação",{"$nulls":4},{"v":0.6,"d":"0.60"},{"v":0.5,"d":"0.50"}]
[null,"17.Estradas",{"$nulls":4},{"v":0.5527777777777779,"d":"0.55"},{"v":0.4,"d":"0.40"}]
[null,"18.Vegetação nativa",{"$nulls":4},0.75,{"v":0.6,"d":"0.60"}]
[null,"19.APPs",{"$nulls":4},{"v":0.4816631130063966,"d":"0.48"},0.48]
[null,"20.Reserva Legal",{"$nulls":4},{"v":0.9992031872509959,"d":"1.00"},{"v":1,"d":"1.00"}]
[null,"21.Diversificação da paisagem",{"$nulls":4},0.76,{"v":0.6,"d":"0.60"}]

{"sheet":"4 PLANO ADEQUAÇÃO","index":4,"n_rows":36,"n_cols":5,"rows_kept":36,"merged":[[0,1,2,1],[1,3,2,3]]}
[null,"ISA"]
[{"$nulls":3},"PLANO DE ADEQUAÇÃO"]
[]
[]
[]
[null,"PRODUTOR",null,{"$f":"IF('1 QUESTIONÁRIO'!B44=\"\",\"\",'1 QUESTIONÁRIO'!B44)","v":""}]
[null,"MUNICÍPIO",null,{"$f":"IF('1 QUESTIONÁRIO'!B53=\"\",\"\",'1 QUESTIONÁRIO'!B53)","v":""}]
[null,"DATA DA APLICAÇÃO",null,{"$f":"IF('1 QUESTIONÁRIO'!B36=\"\",\"\",'1 QUESTIONÁRIO'!B36)","v":""}]
[]
[null,"TÉCNICO / REGISTRO PROFISSIONAL",null,{"$f":"IF('1 QUESTIONÁRIO'!B39=\"\",\"\",'1 QUESTIONÁRIO'!B39)","v":""}]
[]
[null,"ITEM","Índice","PROPOSIÇÕES","Período de execução"]
[null,{"$f":"'3 RELATÓRIO'!B107","v":"10.Gerenciamento de resíduos"},{"$f":"'3 RELATÓRIO'!G107","v":{"v":0.7,"d":"0.70"}}]
[null,{"$f":"'3 RELATÓRIO'!B112","v":"15.Solos degradados"},{"$f":"'3 RELATÓRIO'!G112","v":{"v":0.7,"d":"0.70"}}]
[null,{"$f":"'3 RELATÓRIO'!B114","v":"17.Estradas"},{"$f":"'3 RELATÓRIO'!G114","v":{"v":0,"d":"0.00"}}]
[null,{"$f":"'3 RELATÓRIO'!B108","v":"11.Segurança do trabalho"},{"$f":"'3 RELATÓRIO'!G108","v":{"v":0.7,"d":"0.70"}}]
[null,{"$f":"'3 RELATÓRIO'!B116","v":"19.APPs"},{"$f":"'3 RELATÓRIO'!G116","v":{"v":0,"d":"0.00"}}]
[null,{"$f":"'3 RELATÓRIO'!B111","v":"14.Risco de contaminação da água"},{"$f":"'3 RELATÓRIO'!G111","v":{"v":1,"d":"1.00"}}]
[null,{"$f":"'3 RELATÓRIO'!B99","v":"2.Diversificação da renda"},{"$f":"'3 RELATÓRIO'!G99","v":{"$error":"#DIV/0!"}}]
[null,{"$f":"'3 RELATÓRIO'!B113","v":"16.Práticas de conservação"},{"$f":"'3 RELATÓRIO'!G113","v":""}]
[null,{"$f":"'3 RELATÓRIO'!B104","v":"7.Ocupação & emprego"},{"$f":"'3 RELATÓRIO'!G104","v":{"v":0.7,"d":"0.70"}}]
[null,{"$f":"'3 RELATÓRIO'!B106","v":"9.Comercialização & Inovação"},{"$f":"'3 RELATÓRIO'!G106","v":{"v":0,"d":"0.00"}}]
[null,{"$f":"'3 RELATÓRIO'!B98","v":"1.Produtividade"},{"$f":"'3 RELATÓRIO'!G98","v":{"v":0,"d":"0.00"}}]
[null,{"$f":"'3 RELATÓRIO'!B115","v":"18.Vegetação nativa"},{"$f":"'3 RELATÓRIO'!G115","v":{"v":0,"d":"0.00"}}]
[null,{"$f":"'3 RELATÓRIO'!B118","v":"21.Diversificação da paisagem"},{"$f":"'3 RELATÓRIO'!G118","v":{"$error":"#DIV/0!"}}]
[null,{"$f":"'3 RELATÓRIO'!B109","v":"12.Capacidade produtiva do solo"},{"$f":"'3 RELATÓRIO'!G109","v":{"v":0,"d":"0.00"}}]
[null,{"$f":"'3 RELATÓRIO'!B102","v":"5.Serviços básicos / Seg. alimentar"},{"$f":"'3 RELATÓRIO'!G102","v":{"v":0,"d":"0.00"}}]
[null,{"$f":"'3 RELATÓRIO'!B117","v":"20.Reserva Legal"},{"$f":"'3 RELATÓRIO'!G117","v":{"$error":"#DIV/0!"}}]
[null,{"$f":"'3 RELATÓRIO'!B110","v":"13.Qualidade da água"},{"$f":"'3 RELATÓRIO'!G110","v":{"v":0,"d":"0.00"}}]
[null,{"$f":"'3 RELATÓRIO'!B103","v":"6.Escolaridade & capacitação"},{"$f":"'3 RELATÓRIO'!G103","v":{"$error":"#DIV/0!"}}]
[null,{"$f":"'3 RELATÓRIO'!B100","v":"3.Evolução patrimonial"},{"$f":"'3 RELATÓRIO'!G100","v":{"$error":"#DIV/0!"}}]
[null,{"$f":"'3 RELATÓRIO'!B105","v":"8.Gestão "},{"$f":"'3 RELATÓRIO'!G105","v":{"v":0,"d":"0.00"}}]
[null,{"$f":"'3 RELATÓRIO'!B101","v":"4.Grau de endividamento"},{"$f":"'3 RELATÓRIO'!G101","v":{"$error":"#DIV/0!"}}]
[null,"Regularização ambiental do empreendimento",{"$f":"'1 QUESTIONÁRIO'!B126","v":{"v":0,"d":"0.00"}}]
[null,"Regularização do uso da água",{"$f":"'1 QUESTIONÁRIO'!B123","v":{"v":0,"d":"0.00"}}]
[null,"Regularização da Reserva Legal",{"$f":"'1 QUESTIONÁRIO'!B129","v":{"v":0,"d":"0.00"}}]

{"sheet":"Plan1","index":5,"n_rows":0,"n_cols":0,"rows_kept":0,"hidden":true}

{"sheet":"Sheet3","index":6,"n_rows":0,"n_cols":0,"rows_kept":0,"hidden":true}

{"sheet":"Sheet4","index":7,"n_rows":0,"n_cols":0,"rows_kept":0,"hidden":true}

{"sheet":"Sheet5","index":8,"n_rows":0,"n_cols":0,"rows_kept":0,"hidden":true}

{"sheet":"Sheet6","index":9,"n_rows":0,"n_cols":0,"rows_kept":0,"hidden":true}

{"sheet":"Relatório de Assist (2)","index":10,"n_rows":48,"n_cols":19,"rows_kept":48,"hidden":true,"merged":[[0,11,0,16],[4,6,4,13],[4,15,4,16],[5,5,5,9],[5,12,5,16],[7,8,7,16],[8,8,8,16],[10,2,37,15],[38,2,38,15],[39,2,39,15],[40,2,40,15],[42,1,42,16],[45,2,45,4],[45,6,45,9],[45,11,45,15],[46,2,46,4],[46,11,46,15]]}
[{"$nulls":11},"RELATÓRIO DE ASSISTÊNCIA   TÉCNICA AO PRODUTOR RURAL ",{"$nulls":5},{"$f":"C9","v":"Visita N°"},{"$f":"D9","v":1}]
[]
[{"$nulls":10}," Formulário atualizado em: UPEC–05/01/2012"]
[]
[null,"  Produtor:",{"$nulls":12},"CPF:"]
[null,"  Município:",{"$nulls":8},"Comunidade:"]
[null,"  Convênio: ",{"$nulls":7}," META:",null," Nº Convênio:"]
[null,"  Nome  do Técnico / Matrícula:"]
[null,null,"Visita N°",1]
[{"$nulls":6},"ORIENTAÇÃO TÉCNICA (Situação Atual, Orientações e Recomendações) "]
{"$rows_empty":32}
[null,"Assinaturas"]
[]
[]
[]
[null,null,"Data",{"$nulls":5},"Técnico Responsável / Nº Conselho",null,null," Produtor"]
[null,"MOD.230-07 E MAPA/EMBRAPA",{"$nulls":9}," Formulário atualizado em: UPEC–13/03/2013"]

{"sheet":"FÓRMULAS","index":11,"n_rows":687,"n_cols":14,"rows_kept":687,"merged":[[0,1,1,2],[0,3,1,5],[3,1,3,12],[6,1,6,3],[6,5,6,7],[7,1,7,2],[7,5,8,7],[8,1,9,2],[8,3,9,3],[10,1,10,2],[11,1,11,2],[13,5,15,7],[19,7,19,8],[20,1,21,1],[20,2,20,3],[21,2,21,3],[23,1,23,2],[23,5,23,7],[24,5,27,7],[30,1,30,2],[30,5,30,8],[31,5,34,8],[42,1,42,2],[42,4,42,5],[42,8,42,9],[43,1,43,2],[43,4,43,5],[43,8,43,9],[44,1,44,2],[44,4,44,5],[44,8,44,9],[45,1,45,2],[45,4,45,5],[45,8,45,9],[46,1,46,2],[46,4,46,5],[46,8,46,9],[47,1,47,2],[47,4,47,5],[47,8,47,9],[48,4,48,5],[49,1,49,2],[49,4,49,5],[49,9,49,10],[51,9,51,10],[52,9,52,10],[53,9,53,10],[54,9,54,10],[55,9,55,10],[56,9,56,10],[56,11,56,12],[57,9,57,10],[57,11,57,12],[59,1,59,2],[59,5,59,8],[60,5,61,8],[68,1,68,2],[68,5,68,8],[69,5,70,8],[78,1,78,2],[78,5,78,8],[78,10,85,12],[79,5,80,8],[88,1,88,2],[88,5,88,10],[89,5,92,10],[93,5,94,10],[99,1,99,2],[99,5,99,7],[100,5,101,7],[112,1,112,2],[112,5,112,7],[113,5,113,7],[123,1,123,2],[123,5,123,7],[124,5,124,7],[131,1,131,2],[131,5,131,8],[132,5,132,8],[150,1,150,2],[150,5,150,7],[151,5,152,7],[156,1,156,5],[157,1,157,4],[157,5,158,5],[157,7,157,11],[158,7,158,8],[159,7,159,8],[160,7,160,8],[161,7,161,8],[164,1,164,10],[165,1,169,1],[165,2,165,3],[165,4,165,5],[165,6,169,6],[165,7,165,8],[165,9,165,10],[170,1,174,1],[170,4,170,5],[170,6,174,6],[170,7,170,8],[170,9,170,10],[175,1,175,12],[188,1,188,5],[189,1,189,4],[189,5,190,5],[197,0,197,13],[198,0,201,0],[198,1,198,2],[198,3,198,4],[198,5,198,6],[198,7,201,7],[198,8,198,9],[198,10,198,11],[198,12,198,13],[202,0,205,0],[202,1,202,2],[202,3,202,4],[202,5,202,6],[202,7,205,7],[202,8,202,9],[202,10,202,11],[202,12,202,13],[209,1,209,12],[225,1,225,2],[225,4,225,10],[226,7,226,8],[226,9,226,10],[233,1,233,6],[241,1,241,2],[241,4,241,10],[242,7,242,8],[242,9,242,10],[249,1,249,6],[257,1,257,2],[257,4,257,10],[258,7,258,8],[258,9,258,10],[265,1,265,6],[274,1,274,2],[274,4,274,8],[281,1,281,6],[290,1,290,2],[290,4,290,8],[298,1,298,6],[307,1,307,2],[307,4,307,8],[315,1,315,6],[324,1,324,2],[324,4,324,8],[325,4,325,5],[325,6,325,8],[332,1,332,6],[341,1,341,3],[342,1,344,3],[347,4,347,5],[351,4,351,5],[355,4,355,5],[361,4,361,5],[369,1,369,5],[369,6,369,9],[370,6,370,7],[370,8,370,9],[371,6,373,7],[371,8,373,9],[378,1,378,5],[378,6,378,9],[379,6,379,7],[379,8,379,9],[380,3,380,5],[380,6,384,7],[380,8,384,9],[387,1,387,5],[387,6,387,9],[388,1,388,2],[388,3,388,4],[388,6,388,7],[388,8,388,9],[389,1,389,2],[389,3,389,4],[389,6,392,7],[389,8,392,9],[390,1,390,2],[390,3,390,4],[395,1,395,5],[395,6,395,9],[396,1,396,2],[396,3,396,4],[396,6,396,7],[396,8,396,9],[397,1,397,2],[397,3,397,4],[397,6,399,7],[397,8,399,9],[398,1,398,2],[398,3,398,4],[402,1,402,5],[403,1,406,5],[408,1,408,3],[409,1,410,3],[412,1,412,2],[412,4,412,7],[413,4,413,7],[414,4,414,7],[419,1,419,2],[419,4,419,7],[420,4,420,5],[420,6,420,7],[421,4,425,5],[421,6,425,7],[427,1,427,2],[427,4,427,7],[428,4,428,5],[428,6,428,7],[429,4,433,5],[429,6,433,7],[435,1,435,3],[435,5,435,11],[436,1,437,3],[436,5,437,11],[439,1,439,2],[441,4,441,12],[446,1,446,13],[472,1,472,2],[473,1,473,2],[474,1,474,2],[475,1,475,2],[476,1,476,2],[478,1,478,2],[479,1,479,2],[480,1,480,2],[481,1,481,2],[482,1,482,2],[483,1,483,2],[484,1,484,2],[485,1,485,2],[486,1,486,2],[487,1,487,2],[488,1,488,2],[489,1,489,2],[492,1,492,2],[493,1,493,2],[494,1,494,2],[495,1,495,2],[497,1,497,2],[500,1,500,2],[501,1,501,2],[502,1,502,2],[503,1,503,2],[504,1,504,2],[506,1,506,2],[507,1,507,2],[508,1,508,2],[509,1,509,2],[510,1,510,2],[511,1,511,2],[512,1,512,2],[513,1,513,2],[514,1,514,2],[515,1,515,2],[516,1,516,2],[517,1,517,2],[520,1,520,2],[521,1,521,2],[522,1,522,2],[523,1,523,2],[525,1,525,2],[527,1,527,2],[528,1,528,2],[529,1,529,2],[530,1,530,2],[531,1,531,2],[533,1,533,2],[534,1,534,2],[535,1,535,2],[536,1,536,2],[537,1,537,2],[538,1,538,2],[539,1,539,2],[540,1,540,2],[541,1,541,2],[542,1,542,2],[543,1,543,2],[544,1,544,2],[547,1,547,2],[548,1,548,2],[549,1,549,2],[550,1,550,2],[552,1,552,2],[554,1,554,2],[555,1,555,2],[556,1,556,2],[557,1,557,2],[558,1,558,2],[559,1,559,2],[560,1,560,2],[561,1,561,2],[565,1,565,2],[565,4,565,5],[578,4,580,11],[582,1,582,2],[582,4,582,8],[585,1,586,1],[585,2,586,2],[586,4,586,7],[593,1,593,2],[593,4,593,9],[601,1,601,6],[601,10,601,13],[602,1,603,6],[602,10,602,12],[603,10,603,12],[604,10,604,12],[607,10,607,13],[608,10,608,12],[609,10,609,12],[610,10,610,12],[611,10,611,12],[612,1,614,1],[612,2,614,2],[612,3,614,5],[612,10,612,12],[613,10,613,12],[614,10,614,12],[616,1,616,2],[618,1,619,11],[620,1,621,11],[622,1,623,11],[625,1,625,3],[625,4,625,5],[626,1,626,3],[626,4,626,5],[629,1,629,3],[629,5,629,8],[630,1,630,2],[631,1,631,2],[634,1,635,3],[634,5,635,8],[637,1,637,5],[640,1,640,3],[640,5,640,8],[641,1,641,2],[642,1,642,2],[643,1,643,2],[644,1,644,2],[645,1,645,3],[646,1,646,4],[647,1,647,4],[648,1,648,4],[649,1,649,4],[650,1,650,4],[654,1,654,5],[656,1,656,9],[659,1,659,4],[659,9,659,10],[660,1,660,4],[660,8,660,10],[661,1,661,4],[662,1,662,4],[663,1,663,4],[666,1,666,2],[671,1,671,2],[675,7,675,8],[676,7,676,11],[677,7,677,8],[678,5,678,6],[678,7,678,8],[679,4,679,6],[679,7,679,8],[680,7,680,8],[681,7,681,8],[682,7,682,8],[683,5,683,6],[683,7,683,8],[684,7,684,8],[685,7,685,8],[686,7,686,8]]}
[null,"ISA",null,"FÓRMULAS"]
[]
[]
[null,"INDICADORES"]
[{"$nulls":10},"Unidades de medida"]
[{"$nulls":10},"Sc/ha"]
[1,"Fator de Ponderação",{"$nulls":3},"Fórmulas",{"$nulls":4},"Ton./ha"]
[null,"20% maior",null,0.9,null,"Fórmula (R parcial) = Yo + ax",{"$nulls":4},"Kg/ha"]
[null,"produtividade ou preço de venda = a regional",null,0.7,{"$nulls":6}," @/ha/ano"]
[{"$nulls":5},"yo",{"v":-0.3,"d":"-0.30"},{"$nulls":3},"L de leite/ha/ano"]
[null,"20% menor",null,0.5,null,"a",0.01,{"$nulls":3},"L de leite/vc/dia"]
[null,"40% menor",null,0.3,null,{"$f":"(G10+G11*(100+(FÓRMULAS!E18*100)))","v":{"$error":"#VALUE!"}},{"$f":"(G10+G11*(100+(FÓRMULAS!F18*100)))","v":{"$error":"#VALUE!"}},{"$f":"(G10+G11*(100+(FÓRMULAS!G18*100)))","v":{"$error":"#VALUE!"}},null,null,"Kg/dia"]
[{"$nulls":5},{"$f":"(G10+G11*(100+(FÓRMULAS!E19*100)))","v":{"$error":"#VALUE!"}},{"$f":"(G10+G11*(100+(FÓRMULAS!F19*100)))","v":{"$error":"#VALUE!"}},{"$f":"(G10+G11*(100+(FÓRMULAS!G19*100)))","v":{"$error":"#VALUE!"}},null,null,"Kg de alimento/kg de carne produzida"]
[{"$nulls":5},"Fórmula (resultado final) = média dos valores atribuídos no resultado parcial ",{"$nulls":4},"Leitões comercializados/porca/ano"]
[{"$nulls":10},"Ovos/galinha/ano"]
[{"$nulls":10},"Conversão Alimentar/dúzia de ovos"]
[{"$nulls":10},"Conversão Alimentar/Kg"]
[null,"Variação do item 1.3 em relação ao item 1.5",null,null,{"$f":"IF('2 INDICADORES'!D16>0,(('2 INDICADORES'!D16/'2 INDICADORES'!D18)-1),\"\")","v":""},{"$f":"IF('2 INDICADORES'!E16>0,(('2 INDICADORES'!E16/'2 INDICADORES'!E18)-1),\"\")","v":""},{"$f":"IF('2 INDICADORES'!F16>0,(('2 INDICADORES'!F16/'2 INDICADORES'!F18)-1),\"\")","v":""},{"v":1,"d":"1.0"},null,null,"Percentagem de postura"]
[null,"Variação do item 1.4 em relação ao item 1.6",null,null,{"$f":"IF('2 INDICADORES'!D17>0,(('2 INDICADORES'!D17/'2 INDICADORES'!D19)-1),\"\")","v":""},{"$f":"IF('2 INDICADORES'!E17>0,(('2 INDICADORES'!E17/'2 INDICADORES'!E19)-1),\"\")","v":""},{"$f":"IF('2 INDICADORES'!F17>0,(('2 INDICADORES'!F17/'2 INDICADORES'!F19)-1),\"\")","v":""},{"v":1,"d":"1.0"}]
[{"$nulls":4},{"v":1,"d":"1.0"},{"v":1,"d":"1.0"},{"v":1,"d":"1.0"},"Matriz de ponderação"]
[null,"Resultado parcial","Produtividade",null,{"$f":"IF(ISBLANK('2 INDICADORES'!D16),\"\",IF(FÓRMULAS!F12>1,1,FÓRMULAS!F12))","v":""},{"$f":"IF(ISBLANK('2 INDICADORES'!E16),\"\",IF(FÓRMULAS!G12>1,1,FÓRMULAS!G12))","v":""},{"$f":"IF(ISBLANK('2 INDICADORES'!F16),\"\",IF(FÓRMULAS!H12>1,1,FÓRMULAS!H12))","v":""},null,null,{"$f":"AVERAGE(FÓRMULAS!E21:G22)","v":{"$error":"#DIV/0!"}}]
[null,null,"Preço de venda",null,{"$f":"IF(ISBLANK('2 INDICADORES'!D17),\"\",IF(FÓRMULAS!F13>1,1,FÓRMULAS!F13))","v":""},{"$f":"IF(ISBLANK('2 INDICADORES'!E17),\"\",IF(FÓRMULAS!G13>1,1,FÓRMULAS!G13))","v":""},{"$f":"IF(ISBLANK('2 INDICADORES'!F17),\"\",IF(FÓRMULAS!H13>1,1,FÓRMULAS!H13))","v":""},null,null,{"$f":"IF('3 RELATÓRIO'!G87<300,FÓRMULAS!J21*0.7,FÓRMULAS!J21)","v":{"$error":"#DIV/0!"}},{"$f":"IF(J22<0,0,J22)","v":{"$error":"#DIV/0!"}}]
[]
[2,"Fator de Ponderação",{"$nulls":3},"Fórmulas",{"$nulls":3},0.3]
[null,"item 2.3","1 - (F362 *0,3)",null,null,"(1- ((F362 * 0,3) + (F372 * 0,3) + (F382 * 1) + (F392 * 2))) - 10% (se identificada a concentração de renda acima de 80% - célula I142 do questionário)",{"$nulls":3},0.3]
[null,"item 2.3","1 - (F372 *0,3)",{"$nulls":6},{"v":1,"d":"1.0"}]
[null,"item 2.3","1 - (F382 *1)",{"$nulls":6},{"v":2,"d":"2.0"}]
[null,"item 2.3","1 - (F392 *2)"]
[{"$nulls":5},{"$f":"1-(('2 INDICADORES'!F36^2*FÓRMULAS!J24)+('2 INDICADORES'!F37^2*FÓRMULAS!J25)+('2 INDICADORES'!F38^2*FÓRMULAS!J26)+('2 INDICADORES'!F39^2*FÓRMULAS!J27))","v":{"$error":"#DIV/0!"}},{"$f":"IF(AND('2 INDICADORES'!F36>70%,'2 INDICADORES'!F40=\"sim\"),F29-10%,F29)","v":{"$error":"#DIV/0!"}},{"$f":"IF(FÓRMULAS!G29<0.1,0.1,FÓRMULAS!G29)","v":{"$error":"#DIV/0!"}}]
[]
[3,"Fator de Ponderação",{"$nulls":3},"Fórmulas",{"$nulls":4},{"$f":"+FÓRMULAS!M31","v":{"$error":"#DIV/0!"}},null,{"$f":"(+(FÓRMULAS!E50-FÓRMULAS!J50)/('2 INDICADORES'!C87-'2 INDICADORES'!D87))","v":{"$error":"#DIV/0!"}}]
[null,"item 3.1",0.6,null,null,"(0,6*F109+F110+F111+F112+F113) + acréscimo da variação do balanço patrimonial (sem a valorização da terra F115) que excedeu a variação de 6% aa no período avaliado (4 anos = 26%)*",{"$nulls":4},{"$f":"+FÓRMULAS!M32","v":{"$error":"#DIV/0!"}},null,{"$f":"('2 INDICADORES'!$E$52-'2 INDICADORES'!$G$52)/('2 INDICADORES'!$C$87-'2 INDICADORES'!$D$87)","v":{"$error":"#DIV/0!"}}]
[null,"item 3.2",{"v":1,"d":"1.0"},{"$nulls":7},{"$f":"+FÓRMULAS!M33","v":{"$error":"#DIV/0!"}},null,{"$f":"('2 INDICADORES'!$E$57-'2 INDICADORES'!$G$57)/('2 INDICADORES'!$C$87-'2 INDICADORES'!$D$87)","v":{"$error":"#DIV/0!"}}]
[null,"item 3.3",{"v":1,"d":"1.0"},{"$nulls":7},{"$f":"+FÓRMULAS!M34","v":{"$error":"#DIV/0!"}},null,{"$f":"('2 INDICADORES'!$D$67-'2 INDICADORES'!$F$67)/('2 INDICADORES'!$C$87-'2 INDICADORES'!$D$87)","v":{"$error":"#DIV/0!"}}]
[null,"item 3.4",{"v":1,"d":"1.0"},{"$nulls":7},{"$f":"+FÓRMULAS!M35","v":{"$error":"#DIV/0!"}},null,{"$f":"(FÓRMULAS!J52/('2 INDICADORES'!C87-'2 INDICADORES'!D87))","v":{"$error":"#DIV/0!"}}]
[{"$nulls":5},{"$f":"(FÓRMULAS!M31*'2 INDICADORES'!G91+FÓRMULAS!M32*'2 INDICADORES'!G92+FÓRMULAS!M33*'2 INDICADORES'!G93+FÓRMULAS!M34*'2 INDICADORES'!G94+FÓRMULAS!M35*'2 INDICADORES'!G95)","v":{"$error":"#DIV/0!"}},{"$f":"IF('2 INDICADORES'!F97>26%,F36*((1+('2 INDICADORES'!F97-0.26))),F36)","v":{"$error":"#DIV/0!"}},{"$f":"IF('2 INDICADORES'!F96>0,G36,1-(0.3-10*'2 INDICADORES'!F96))","v":{"$error":"#DIV/0!"}},{"$f":"IF(H36<0,0,H36)","v":{"$error":"#DIV/0!"}},{"$nulls":3},{"$f":"M35+M34+M33+M32+M31","v":{"$error":"#DIV/0!"}}]
[null,"Aspersão",{"$nulls":6},"Verificação",null,{"$f":"SUM(FÓRMULAS!M31:M35)","v":{"$error":"#DIV/0!"}}]
[null,"Gotejamento/microaspersão"]
[null,"Pivô central"]
[null,"Outras categorias",null,"Item 3.2"]
[null,"Diversos tipos de irrigação",null,"Fórmula - VR(valor residual) = (1-T)N x VI, em que: T = taxa de depreciação; N = tempo (nº de anos); e VI = valor inicial"]
[]
[null,"Categorias",null,"Ponderação","Valor total atual",null,"Área total","Ponderação","Valor histórico",null,"Área total"]
[null,"Vegetação nativa e outros",null,{"v":1,"d":"1.00"},{"$f":"('2 INDICADORES'!C84*D44)*G44*('3 RELATÓRIO'!$G$9)","v":{"$error":"#DIV/0!"}},null,{"$f":"'1 QUESTIONÁRIO'!E80+'1 QUESTIONÁRIO'!E81+'1 QUESTIONÁRIO'!E82+'1 QUESTIONÁRIO'!E83+'1 QUESTIONÁRIO'!E84","v":{"$error":"#DIV/0!"}},{"$f":"+D44","v":{"v":1,"d":"1.00"}},{"$f":"(K44*H44)*'3 RELATÓRIO'!G9*'2 INDICADORES'!D84","v":{"$error":"#DIV/0!"}},null,{"$f":"+('2 INDICADORES'!D78+'2 INDICADORES'!D77+'2 INDICADORES'!D79+'2 INDICADORES'!D80+'2 INDICADORES'!D81)/'2 INDICADORES'!D82","v":{"$error":"#DIV/0!"}}]
[null,"Pastagens",null,{"v":1,"d":"1.00"},{"$f":"('2 INDICADORES'!C84*D45)*G45*('3 RELATÓRIO'!$G$9)","v":{"$error":"#DIV/0!"}},null,{"$f":"'1 QUESTIONÁRIO'!E78","v":{"$error":"#DIV/0!"}},{"$f":"+D45","v":{"v":1,"d":"1.00"}},{"$f":"(K45*H45)*'3 RELATÓRIO'!G9*'2 INDICADORES'!D84","v":{"$error":"#DIV/0!"}},null,{"$f":"+'2 INDICADORES'!D75/'2 INDICADORES'!D82","v":{"$error":"#DIV/0!"}}]
[null,"Lavoura temporária",null,{"v":1,"d":"1.00"},{"$f":"('2 INDICADORES'!C84*D46)*G46*('3 RELATÓRIO'!$G$9)","v":{"$error":"#DIV/0!"}},null,{"$f":"'1 QUESTIONÁRIO'!E77","v":{"$error":"#DIV/0!"}},{"$f":"+D46","v":{"v":1,"d":"1.00"}},{"$f":"K46*'3 RELATÓRIO'!G9*('2 INDICADORES'!D84*H46)","v":{"$error":"#DIV/0!"}},null,{"$f":"+'2 INDICADORES'!D74/'2 INDICADORES'!D82","v":{"$error":"#DIV/0!"}}]
[null,"Irrigação (+ R$1.000,00/ha)",null,{"v":1000,"d":"1,000.00"},{"$f":"+'3 RELATÓRIO'!G9*G47*D47","v":{"$error":"#DIV/0!"}},null,{"$f":"'2 INDICADORES'!C71/'3 RELATÓRIO'!G9","v":{"$error":"#DIV/0!"}},{"$f":"+D47","v":{"v":1000,"d":"1,000.00"}},{"$f":"+'3 RELATÓRIO'!G9*K47*H47","v":{"$error":"#DIV/0!"}},null,{"$f":"+'2 INDICADORES'!D71/'3 RELATÓRIO'!G9","v":{"$error":"#DIV/0!"}}]
[null,"Lav. perene/silvicutura",null,{"v":1,"d":"1.00"},{"$f":"('2 INDICADORES'!C84*D48)*G48*('3 RELATÓRIO'!$G$9)","v":{"$error":"#DIV/0!"}},null,{"$f":"'1 QUESTIONÁRIO'!E76+'1 QUESTIONÁRIO'!E79","v":{"$error":"#DIV/0!"}},{"$f":"+D48","v":{"v":1,"d":"1.00"}},{"$f":"K48*'3 RELATÓRIO'!G9*('2 INDICADORES'!D84*H48)","v":{"$error":"#DIV/0!"}},null,{"$f":"+('2 INDICADORES'!D73+'2 INDICADORES'!D76)/'2 INDICADORES'!D82","v":{"$error":"#DIV/0!"}}]
[{"$nulls":6},{"$f":"+G48+G46+G45+G44","v":{"$error":"#DIV/0!"}},null,null,"Histórico ",{"$f":"+K48+K46+K45+K44","v":{"$error":"#DIV/0!"}}]
[null,"Valor Total da terra",null,null,{"$f":"E44+E45+E46+E47+E48","v":{"$error":"#DIV/0!"}},null,null,"",null,{"$f":"I44+I45+I46+I47+I48","v":{"$error":"#DIV/0!"}}]
[]
[null,"Evolução decorrente da modificação do uso do solo",{"$nulls":5},{"$f":"J52/'2 INDICADORES'!C87","v":{"$error":"#DIV/0!"}},null,{"$f":"(((FÓRMULAS!G46-FÓRMULAS!K46)*'3 RELATÓRIO'!G9*'2 INDICADORES'!C84*1.1)+((FÓRMULAS!G47-FÓRMULAS!K47)*'3 RELATÓRIO'!G9*('2 INDICADORES'!C84+1000))+((FÓRMULAS!G48-FÓRMULAS!K48)*'3 RELATÓRIO'!G9*'2 INDICADORES'!C84*1.3))","v":{"$error":"#DIV/0!"}}]
[{"$nulls":9},{"$f":"('2 INDICADORES'!$C$84*FÓRMULAS!D44)*FÓRMULAS!K44*'3 RELATÓRIO'!$G$9","v":{"$error":"#DIV/0!"}}]
[null,"Evolução patrimonial (sem a valorização do preço da terra)",{"$nulls":5},{"$f":"IF('2 INDICADORES'!D87>0,('2 INDICADORES'!C87/L58-1),\"\")","v":{"$error":"#DIV/0!"}},null,{"$f":"('2 INDICADORES'!$C$84*FÓRMULAS!D45)*FÓRMULAS!K45*'3 RELATÓRIO'!$G$9","v":{"$error":"#DIV/0!"}}]
[{"$nulls":9},{"$f":"('2 INDICADORES'!$C$84*FÓRMULAS!D46)*FÓRMULAS!K46*'3 RELATÓRIO'!$G$9","v":{"$error":"#DIV/0!"}}]
[null,"Evolução patrimonial total ",{"$nulls":5},{"$f":"IF('2 INDICADORES'!C87>0,('2 INDICADORES'!C87/'2 INDICADORES'!D87-1),\"\")","v":{"$error":"#DIV/0!"}},null,{"$f":"FÓRMULAS!I47","v":{"$error":"#DIV/0!"}}]
[{"$nulls":11},{"$f":"SUM(J53:K58)","v":{"$error":"#DIV/0!"}}]
[{"$nulls":9},{"$f":"('2 INDICADORES'!$C$84*FÓRMULAS!D48)*FÓRMULAS!K48*'3 RELATÓRIO'!$G$9","v":{"$error":"#DIV/0!"}},null,{"$f":"+L57+'2 INDICADORES'!G52+'2 INDICADORES'!G57+'2 INDICADORES'!F67","v":{"$error":"#DIV/0!"}}]
[]
[4,"Fator de Ponderação",{"$nulls":3},"Fórmulas"]
[null,{"v":0,"d":"0%"},0.7,null,null,"y = 0,04x + 0,7                                                        y = -0,04x + 1,3                                                    "]
[null,"0-7,5%","y = 0,04x + 0,7"]
[null,"7,5-30%","y = -0,04x + 1,3",null,null,{"$f":"IF('2 INDICADORES'!E105=0,0.7,0)","v":{"$error":"#DIV/0!"}},{"$f":"SUM(F63:F66)","v":{"$error":"#DIV/0!"}}]
[null,"15-30%","y = -0,4x + 1,29",null,null,{"$f":"IF('2 INDICADORES'!E105>0,G64,0)","v":{"$error":"#DIV/0!"}},{"$f":"IF('2 INDICADORES'!E105>=0.075,0,H64)","v":{"$error":"#DIV/0!"}},{"$f":"0.04*('2 INDICADORES'!E105*100)+0.7","v":{"$error":"#DIV/0!"}}]
[null,">30%",0.1,null,null,{"$f":"IF('2 INDICADORES'!E105>=0.075,G65,0)","v":{"$error":"#DIV/0!"}},{"$f":"IF('2 INDICADORES'!E105>0.3,0,H65)","v":{"$error":"#DIV/0!"}},{"$f":"-0.04*('2 INDICADORES'!E105*100)+1.3","v":{"$error":"#DIV/0!"}}]
[null,">25%",0.1,null,null,{"$f":"IF('2 INDICADORES'!E105>0.3,0.1,0)","v":{"$error":"#DIV/0!"}}]
[]
[]
[5,"Fator de Ponderação",{"$nulls":3},"Fórmulas",{"$nulls":4},1]
[null,{"$f":"+'2 INDICADORES'!B113:C113","v":"Disponibilidade de água (quantidade e qualidade)"},"1 a 3",null,null,"((SOMA(D135:G143))/Nº de residências)/Nº de variáveis(9)",{"$nulls":4},0.5]
[null,{"$f":"+'2 INDICADORES'!B114:C114","v":"Acesso a energia elétrica"},{"v":1,"d":"1.0"},{"$nulls":7},0]
[null,{"$f":"+'2 INDICADORES'!B115:C115","v":"Acesso regular para escoamento da produção"},{"v":1,"d":"1.0"},null,null,{"$f":"IF(G72>0,1,0)","v":0},{"$f":"+'2 INDICADORES'!D119+'2 INDICADORES'!D116+'2 INDICADORES'!D115+'2 INDICADORES'!D114+'2 INDICADORES'!D113*I72+'2 INDICADORES'!D120+'2 INDICADORES'!D117+'2 INDICADORES'!D118","v":0},{"$f":"(('2 INDICADORES'!D113*I72+'2 INDICADORES'!D114+'2 INDICADORES'!D115+'2 INDICADORES'!D116+'2 INDICADORES'!D117+'2 INDICADORES'!D118+'2 INDICADORES'!D119)+('2 INDICADORES'!E113*I72+'2 INDICADORES'!E114+'2 INDICADORES'!E115+'2 INDICADORES'!E116+'2 INDICADORES'!E117+'2 INDICADORES'!E118+'2 INDICADORES'!E119))/H74","v":0},{"$f":"IF('1 QUESTIONÁRIO'!B117=\"sim\",3,1)","v":1}]
[null,{"$f":"+'2 INDICADORES'!B116:C116","v":"Acesso ao serviço de saúde*"},{"v":1,"d":"1.0"},null,null,{"$f":"IF(G73>0,1,0)","v":0},{"$f":"+'2 INDICADORES'!E119+'2 INDICADORES'!E116+'2 INDICADORES'!E115+'2 INDICADORES'!E114+'2 INDICADORES'!E113*I72+'2 INDICADORES'!E120+'2 INDICADORES'!E117+'2 INDICADORES'!E118","v":0},{"$f":"+F75+F74+F73+F72","v":0}]
[null,{"$f":"+'2 INDICADORES'!B117:C117","v":"Acesso regular ao transporte escolar"},{"v":1,"d":"1.0"},null,null,0,0,{"$f":"IF(H73=0,1,H73)","v":{"v":1,"d":"1.00"}}]
[null,{"$f":"+'2 INDICADORES'!B118:C118","v":"Segurança no campo "},{"v":1,"d":"1.0"},null,null,0,0]
[null,{"$f":"+'2 INDICADORES'!B119:C119","v":"Internet "},{"v":1,"d":"1.0"}]
[null,{"$f":"+'2 INDICADORES'!B120:C120","v":"Coleta pública de lixo"},{"v":1,"d":"1.0"}]
[]
[null,"Fator de Ponderação",{"$nulls":3},"Fórmulas",{"$nulls":4},"Referência: Família com 5 pessoas e média de 2.630 kcal/dia: 4 pés citros; 13 mamoeiros; 18 bananeiras; 2 vacas leite;  4 cevados (porco)/ano; 100 frangos/ano; 50 galinhas; 3 galos; 600 kg de hortaliças (folhosas/frutos/tubérculos/ano); 200 kg mandioca."]
[null,{"$f":"+'2 INDICADORES'!B125:C125","v":"Hortaliças, grãos e tubérculos"},{"v":1,"d":"1.0"},null,null,"Fórmula: ((SOMA(D148:G150)/Nº de residências)/Nº de variáveis(3)"]
[null,{"$f":"+'2 INDICADORES'!B126:C126","v":"Pomar"},{"v":1,"d":"1.0"}]
[null,{"$f":"+'2 INDICADORES'!B127:C127","v":"Criação de animais (carne, leite, ovos)"},{"v":1,"d":"1.0"},null,null,{"$f":"IF(G82>0,1,0)","v":0},{"$f":"'2 INDICADORES'!D125+'2 INDICADORES'!D126+'2 INDICADORES'!D127","v":0}]
[{"$nulls":5},{"$f":"IF(G83>0,1,0)","v":0},{"$f":"'2 INDICADORES'!E125+'2 INDICADORES'!E126+'2 INDICADORES'!E127","v":0}]
[{"$nulls":5},{"$f":"IF(('2 INDICADORES'!D125+'2 INDICADORES'!D126+'2 INDICADORES'!D127)=0,0,(('2 INDICADORES'!D125+'2 INDICADORES'!D126+'2 INDICADORES'!D127)+('2 INDICADORES'!E125+'2 INDICADORES'!E126+'2 INDICADORES'!E127))/F85)","v":0}]
[{"$nulls":5},{"$f":"SUM(F82:F83)","v":0}]
[]
[]
[]
[6,"Fator de Ponderação",{"$nulls":3},"Fórmulas"]
[null,{"$f":"+'2 INDICADORES'!B136:C136","v":"Menos de 9 anos de estudo"},0.7,null,null,"Fórmula: limiar de sustentabilidade (0,7) => adultos com no mínimo 5 anos de escolaridade (equivalente a 4 anos na grade escolar antiga) e crianças na rede de ensino. Cursos de capacitação direcionados para a atividade e mão de obra qualificada => acréscimo máx. 0,3 nota final"]
[null,{"$f":"+'2 INDICADORES'!B137:C137","v":"Ensino Fundamental completo"},{"v":1,"d":"1.0"}]
[null,{"$f":"+'2 INDICADORES'!B138:C138","v":"Ensino Médio completo"},1.2]
[null,{"$f":"+'2 INDICADORES'!B139:C139","v":"Curso superior"},1.5]
[null,{"$f":"+'2 INDICADORES'!B142:C142","v":"Capacitação curta temporada*"},0.5,null,null,"Fórmula dos item 6.1 = (D158*0,7 + D159*1 + D160*1,2 + D161*1,5) + (F158*0,7 + F159*1 + F160*1,2 + F161*1,5)/nº pessoas * 0,7. Fórmula do item 6.2 = (D165*0,5 + D166*0,8)+(F165*0,5 + F166*0,8)/nº pessoas * 0,3. Fórmula do item 6.3 = (E171 + G172)/nº pessoas * 0,7"]
[null,{"$f":"+'2 INDICADORES'!B143:C143","v":"Capacitação longa temporada**"},0.8]
[null,{"$f":"+'2 INDICADORES'!B149:C149","v":"Frequenta rede de ensino "},{"v":1,"d":"1.0"},null,null,{"$f":"IF('2 INDICADORES'!D135>0,((('2 INDICADORES'!D136*'2 INDICADORES'!F136+'2 INDICADORES'!D137*'2 INDICADORES'!F137+'2 INDICADORES'!D138*'2 INDICADORES'!F138+'2 INDICADORES'!D139*'2 INDICADORES'!F139))*0.7),0)","v":0},{"$f":"IF('2 INDICADORES'!D135>0,(('2 INDICADORES'!D142*'2 INDICADORES'!F142+'2 INDICADORES'!D143*'2 INDICADORES'!F143))*0.3,0)","v":0},{"$f":"+'2 INDICADORES'!D135+'2 INDICADORES'!E135","v":0},{"$f":"IF('2 INDICADORES'!D148>0,(('2 INDICADORES'!D149*'2 INDICADORES'!F149)*0.7),0)","v":0},null,{"$f":"I98+G98","v":{"$error":"#DIV/0!"}}]
[{"$nulls":5},{"$f":"IF('2 INDICADORES'!E135>0,((('2 INDICADORES'!E136*'2 INDICADORES'!F136+'2 INDICADORES'!E137*'2 INDICADORES'!F137+'2 INDICADORES'!E138*'2 INDICADORES'!F138+'2 INDICADORES'!E139*'2 INDICADORES'!F139))*0.7),0)","v":0},{"$f":"IF('2 INDICADORES'!E135>0,(('2 INDICADORES'!E142*'2 INDICADORES'!F142+'2 INDICADORES'!E143*'2 INDICADORES'!F143))*0.3,0)","v":0},{"$f":"+'2 INDICADORES'!D148+'2 INDICADORES'!E148","v":0},{"$f":"IF('2 INDICADORES'!E148>0,(('2 INDICADORES'!E149*'2 INDICADORES'!F149))*0.7,0)","v":0},null,{"$f":"K96","v":{"$error":"#DIV/0!"}}]
[{"$nulls":5},{"$f":"(F96+F97)/H96","v":{"$error":"#DIV/0!"}},{"$f":"(G96+G97)/H96","v":{"$error":"#DIV/0!"}},{"$f":"(I96+I97)/H97","v":{"$error":"#DIV/0!"}},{"$f":"IF(OR('2 INDICADORES'!D148>0,'2 INDICADORES'!E148>0),((H98+F98)/2),F98)","v":{"$error":"#DIV/0!"}}]
[]
[7,"Fator de Ponderação",{"$nulls":3},"Fórmulas"]
[null,{"$f":"+'2 INDICADORES'!B158:D158","v":"Registro de funcionários (carteira de trabalho)"},{"v":1,"d":"1.0"},null,null,"Fórmula: = 0,7 se houver o cumprimento da lei referente ao registro e pagamento de hora extra de todos os funcionários; auxílios e benefícios acréscimo - máx.0,3 "]
[null,{"$f":"+'2 INDICADORES'!B159:D159","v":"Pagamento de hora extra / banco de horas* / ausência de hora extra"},{"v":1,"d":"1.0"}]
[null,{"$f":"+'2 INDICADORES'!B162:D162","v":"Acima de 1 salário mínimo"},{"v":1,"d":"1.0"},null,null,{"$f":"IF('2 INDICADORES'!E157>0,((('2 INDICADORES'!E158*'2 INDICADORES'!$G$158+'2 INDICADORES'!E159*'2 INDICADORES'!$G$159)/('2 INDICADORES'!E157*2))*0.7),0.7)","v":{"v":0.7,"d":"0.70"}},{"$f":"IF('2 INDICADORES'!E157>0,(('2 INDICADORES'!E162*'2 INDICADORES'!$G$162+'2 INDICADORES'!E163*'2 INDICADORES'!$G$163+'2 INDICADORES'!E164*'2 INDICADORES'!$G$164+'2 INDICADORES'!E165*'2 INDICADORES'!$G$165+'2 INDICADORES'!E166*'2 INDICADORES'!$G$166+'2 INDICADORES'!E167*'2 INDICADORES'!$G$167+'2 INDICADORES'!E168*'2 INDICADORES'!$G$168+'2 INDICADORES'!E169*'2 INDICADORES'!$G$169)/('2 INDICADORES'!E157*8)*0.3),0)","v":0},{"$f":"(F103+G103)","v":{"v":0.7,"d":"0.70"}}]
[null,{"$f":"+'2 INDICADORES'!B163:D163","v":"Auxílio alimentação"},{"v":1,"d":"1.0"},null,null,{"$f":"IF('2 INDICADORES'!F157>0,((('2 INDICADORES'!F158*'2 INDICADORES'!$G$158+'2 INDICADORES'!F159*'2 INDICADORES'!$G$159)/('2 INDICADORES'!F157*2))*0.7),0.7)","v":{"v":0.7,"d":"0.70"}},{"$f":"IF('2 INDICADORES'!F157>0,(('2 INDICADORES'!F162*'2 INDICADORES'!$G$162+'2 INDICADORES'!F163*'2 INDICADORES'!$G$163+'2 INDICADORES'!F164*'2 INDICADORES'!$G$164+'2 INDICADORES'!F165*'2 INDICADORES'!$G$165+'2 INDICADORES'!F166*'2 INDICADORES'!$G$166+'2 INDICADORES'!F167*'2 INDICADORES'!$G$167+'2 INDICADORES'!F168*'2 INDICADORES'!$G$168+'2 INDICADORES'!F169*'2 INDICADORES'!$G$169)/('2 INDICADORES'!F157*8)*0.3),0)","v":0},{"$f":"(F104+G104)","v":{"v":0.7,"d":"0.70"}}]
[null,{"$f":"+'2 INDICADORES'!B164:D164","v":"Auxílio moradia"},{"v":1,"d":"1.0"},null,null,{"$f":"+H103","v":{"v":0.7,"d":"0.70"}},{"$f":"IF('2 INDICADORES'!F157>0,(H104+F105)/2,F105)","v":{"v":0.7,"d":"0.70"}},{"$f":"IF(SUM('2 INDICADORES'!E157:F157)=0,0.7,FÓRMULAS!G105)","v":{"v":0.7,"d":"0.70"}}]
[null,{"$f":"+'2 INDICADORES'!B165:D165","v":"Auxílio educação e transporte"},{"v":1,"d":"1.0"}]
[null,{"$f":"+'2 INDICADORES'!B166:D166","v":"Participação nos lucros"},{"v":5,"d":"5.0"}]
[null,{"$f":"+'2 INDICADORES'!B167:D167","v":"Seguro contra acidentes"},{"v":3,"d":"3.0"}]
[null,{"$f":"+'2 INDICADORES'!B168:D168","v":"Acesso a lazer"},{"v":1,"d":"1.0"}]
[null,{"$f":"+'2 INDICADORES'!B169:D169","v":"Espaço para cultivo de alimentos "},{"v":3,"d":"3.0"}]
[]
[]
[8,"Fator de Ponderação",{"$nulls":3},"Fórmulas"]
[null,{"$f":"+'2 INDICADORES'!C175","v":"Fluxo de caixa (receita/despesa)"},0.5,null,null,"E198+E199+E200+E201+(E202*2)+ (0,4*E203)+(0,4*E204)+(0,2*E205)/7"]
[null,{"$f":"+'2 INDICADORES'!C176","v":"Custo de produção das atividades"},0.5]
[null,{"$f":"+'2 INDICADORES'!B177:D177","v":"8.2 Acesso à assistência técnica (particular ou pública)*"},{"v":1,"d":"1.0"}]
[null,{"$f":"+'2 INDICADORES'!B178:D178","v":"8.3 Participação - formas associativas - ativa (1) ou passiva (0,5)"},{"v":1,"d":"1.0"}]
[null,{"$f":"+'2 INDICADORES'!B179:D179","v":"8.4 Regularização ambiental (Uso da água, CAR e Licenciamento)**"},{"v":1,"d":"1.0"}]
[null,{"$f":"+'2 INDICADORES'!C180","v":"Utiliza crédito para investimento"},0.4]
[null,{"$f":"+'2 INDICADORES'!C181","v":"Utiliza crédito para custeio"},0.4]
[null,{"$f":"+'2 INDICADORES'!C182","v":"Utiliza crédito para comercialização"},0.2]
[]
[]
[9,"Fator de Ponderação",{"$nulls":3},"Fórmulas"]
[null,{"$f":"+'2 INDICADORES'!B188:D188","v":"Busca informação para comercialização / diversificar compradores  "},0.4,{"$f":"IF('2 INDICADORES'!E188=\"sim\",1,0)","v":0},null,"(0,4*E211)+(0,4*E212)+(0,3*E214)+ (0,4*E216)"]
[null,{"$f":"+'2 INDICADORES'!B189:D189","v":"Gera produtos certificados e/ou mercado institucional"},0.4,{"$f":"IF('2 INDICADORES'!E189=\"sim\",1,0)","v":0},null,{"$f":"(D125*C125+D126*C126+D127*C127+D128*C128)","v":{"v":0,"d":"0.00"}}]
[null,{"$f":"+'2 INDICADORES'!B191:D191","v":"Adoção de técnicas inovadoras*"},0.3,{"$f":"IF('2 INDICADORES'!E191=\"sim\",1,0)","v":0}]
[null,{"$f":"+'2 INDICADORES'!B193:D193","v":"Capacidade de inovação ou liderança na comunidade"},0.4,{"$f":"IF('2 INDICADORES'!E193=\"sim\",1,0)","v":0}]
[]
[]
[]
[10,"Fator de Ponderação",{"$nulls":3},"Fórmulas"]
[null,"10.1.Esgoto residências - destinação\t",{"v":1,"d":"1.0"},null,null,"(F236+F237+F238+F239+F240)"]
[null,"10.2.Lixo domiciliar e das atividades - destinação",{"v":1,"d":"1.0"},null,null,{"$f":"IF(G134>1,1,G134)","v":{"$error":"#DIV/0!"}},{"$f":"IF(H134>0,I134/H134,I134)","v":{"$error":"#DIV/0!"}},{"$f":"COUNTIF('2 INDICADORES'!F206:G212,\">=0\")","v":0},{"$f":"'2 INDICADORES'!G206+'2 INDICADORES'!G207+'2 INDICADORES'!F209+'2 INDICADORES'!F211+'2 INDICADORES'!F212","v":{"$error":"#DIV/0!"}},null,"Não se aplica"]
[null,"10.3.Resíduos sólidos orgânicos - compostagem e/ou reaproveitamento no campo\t\t\t",{"v":1,"d":"1.0"},null,null,{"$f":"IF('2 INDICADORES'!F214=\"sim\",FÓRMULAS!F134*0.7,FÓRMULAS!F134)","v":{"$error":"#DIV/0!"}}]
[null,"10.4.Efluentes líquidos (quando existentes) - tratamento / destinação adequada \t\t\t",{"v":1,"d":"1.0"}]
[null,"10.5.Efluentes gasosos (quando existentes) - tratamento / destinação adequada \t\t\t",{"v":1,"d":"1.0"}]
[]
[{"$nulls":5},"Fator de ponderação"]
[null,"Ausência de coleta e tratamento de esgoto \t",{"$nulls":3},{"v":1E-4,"d":"0.00"},{"$f":"IF('2 INDICADORES'!$D$206=FÓRMULAS!B140,1,0)","v":0},{"$f":"G140*F140","v":0},{"$f":"IF('2 INDICADORES'!$F$206=FÓRMULAS!B140,1,0)","v":0},{"$f":"I140*F140","v":0},{"$f":"SUM(G140:G144)","v":0},{"$f":"SUM(I140:I144)","v":0},{"$f":"L140+K140","v":0}]
[null,"Fossa rudimentar; fossa negra sem revestimento\t",{"$nulls":3},0.25,{"$f":"IF('2 INDICADORES'!$D$206=FÓRMULAS!B141,1,0)","v":0},{"$f":"G141*F141","v":0},{"$f":"IF('2 INDICADORES'!$F$206=FÓRMULAS!B141,1,0)","v":0},{"$f":"I141*F141","v":0},{"$f":"SUM(H140:H144)","v":0},{"$f":"SUM(J140:J144)","v":0},{"$f":"SUM(K141:L141)/M140","v":{"$error":"#DIV/0!"}}]
[null,"Fossa séptica sem tratamento do efluente\t",{"$nulls":3},0.35,{"$f":"IF('2 INDICADORES'!$D$206=FÓRMULAS!B142,1,0)","v":0},{"$f":"G142*F142","v":0},{"$f":"IF('2 INDICADORES'!$F$206=FÓRMULAS!B142,1,0)","v":0},{"$f":"I142*F142","v":0}]
[null,"Fossa séptica com tratamento do efluente\t",{"$nulls":3},0.75,{"$f":"IF('2 INDICADORES'!$D$206=FÓRMULAS!B143,1,0)","v":0},{"$f":"G143*F143","v":0},{"$f":"IF('2 INDICADORES'!$F$206=FÓRMULAS!B143,1,0)","v":0},{"$f":"I143*F143","v":0}]
[null,"Fossa TEVAP; separação e tratamento águas cinzas\t",{"$nulls":3},{"v":1,"d":"1.00"},{"$f":"IF('2 INDICADORES'!$D$206=FÓRMULAS!B144,1,0)","v":0},{"$f":"G144*F144","v":0},{"$f":"IF('2 INDICADORES'!$F$206=FÓRMULAS!B144,1,0)","v":0},{"$f":"I144*F144","v":0}]
[]
[null,"Queimado/descartado em local inapropriado\t",{"$nulls":3},{"v":1E-4,"d":"0.00"},{"$f":"IF('2 INDICADORES'!$D$207=FÓRMULAS!B146,1,0)","v":0},{"$f":"G146*F146","v":0},{"$f":"IF('2 INDICADORES'!$F$207=FÓRMULAS!B146,1,0)","v":0},{"$f":"I146*F146","v":0},{"$f":"SUM(G146:G149)","v":0},{"$f":"SUM(I146:I149)","v":0},{"$f":"L146+K146","v":0}]
[null,"Enterrado no imóvel rural\t",{"$nulls":3},{"v":0.3,"d":"0.30"},{"$f":"IF('2 INDICADORES'!$D$207=FÓRMULAS!B147,1,0)","v":0},{"$f":"G147*F147","v":0},{"$f":"IF('2 INDICADORES'!$F$207=FÓRMULAS!B147,1,0)","v":0},{"$f":"I147*F147","v":0},{"$f":"SUM(H146:H149)","v":0},{"$f":"SUM(J146:J149)","v":0},{"$f":"SUM(K147:L147)/M146","v":{"$error":"#DIV/0!"}}]
[null,"Lixo levado pelo produtor\t",{"$nulls":3},{"v":0.8,"d":"0.80"},{"$f":"IF('2 INDICADORES'!$D$207=FÓRMULAS!B148,1,0)","v":0},{"$f":"G148*F148","v":0},{"$f":"IF('2 INDICADORES'!$F$207=FÓRMULAS!B148,1,0)","v":0},{"$f":"I148*F148","v":0}]
[null,"Lixo coletado pela prefeitura\t",{"$nulls":3},{"v":1,"d":"1.00"},{"$f":"IF('2 INDICADORES'!$D$207=FÓRMULAS!B149,1,0)","v":0},{"$f":"G149*F149","v":0},{"$f":"IF('2 INDICADORES'!$F$207=FÓRMULAS!B149,1,0)","v":0},{"$f":"I149*F149","v":0}]
[]
[11,"Fator de Ponderação",{"$nulls":3},"Fórmulas"]
[null,{"$f":"+'2 INDICADORES'!B220:D220","v":"Quantas pessoas fazem o manuseio de agrotóxicos"},{"v":1,"d":"1.0"},null,null,"Fórmula: 0,7, se atende todas as regras, conforme legislação ambiental vigente (EPI; armazenamento e devolução de embalagens)"]
[null,{"$f":"+'2 INDICADORES'!B221:D221","v":"Quantas pessoas utilizam EPI adequadamente"},{"v":1,"d":"1.0"}]
[null,{"$f":"+'2 INDICADORES'!B223:D223","v":"Armazenamento adequado das embalagens"},{"v":1,"d":"1.0"},null,null,{"$f":"IF('2 INDICADORES'!E220>0,('2 INDICADORES'!E221/'2 INDICADORES'!E220),0.7)","v":{"v":0.7,"d":"0.70"}},{"$f":"IF('2 INDICADORES'!E220>0,(H154+H155+F154)/3*0.7,0.7)","v":{"v":0.7,"d":"0.70"}},{"$f":"IF('2 INDICADORES'!E223=\"sim\",1,0)","v":0}]
[null,{"$f":"+'2 INDICADORES'!B224:D224","v":"Devolução das embalagens de agrotóxicos"},{"v":1,"d":"1.0"},{"$nulls":4},{"$f":"IF('2 INDICADORES'!E224=\"sim\",1,0)","v":0}]
[]
[12,"MO - Fator Ponderação"]
[null,"Classificação",{"$nulls":3},"Ponderação",null,"Classes de textura (dag kg-1 de argila)"]
[null,"Arenosa","Média","Argilosa","Muito Arg.",null,null,"Arenosa",null,"≤ 15"]
[null,{"v":0,"d":"0.00"},{"v":0,"d":"0.00"},{"v":0,"d":"0.00"},{"v":0,"d":"0.00"},{"v":0.1,"d":"0.10"},null,"Média",null,"16 a 34"]
[null,{"v":0.8,"d":"0.80"},{"v":1.6,"d":"1.60"},{"v":2.4,"d":"2.40"},{"v":2.8,"d":"2.80"},{"v":0.5,"d":"0.50"},null,"Argilosa",null,"35 a 60"]
[null,{"v":1.1,"d":"1.10"},{"v":2.1,"d":"2.10"},{"v":3.1,"d":"3.10"},{"v":3.6,"d":"3.60"},{"v":0.7,"d":"0.70"},null,"Muito argilosa",null,"> 60"]
[null,{"v":1.5,"d":"1.50"},{"v":3,"d":"3.00"},{"v":4.5,"d":"4.50"},{"v":5.2,"d":"5.20"},{"v":1,"d":"1.00"}]
[null,{"v":4.5,"d":"4.50"},{"v":9,"d":"9.00"},{"v":13.5,"d":"13.50"},{"v":15.6,"d":"15.60"},{"v":0.7,"d":"0.70"}]
[null,"MO - Fórmulas"]
[null,"Arenosa"," Yo + ax + bx2 + cx3 ",null,"Fórmula2 = Yo + ax ",null,"Média"," Yo + ax + bx2 + cx3 ",null,"Fórmula2 = Yo + ax ",null,null,{"$f":"IF(AND('2 INDICADORES'!E231=\"Arenosa\"),IF('2 INDICADORES'!C232<1.5,FÓRMULAS!E169,FÓRMULAS!F169),0)","v":{"v":0,"d":"0.00"}}]
[null,null,"Yo",{"v":0.1,"d":"0.100"},"Yo",1.15,null,"Yo",{"v":0.1,"d":"0.100"},"Yo",1.15,null,{"$f":"IF(AND('2 INDICADORES'!E231=\"Média\"),IF('2 INDICADORES'!C232<3,FÓRMULAS!J169,FÓRMULAS!K169),0)","v":{"v":0,"d":"0.00"}}]
[null,null,"a",{"v":0.3597,"d":"0.360"},"a",{"v":-0.1,"d":"-0.10"},null,"a",{"v":0.0024,"d":"0.002"},"a",-0.05,null,{"$f":"IF(AND('2 INDICADORES'!E231=\"Argilosa\"),IF('2 INDICADORES'!C232<4.5,FÓRMULAS!E174,FÓRMULAS!F174),0)","v":{"v":0,"d":"0.00"}}]
[null,null,"b",{"v":0.1926,"d":"0.193"},{"$f":"D167+D168*'2 INDICADORES'!C232+D169*'2 INDICADORES'!C232^2+D170*'2 INDICADORES'!C232^3","v":{"v":0.1,"d":"0.10"}},{"$f":"F167+F168*'2 INDICADORES'!C232","v":1.15},null,"b",{"v":0.2183,"d":"0.218"},{"$f":"I167+I168*'2 INDICADORES'!C232+I169*'2 INDICADORES'!C232^2+I170*'2 INDICADORES'!C232^3","v":{"v":0.1,"d":"0.10"}},{"$f":"K167+K168*'2 INDICADORES'!C232","v":1.15},null,{"$f":"IF(AND('2 INDICADORES'!E231=\"Muito Argilosa\"),IF('2 INDICADORES'!C232<5.2,FÓRMULAS!J174,FÓRMULAS!K174),0)","v":{"v":0,"d":"0.00"}}]
[null,null,"c",{"v":-0.0216,"d":"-0.022"},{"$nulls":3},"c",{"v":-0.0397,"d":"-0.040"},{"$nulls":3},{"$f":"(M166+M167+M168+M169)","v":{"v":0,"d":"0.00"}}]
[null,"Argilosa"," Yo + ax + bx2 + cx3 ",null,"Fórmula2 = Yo + ax ",null,"Muito Argilosa"," Yo + ax + bx2 + cx3 ",null,"Fórmula2 = Yo + ax "]
[null,null,"Yo",{"v":0.1,"d":"0.100"},"Yo",1.15,null,"Yo",{"v":0.1,"d":"0.100"},"Yo",1.15]
[null,null,"a",{"v":-0.0452,"d":"-0.045"},"a",{"v":-0.03333,"d":"-0.03"},null,"a",{"v":-0.0486,"d":"-0.049"},"a",{"v":-0.0288,"d":"-0.03"}]
[null,null,"b",{"v":0.1269,"d":"0.127"},{"$f":"D172+D173*'2 INDICADORES'!C232+D174*'2 INDICADORES'!C232^2+D175*'2 INDICADORES'!C232^3","v":{"v":0.1,"d":"0.10"}},{"$f":"F172+F173*'2 INDICADORES'!C232","v":1.15},null,"b",{"v":0.0984,"d":"0.098"},{"$f":"I172+I173*'2 INDICADORES'!C232+I174*'2 INDICADORES'!C232^2+I175*'2 INDICADORES'!C232^3","v":{"v":0.1,"d":"0.10"}},{"$f":"K172+K173*'2 INDICADORES'!C232","v":1.15}]
[null,null,"c",{"v":-0.0161,"d":"-0.016"},{"$nulls":3},"c",{"v":-0.0107,"d":"-0.011"}]
[null,"MO - Representação Gráfica"]
{"$rows_empty":12}
[null,"P - Fator Ponderação"]
[null,"Classificação",{"$nulls":3},"Ponderação"]
[null,"Arenosa","Média","Argilosa","Muito Arg."]
[null,{"v":0,"d":"0.00"},{"v":0,"d":"0.00"},{"v":0,"d":"0.00"},{"v":0,"d":"0.00"},{"v":0.1,"d":"0.10"}]
[null,{"v":12.1,"d":"12.10"},{"v":10.1,"d":"10.10"},{"v":5.1,"d":"5.10"},{"v":3.1,"d":"3.10"},0.25]
[null,{"v":18.1,"d":"18.10"},{"v":15.1,"d":"15.10"},{"v":8.1,"d":"8.10"},{"v":4.1,"d":"4.10"},{"v":0.5,"d":"0.50"}]
[null,{"v":25.1,"d":"25.10"},{"v":20.1,"d":"20.10"},{"v":12.1,"d":"12.10"},{"v":6.1,"d":"6.10"},{"v":0.7,"d":"0.70"}]
[null,{"v":40,"d":"40.00"},{"v":30,"d":"30.00"},{"v":18,"d":"18.00"},{"v":9,"d":"9.00"},{"v":1,"d":"1.00"}]
[null,{"v":400,"d":"400.00"},{"v":300,"d":"300.00"},{"v":180,"d":"180.00"},{"v":90,"d":"90.00"},{"v":0.7,"d":"0.70"}]
["P - Fórmulas"]
["Arenosa"," Yo + ax ",null,"F2 = Yo + ax + bx2 ",null,"F3 = Yo + ax ",null,"Média","F1 = Yo + ax + bx2 ",null,"F2 = Yo + ax + bx2 ",null,"F3 = Yo + ax "]
[null,"Yo",{"v":0.1,"d":"0.10"},"Yo",{"v":-0.4748,"d":"-0.47"},"Yo",{"v":1.0233,"d":"1.02"},null,"Yo",{"v":0.1,"d":"0.10"},"Yo",{"v":-0.3015,"d":"-0.30"},"Yo",{"v":1.0333,"d":"1.03"}]
[null,"a",{"v":0.0124,"d":"0.01"},"a",{"v":0.0721,"d":"0.07"},"a",{"v":-0.0008,"d":"-0.00"},null,"a",{"v":-0.0087,"d":"-0.01"},"a",{"v":0.0639,"d":"0.06"},"a",{"v":-0.0011,"d":"-0.00"}]
[{"$nulls":3},"b",{"v":-1E-3,"d":"-0.00"},{"$nulls":3},"b",{"v":2.3E-3,"d":"0.00"},"b",{"v":-0.0007,"d":"-0.00"}]
["Argilosa","F1 = Yo + ax + bx2 ",null,"F2 = Yo + ax + bx2 ",null,"F3 = Yo + ax ",null,"Muito Argilosa","F1 = Yo + ax + bx2 ",null,"F2 = Yo + ax + bx2 ",null,"F3 = Yo + ax "]
[null,"Yo",{"v":0.1,"d":"0.10"},"Yo",{"v":0.1034,"d":"0.10"},"Yo",{"v":1.04333,"d":"1.04"},null,"Yo",{"v":0.1,"d":"0.10"},"Yo",{"v":0.1076,"d":"0.11"},"Yo",{"v":1.0333,"d":"1.03"}]
[null,"a",{"v":-0.0045,"d":"-0.00"},"a",{"v":0.0483,"d":"0.05"},"a",{"v":-1.9E-3,"d":"-0.00"},null,"a",{"v":-0.1041,"d":"-0.10"},"a",{"v":0.0928,"d":"0.09"},"a",{"v":-0.0037,"d":"-0.00"}]
[null,"b",{"v":0.0067,"d":"0.01"},"b",{"v":8.56e-05,"d":"0.00"},{"$nulls":3},"b",{"v":0.0492,"d":"0.05"},"b",{"v":0.0007,"d":"0.00"}]
["Atual",{"$f":"C200+C201*'2 INDICADORES'!C233","v":{"v":0.1,"d":"0.10"}},{"$f":"E200+E201*'2 INDICADORES'!C233+E202*'2 INDICADORES'!C233^2","v":{"v":-0.4748,"d":"-0.47"}},{"$f":"0.1946+0.0201*'2 INDICADORES'!C233","v":{"v":0.1946,"d":"0.19"}},{"$f":"G200+G201*'2 INDICADORES'!C233","v":{"v":1.0233,"d":"1.02"}},{"$f":"IF('2 INDICADORES'!C233<=12.1,B207,IF(AND('2 INDICADORES'!C233>12.1,'2 INDICADORES'!C233<25.1),C207,IF('2 INDICADORES'!C233>40,E207,D207)))","v":{"v":0.1,"d":"0.10"}},null,null,"Atual",{"$f":"J200+J201*'2 INDICADORES'!C233+J202*'2 INDICADORES'!C233^2","v":{"v":0.1,"d":"0.10"}},{"$f":"L200+L201*'2 INDICADORES'!C233+L202*'2 INDICADORES'!C233^2","v":{"v":-0.3015,"d":"-0.30"}},{"$f":"N200+N201*'2 INDICADORES'!C233","v":{"v":1.0333,"d":"1.03"}},{"$f":"IF(AND('2 INDICADORES'!C233>15.1,'2 INDICADORES'!C233<30),K207,IF('2 INDICADORES'!C233>=30,L207,J207))","v":{"v":0.1,"d":"0.10"}}]
["Atual",{"$f":"C204+C205*'2 INDICADORES'!C233+C206*'2 INDICADORES'!C233^2","v":{"v":0.1,"d":"0.10"}},{"$f":"E204+E205*'2 INDICADORES'!C233+E206*'2 INDICADORES'!C233^2","v":{"v":0.1034,"d":"0.10"}},{"$f":"G204+G205*'2 INDICADORES'!C233","v":{"v":1.04333,"d":"1.04"}},{"$f":"IF(AND('2 INDICADORES'!C233>8.1,'2 INDICADORES'!C233<18),C208,IF('2 INDICADORES'!C233>=18,D208,B208))","v":{"v":0.1,"d":"0.10"}},{"$nulls":3},"Atual",{"$f":"J204+J205*'2 INDICADORES'!C233+J206*'2 INDICADORES'!C233^2","v":{"v":0.1,"d":"0.10"}},{"$f":"L204+L205*'2 INDICADORES'!C233+L206*'2 INDICADORES'!C233^2","v":{"v":0.1076,"d":"0.11"}},{"$f":"N204+N205*'2 INDICADORES'!C233","v":{"v":1.0333,"d":"1.03"}},{"$f":"IF(AND('2 INDICADORES'!C233>4.1,'2 INDICADORES'!C233<9),K208,IF('2 INDICADORES'!C233>=9,L208,J208))","v":{"v":0.1,"d":"0.10"}}]
[null,{"$f":"IF(AND('2 INDICADORES'!E231=\"Arenosa\"),IF('2 INDICADORES'!C233<0,0,IF(FÓRMULAS!F207>1,1,FÓRMULAS!F207)),0)","v":{"v":0,"d":"0.00"}},{"$f":"IF(AND('2 INDICADORES'!E231=\"Média\"),IF('2 INDICADORES'!C233<0,0,IF(FÓRMULAS!M207>1,1,FÓRMULAS!M207)),0)","v":{"v":0,"d":"0.00"}},{"$f":"IF(AND('2 INDICADORES'!E231=\"Argilosa\"),IF('2 INDICADORES'!C233<0,0,IF(FÓRMULAS!E208>1,1,FÓRMULAS!E208)),0)","v":{"v":0,"d":"0.00"}},{"$f":"IF(AND('2 INDICADORES'!E231=\"Muito Argilosa\"),IF('2 INDICADORES'!C233<0,0,IF(FÓRMULAS!M208>1,1,FÓRMULAS!M208)),0)","v":{"v":0,"d":"0.00"}},{"$f":"(B209+C209+D209+E209)","v":{"v":0,"d":"0.00"}}]
[null,"P - Representação Gráfica"]
{"$rows_empty":15}
[null,"Ca - Fator Ponderação",null,null,"Ca - Fórmulas"]
[null,"Classificação","Ponderação",null,"F1 = Yo + ax + bx2 ",null,null,"F2 = Yo + ax + bx2 ",null,"F3 = Yo + ax "]
[null,{"v":0,"d":"0.00"},{"v":0.1,"d":"0.10"},null,"Yo",{"v":0.1,"d":"0.10"},null,"Yo",{"v":0.3213,"d":"0.32"},"Yo",{"v":1.075,"d":"1.08"}]
[null,0.41,0.25,null,"a",{"v":0.3839,"d":"0.38"},null,"a",{"v":0.1381,"d":"0.14"},"a",{"v":-0.0188,"d":"-0.02"}]
[null,1.21,{"v":0.5,"d":"0.50"},null,"b",{"v":-0.0441,"d":"-0.04"},null,"b",{"v":0.0079,"d":"0.01"}]
[null,2.41,{"v":0.7,"d":"0.70"}]
[null,{"v":4,"d":"4.00"},{"v":1,"d":"1.00"},null,"Atual",{"$f":"F228+F229*'2 INDICADORES'!C234+F230*'2 INDICADORES'!C234^2","v":{"v":0.1,"d":"0.10"}},{"$f":"I228+I229*'2 INDICADORES'!C234+I230*'2 INDICADORES'!C234^2","v":{"v":0.3213,"d":"0.32"}},{"$f":"K228+K229*'2 INDICADORES'!C234","v":{"v":1.075,"d":"1.08"}},{"$f":"IF(AND('2 INDICADORES'!C234>1.21,'2 INDICADORES'!C234<4),G232,IF('2 INDICADORES'!C234>=4,H232,F232))","v":{"v":0.1,"d":"0.10"}}]
[null,{"v":20,"d":"20.00"},{"v":0.7,"d":"0.70"}]
[null,"Ca - Representação Gráfica"]
{"$rows_empty":7}
[null,"Mg - Fator Ponderação",null,null,"Mg - Fórmulas"]
[null,"Classificação","Ponderação",null,"F1 = Yo + ax + bx2 ",null,null,"F2 = Yo + ax + bx2 ",null,"F3 = Yo + ax "]
[null,{"v":0,"d":"0.00"},{"v":0.1,"d":"0.10"},null,"Yo",{"v":0.1,"d":"0.10"},null,"Yo",{"v":0.3213,"d":"0.32"},"Yo",{"v":1.075,"d":"1.08"}]
[null,0.16,0.25,null,"a",{"v":0.9737,"d":"0.97"},null,"a",{"v":0.3601,"d":"0.36"},"a",-0.05]
[null,0.46,{"v":0.5,"d":"0.50"},null,"b",{"v":-0.2264,"d":"-0.23"},null,"b",{"v":0.0616,"d":"0.06"}]
[null,0.91,{"v":0.7,"d":"0.70"},null,"Atual",{"$f":"F244+F245*'2 INDICADORES'!C235+F246*'2 INDICADORES'!C235^2","v":{"v":0.1,"d":"0.10"}},{"$f":"I244+I245*'2 INDICADORES'!C235+I246*'2 INDICADORES'!C235^2","v":{"v":0.3213,"d":"0.32"}},{"$f":"K244+K245*'2 INDICADORES'!C235","v":{"v":1.075,"d":"1.08"}},{"$f":"IF(AND('2 INDICADORES'!C235>0.46,'2 INDICADORES'!C235<1.5),G247,IF('2 INDICADORES'!C235>=1.5,H247,F247))","v":{"v":0.1,"d":"0.10"}}]
[null,{"v":1.5,"d":"1.50"},{"v":1,"d":"1.00"}]
[null,{"v":7.5,"d":"7.50"},{"v":0.7,"d":"0.70"}]
[null,"Mg - Representação Gráfica"]
{"$rows_empty":7}
[null,"K - Fator Ponderação",null,null,"K - Fórmulas"]
[null,"Classificação","Ponderação",null,"F1 = Yo + ax + bx2 ",null,null,"F2 = Yo + ax + bx2 ",null,"F3 = Yo + ax "]
[null,{"v":0,"d":"0.00"},{"v":0.1,"d":"0.10"},null,"Yo",{"v":0.1,"d":"0.10"},null,"Yo",{"v":0.2066,"d":"0.21"},"Yo",{"v":1.075,"d":"1.08"}]
[null,{"v":16,"d":"16.00"},0.25,null,"a",{"v":0.0091,"d":"0.01"},null,"a",{"v":0.0074,"d":"0.01"},"a",{"v":-6.2E-4,"d":"-0.00"}]
[null,{"v":41,"d":"41.00"},{"v":0.5,"d":"0.50"},null,"b",{"v":1.5244E-5,"d":"0.00"},null,"b",{"v":-6.8888E-6,"d":"-0.00"}]
[null,{"v":71,"d":"71.00"},{"v":0.7,"d":"0.70"},null,"Atual",{"$f":"F260+F261*'2 INDICADORES'!C236+F262*'2 INDICADORES'!C236^2","v":{"v":0.1,"d":"0.10"}},{"$f":"I260+I261*'2 INDICADORES'!C236+I262*'2 INDICADORES'!C236^2","v":{"v":0.2066,"d":"0.21"}},{"$f":"K260+K261*'2 INDICADORES'!C236","v":{"v":1.075,"d":"1.08"}},{"$f":"IF(AND('2 INDICADORES'!C236>41,'2 INDICADORES'!C236<120),G263,IF('2 INDICADORES'!C236>=120,H263,F263))","v":{"v":0.1,"d":"0.10"}}]
[null,{"v":120,"d":"120.00"},{"v":1,"d":"1.00"}]
[null,{"v":600,"d":"600.00"},{"v":0.7,"d":"0.70"}]
[null,"K - Representação Gráfica"]
{"$rows_empty":8}
[null,"pH - Fator Ponderação",null,null,"pH - Fórmulas"]
[null,"Classificação","Ponderação",null,"F1 = Yo + ax + bx2 ",null,null,"F2 = Yo + ax + bx2 "]
[null,{"v":5.1,"d":"5.10"},{"v":0.3,"d":"0.30"},null,"Yo",{"v":-19.1,"d":"-19.10"},null,"Yo",{"v":-42.5,"d":"-42.50"}]
[null,{"v":5.2,"d":"5.20"},{"v":0.4,"d":"0.40"},null,"a",6.35,null,"a",14.75]
[null,{"v":5.5,"d":"5.50"},{"v":0.7,"d":"0.70"},null,"b",{"v":-0.5,"d":"-0.50"},null,"b",-1.25]
[null,{"v":6,"d":"6.00"},{"v":1,"d":"1.00"},null,"Atual",{"$f":"-4.8+(1*'2 INDICADORES'!C237)","v":{"v":-4.8,"d":"-4.80"}},{"$f":"F277+F278*'2 INDICADORES'!C237+F279*'2 INDICADORES'!C237^2","v":{"v":-19.1,"d":"-19.10"}},{"$f":"I277+I278*'2 INDICADORES'!C237+I279*'2 INDICADORES'!C237^2","v":{"v":-42.5,"d":"-42.50"}},{"$f":"IF('2 INDICADORES'!C237>=6.6,J280,IF(AND('2 INDICADORES'!C237>=6,'2 INDICADORES'!C237<6.6),H280,IF(AND('2 INDICADORES'!C237>5.2,'2 INDICADORES'!C237<6),G280,F280)))","v":{"v":-4.8,"d":"-4.80"}},{"$f":"7+(-1*'2 INDICADORES'!C237)","v":{"v":7,"d":"7.00"}}]
[null,{"v":6.4,"d":"6.40"},{"v":0.7,"d":"0.70"}]
[null,"pH - Representação Gráfica"]
{"$rows_empty":8}
[null,"Al - Fator Ponderação",null,null,"Al - Fórmulas"]
[null,"Classificação","Ponderação",null,"F1 = Yo + ax + bx2 ",null,null,"F2 = Yo + ax + bx2 "]
[null,{"v":0,"d":"0.00"},{"v":0.7,"d":"0.70"},null,"Yo",{"v":0.7,"d":"0.70"},null,"Yo",{"v":0.8406,"d":"0.84"}]
[null,0.21,{"v":0.6,"d":"0.60"},null,"a",{"v":-0.535,"d":"-0.54"},null,"a",{"v":-0.7525,"d":"-0.75"}]
[null,0.51,{"v":0.5,"d":"0.50"},null,"b",{"v":0.2801,"d":"0.28"},null,"b",{"v":0.1661,"d":"0.17"}]
[null,1.01,0.25,null,"Atual",{"$f":"F293+F294*'2 INDICADORES'!C238+F295*'2 INDICADORES'!C238^2","v":{"v":0.7,"d":"0.70"}},{"$f":"I293+I294*'2 INDICADORES'!C238+I295*'2 INDICADORES'!C238^2","v":{"v":0.8406,"d":"0.84"}},{"$f":"IF('2 INDICADORES'!C238>=0.51,G296,F296)","v":{"v":0.7,"d":"0.70"}}]
[null,{"v":2,"d":"2.00"},{"v":0,"d":"0.00"}]
[]
[null,"Al - Representação Gráfica"]
{"$rows_empty":8}
[null,"CTC - Fator Ponderação",null,null,"CTC - Fórmulas"]
[null,"Classificação","Ponderação",null,"F1 = Yo + ax + bx2 ",null,null,"F2 = Yo + ax + bx2 "]
[null,{"v":0,"d":"0.00"},{"v":0.1,"d":"0.10"},null,"Yo",{"v":0.302,"d":"0.30"},null,"Yo",{"v":0.1,"d":"0.10"}]
[null,0.81,0.25,null,"a",{"v":0.0851,"d":"0.09"},null,"a",{"v":0.1917,"d":"0.19"}]
[null,2.31,{"v":0.5,"d":"0.50"},null,"b",{"v":0.0003,"d":"0.00"},null,"b",{"v":-0.008,"d":"-0.01"}]
[null,4.61,{"v":0.7,"d":"0.70"},null,"Atual",{"$f":"F310+F311*'2 INDICADORES'!C239+F312*'2 INDICADORES'!C239^2","v":{"v":0.302,"d":"0.30"}},{"$f":"I310+I311*'2 INDICADORES'!C239+I312*'2 INDICADORES'!C239^2","v":{"v":0.1,"d":"0.10"}},{"$f":"IF('2 INDICADORES'!C239<=2.31,G313,F313)","v":{"v":0.1,"d":"0.10"}}]
[null,{"v":8,"d":"8.00"},{"v":1,"d":"1.00"}]
[]
[null,"CTC - Representação Gráfica"]
{"$rows_empty":8}
[null,"V - Fator Ponderação",null,null,"V - Fórmulas"]
[null,"Classificação","Ponderação",null,"Fórmula1 = Yo + ax ",null,"Fórmula2 = Yo + ax+bx2 "]
[null,{"v":0,"d":"0.00"},{"v":0.1,"d":"0.10"},null,"Yo",{"v":0.3,"d":"0.30"},null,"Yo",{"v":0.1,"d":"0.10"}]
[null,{"v":15,"d":"15.00"},0.25,null,"a",{"v":0.0067,"d":"0.01"},null,"a",{"v":0.0067,"d":"0.01"}]
[null,{"v":30,"d":"30.00"},{"v":0.5,"d":"0.50"},{"$nulls":4},"b",{"v":0.0002,"d":"0.00"}]
[null,{"v":60,"d":"60.00"},{"v":0.7,"d":"0.70"},null,"Atual",{"$f":"F327+F328*'2 INDICADORES'!C240","v":{"v":0.3,"d":"0.30"}},{"$f":"I327+I328*'2 INDICADORES'!C240+I329*'2 INDICADORES'!C240^2","v":{"v":0.1,"d":"0.10"}},{"$f":"IF('2 INDICADORES'!C240<30,G330,F330)","v":{"v":0.1,"d":"0.10"}}]
[null,{"v":61,"d":"61.00"},{"v":1,"d":"1.00"}]
[]
[null,"V - Representação Gráfica"]
{"$rows_empty":8}
[null,"12 - Fórmulas"]
[null,"Fórmula - Média dos resultados parciais dos itens 12.2, 12.3 e 12.10 = (G257 +C260 +C267)/3"]
[]
[]
[]
[null,"CONVERSÃO DE UNIDADES",{"$nulls":6},"de","para",null,"de","para"]
[null,null,"Unidade","Unidade","Fator de conversão",{"$nulls":3},"%; dag/kg","g/dm3; g/kg; g/L",null,"g/dm3; g/kg; g/L","%; dag/kg"]
[null,"Teor de argila","%; dag/kg","g/dm3; g/kg; g/L",10,{"$nulls":4},{"$f":"I349*10","v":0},null,null,{"$f":"L349/10","v":0}]
[null,"Matéria Orgânica","%; dag/kg","g/dm3; g/kg; g/L",10,{"$nulls":4},{"$f":"I350*10","v":0},null,null,{"$f":"L350/10","v":0}]
[null,null,"de","para"]
[null,null,"Unidade","Unidade","Fator de conversão"]
[null,"P disponível","mg/dm3; mg/kg; mg/L","ppm",1]
[null,"K trocável","mg/dm3; mg/kg; mg/L","ppm",1]
[null,null,"de","para",{"$nulls":4},"de","para",null,"de","para"]
[null,null,"Unidade","Unidade","Fator de conversão",{"$nulls":3},"cmolc/dm3","mmolc/dm3",null,"mmolc/dm3","cmolc/dm3"]
[null,"Ca trocável","cmolc/dm3; meq/100 cm3; meq/ 100ml; meq/ 100g","mmolc/dm3; mmolc/kg",10,{"$nulls":4},{"$f":"I357*10","v":0},null,null,{"$f":"L357/10","v":0}]
[null,"Mg trocável","cmolc/dm3. meq/100 cm3; meq/ 100ml; meq/ 100g","mmolc/dm3; mmolc/kg",10,{"$nulls":4},{"$f":"I358*10","v":0},null,null,{"$f":"L358/10","v":0}]
[null,"Al trocável","cmolc/dm3. meq/100 cm3; meq/ 100ml; meq/ 100g","mmolc/dm3; mmolc/kg",10,{"$nulls":4},{"$f":"I359*10","v":0},null,null,{"$f":"L359/10","v":0}]
[null,"CTC efetiva","cmolc/dm3. meq/100 cm3; meq/ 100ml; meq/ 100g","mmolc/dm3; mmolc/kg",10,{"$nulls":4},{"$f":"I360*10","v":0},null,null,{"$f":"L360/10","v":0}]
[null,null,"de","para"]
[null,null,"Unidade","Unidade","Fator de conversão"]
[null,"Macronutrientes","%","g/kg",10]
[null,"Micronutrientes","ppm","mg/kg",1]
[null,"Fósforo","Kg de P2O5","Kg de P",0.437]
[null,"Potássio","Kg de K2O","Kg de K",{"v":0.83,"d":"0.830"}]
[null,"Cálcio","Kg de CaO","Kg de Ca",0.715]
[null,"Magnésio","Kg de MgO","Kg de Mg",0.602]
[]
[13,"Fórmulas",{"$nulls":4},"pH - Padrões Estabelecidos",{"$nulls":4},"Vegetação nativa"]
[null,"Classificação1","Ponderação2","",null,null," Res. CONAMA 357/05",null,"Portaria 518/04 M.S.*",null,null,"Pastagem; agricultura; reflorestamento"]
[null,"entre 6 e 9,0",0.7,{"$nulls":3},"Entre  6 e 9 para todas as classes",null,"Entre  6 e 9,5 na distribuição para consumo humano",null,null,"Residencial"]
[null,"pH < 6 e > 9,0",0.3,{"$nulls":8},"Ausente"]
[{"$nulls":11},"Alterações de origem doméstica (esgoto, lixo)"]
[null,{"$f":"IF(('2 INDICADORES'!D279>=6)*OR('2 INDICADORES'!D279<=9),0.7,0.3)","v":{"v":0.3,"d":"0.30"}},{"$f":"IF(('2 INDICADORES'!D280>=6)*OR('2 INDICADORES'!D280<=9),0.7,0.3)","v":{"v":0.3,"d":"0.30"}},{"$nulls":5},"* Ministério da Saúde",null,null,"Industrial; urbana"]
[{"$nulls":11},"Parcial"]
[{"$nulls":11},"Total"]
[{"$nulls":11},"Ausente"]
[null,"Fórmulas",{"$nulls":4},"Coliformes fecais - Padrões ",{"$nulls":4},"Ausente"]
[null,"Classificação1","Ponderação2",{"$nulls":3}," Res. CONAMA 357/05",null,"Portaria 518/04 M.S.*",null,null,"Moderada"]
[null,"UFC < 1.000",0.7,{"$nulls":3},"Valor máximo - 1.000 coliformes fecais por  100 mililitros em 80% ou mais de pelo menos 06 amostras",null,"Para abastecimento humano deve haver ausência em amostra de 100 ml (VMP)",null,null,"Acentuada"]
[null,"UFC > 1.000",0.1,{"$nulls":8},"Transparente"]
[{"$nulls":11},"Turva, cor de chá forte"]
[null,{"$f":"IF(('2 INDICADORES'!D281<=999),0.7,0.1)","v":{"v":0.7,"d":"0.70"}},{"$f":"IF(('2 INDICADORES'!D282<=999),0.7,0.1)","v":{"v":0.7,"d":"0.70"}},{"$nulls":8},"Opaca ou colorida"]
[{"$nulls":11},"Nenhum"]
[{"$nulls":11},"Esgoto"]
[{"$nulls":11},"Óleo/Industrial"]
[null,"Fórmulas",{"$nulls":4},"Turbidez - Padrões Estabelecidos",{"$nulls":4},"Pedras/ cascalho"]
[null,"Classificação1",null,"Ponderação2",null,null," Res. CONAMA 357/05",null,"Portaria 518/04 M.S.*",null,null,"Lama/areia"]
[null,"até 100 UNT",null,0.7,null,null,"Ambiente lêntico até 100 UNT para a classe 2",null,"Turbidez - 5 UNT na distribuição para consumo humano",null,null,"Cimento/ canalizado"]
[null,"acima de 100 UNT",null,0.1]
[]
[null,{"$f":"IF(('2 INDICADORES'!D285<=100),0.7,0.1)","v":{"v":0.7,"d":"0.70"}},{"$f":"IF(('2 INDICADORES'!D286<=100),0.7,0.1)","v":{"v":0.7,"d":"0.70"}}]
[]
[]
[null,"Fórmulas",{"$nulls":4},"Nitrato - Padrões Estabelecidos"]
[null,"Classificação1",null,"Ponderação2",null,null," Res. CONAMA 357/05",null,"Portaria 518/04 M.S.*"]
[null,"até 10 mg/L N",null,0.7,null,null,"Valor máximo 10 mg/L N",null,"Valor máximo de NO3- para classe 2: 44,3 mg/L "]
[null,"acima de 10 mg/L N ",null,0.1]
[]
[null,{"$f":"IF(('2 INDICADORES'!D283<=9.99),0.7,0.1)","v":{"v":0.7,"d":"0.70"}},{"$f":"IF(('2 INDICADORES'!D284<=9.99),0.7,0.1)","v":{"v":0.7,"d":"0.70"}}]
[]
[null,"Fórmulas"]
[null,"Indicadores do item 31.1: campos marcados a montante e a jusante, multiplicado pelo peso das colunas (esquerda peso 4, do meio peso 2 e da direita 0) e multiplicado pelos fatores de ponderação de cada item. Os valores totais foram transformados no intervalo de 0 a 100"]
[{"$nulls":9},{"$f":"IF('2 INDICADORES'!F279=\"\",0,'2 INDICADORES'!F279*'2 INDICADORES'!G289)+IF('2 INDICADORES'!F285=\"\",0,'2 INDICADORES'!F285*'2 INDICADORES'!G285)+IF('2 INDICADORES'!F281=\"\",0,'2 INDICADORES'!F281*'2 INDICADORES'!G281)+IF('2 INDICADORES'!F283=\"\",0,'2 INDICADORES'!F283*'2 INDICADORES'!G283)+IF('2 INDICADORES'!D288=\"\",0,'2 INDICADORES'!D288*'2 INDICADORES'!G288)","v":{"v":0,"d":"0.00"}},{"$f":"IF('2 INDICADORES'!F279=\"\",0,'2 INDICADORES'!G289)+IF('2 INDICADORES'!F285=\"\",0,'2 INDICADORES'!G285)+IF('2 INDICADORES'!F281=\"\",0,'2 INDICADORES'!G281)+IF('2 INDICADORES'!F283=\"\",0,'2 INDICADORES'!G283)+IF('2 INDICADORES'!D288=\"\",0,'2 INDICADORES'!G288)","v":4},{"$f":"+FÓRMULAS!J405/K405","v":{"v":0,"d":"0.00"}}]
[{"$nulls":9},{"$f":"IF('2 INDICADORES'!F280=\"\",0,'2 INDICADORES'!F280*'2 INDICADORES'!G289)+IF('2 INDICADORES'!F286=\"\",0,'2 INDICADORES'!F286*'2 INDICADORES'!G285)+IF('2 INDICADORES'!F282=\"\",0,'2 INDICADORES'!F282*'2 INDICADORES'!G281)+IF('2 INDICADORES'!F284=\"\",0,'2 INDICADORES'!F284*'2 INDICADORES'!G283)+IF('2 INDICADORES'!D289=\"\",0,'2 INDICADORES'!D289*'2 INDICADORES'!G288)","v":{"v":0,"d":"0.00"}},{"$f":"IF('2 INDICADORES'!F280=\"\",0,'2 INDICADORES'!G289)+IF('2 INDICADORES'!F286=\"\",0,'2 INDICADORES'!G285)+IF('2 INDICADORES'!F282=\"\",0,'2 INDICADORES'!G281)+IF('2 INDICADORES'!F284=\"\",0,'2 INDICADORES'!G283)+IF('2 INDICADORES'!D289=\"\",0,'2 INDICADORES'!G288)","v":4},{"$f":"+FÓRMULAS!J406/K406","v":{"v":0,"d":"0.00"}}]
[]
[]
[null,"Fórmula resultado parcial"]
[null,"Média dos resultados dos parâmetros do item 13.1 considerando os fatores de ponderação em cada item"]
[{"$nulls":5},{"$f":"IF('2 INDICADORES'!D291<'2 INDICADORES'!D292,'2 INDICADORES'!D291,'2 INDICADORES'!D292)","v":{"v":0,"d":"0.00"}}]
[]
[null,"Fórmulas",null,null,"pH - Padrões Estabelecidos"]
[null,"Classificação1","Ponderação2",null,"Portaria 518/04 M.S.*"]
[null,"entre 6 e 9,5",0.7,null,"Entre  6 e 9,5 na distribuição para consumo humano"]
[null,"pH < 6 e > 9,5",0.3]
[null,"1Portaria 518/04 Ministério da Saúde"]
[null,{"$f":"IF(('2 INDICADORES'!C296>=6)*OR('2 INDICADORES'!C296<=9.5),0.7,0.3)","v":{"v":0.3,"d":"0.30"}}]
[]
[null,"Fórmulas",null,null,"Padrões Estabelecidos"]
[null,"Classificação1","Ponderação2",null," Res. CONAMA 396/08",null,"Portaria 518/04 M.S.*"]
[null,"ausente",0.7,null,"Para abastecimento humano - ausência em amostra de 100 mL (VMP); para dessedentação de animais 200/100 mL",null,"Para abastecimento humano deve haver ausência em amostra de 100 mL (VMP)"]
[null,">0",0.1]
[null,{"$f":"IF('2 INDICADORES'!C297=0,0.701,0.1)","v":{"v":0.701,"d":"0.70"}}]
[]
[]
[]
[null,"Fórmulas",null,null,"Padrões Estabelecidos"]
[null,"Classificação1","Ponderação2",null," Res. CONAMA 396/08",null,"Portaria 518/04 M.S.*"]
[null,"<= 10",0.7,null,"Segundo essa resolução o valor máximo permitido (VMP) para consumo humano é de 10 mg.  L-1 de N)",null,"Valor máximo permitido 10 mg L-1 de N"]
[null,"> 10",0.1]
[null,{"$f":"IF('2 INDICADORES'!C298<=10,0.701,0.1)","v":{"v":0.701,"d":"0.70"}}]
[]
[]
[]
[null,"Fórmula resultado parcial",{"$nulls":3},"Fórmula resultado final"]
[null,"Média dos resultados dos parâmetros do item 13.2 e média dos resultados dos parâmetros do item 12.3",{"$nulls":3},"Fórmula - resultado parcial da qualidade da água superficial x 2 + resultado superficial da qualidade da água subterrânea/3"]
[]
[]
[14,"Fator de Ponderação"]
[null,"Classificação1","Ponderação2"]
[null,"não utiliza",{"v":1,"d":"1.0"},null,"Vulnerabilidade do talhão: item 14.1  = 1 a 3 (1); 4 a 9 (2); 12 a 27 (3)"]
[null,"Rc: 1 a 2",{"v":0.6,"d":"0.60"}]
[null,"Rc: 2 e 4",{"v":0.3,"d":"0.30"}]
[null,"Rc: 6 e 9",{"v":0.1,"d":"0.10"}]
[]
[null,"Fórmulas"]
[null,null,{"$f":"'2 INDICADORES'!D304","v":{"v":0,"d":"0.00"}},{"$f":"'2 INDICADORES'!E304","v":{"v":0,"d":"0.00"}},{"$f":"'2 INDICADORES'!F304","v":{"v":0,"d":"0.00"}},null,null,{"$f":"FÓRMULAS!D473","v":{"v":0,"d":"0.00"}},{"$f":"FÓRMULAS!E473","v":{"v":0,"d":"0.00"}},{"$f":"FÓRMULAS!F473","v":{"v":0,"d":"0.00"}},{"$f":"FÓRMULAS!G473","v":{"v":0,"d":"0.00"}},{"$f":"FÓRMULAS!H473","v":{"v":0,"d":"0.00"}},{"$f":"FÓRMULAS!I473","v":{"v":0,"d":"0.00"}},{"$f":"FÓRMULAS!J473","v":{"v":0,"d":"0.00"}}]
[null,"Pci",{"$f":"IF('2 INDICADORES'!D313>0.001,((1/LOG10('2 INDICADORES'!D313))*(LOG10('2 INDICADORES'!D314))*'2 INDICADORES'!D312),\" \")","v":{"$error":"#VALUE!"}},{"$f":"IF('2 INDICADORES'!E313>0.001,((1/LOG10('2 INDICADORES'!E313))*(LOG10('2 INDICADORES'!E314))*'2 INDICADORES'!E312),\" \")","v":{"$error":"#VALUE!"}},{"$f":"IF('2 INDICADORES'!F313>0.001,((1/LOG10('2 INDICADORES'!F313))*(LOG10('2 INDICADORES'!F314))*'2 INDICADORES'!F312),\" \")","v":{"$error":"#VALUE!"}},null,null,{"$f":"IF(FÓRMULAS!D483>0.001,((1/LOG10(FÓRMULAS!D483))*(LOG10(FÓRMULAS!D484))*FÓRMULAS!D482),\" \")","v":{"$error":"#VALUE!"}},{"$f":"IF(FÓRMULAS!E483>0.001,((1/LOG10(FÓRMULAS!E483))*(LOG10(FÓRMULAS!E484))*FÓRMULAS!E482),\" \")","v":{"$error":"#VALUE!"}},{"$f":"IF(FÓRMULAS!F483>0.001,((1/LOG10(FÓRMULAS!F483))*(LOG10(FÓRMULAS!F484))*FÓRMULAS!F482),\" \")","v":{"$error":"#VALUE!"}},{"$f":"IF(FÓRMULAS!G483>0.001,((1/LOG10(FÓRMULAS!G483))*(LOG10(FÓRMULAS!G484))*FÓRMULAS!G482),\" \")","v":{"$error":"#VALUE!"}},{"$f":"IF(FÓRMULAS!H483>0.001,((1/LOG10(FÓRMULAS!H483))*(LOG10(FÓRMULAS!H484))*FÓRMULAS!H482),\" \")","v":{"$error":"#VALUE!"}},{"$f":"IF(FÓRMULAS!I483>0.001,((1/LOG10(FÓRMULAS!I483))*(LOG10(FÓRMULAS!I484))*FÓRMULAS!I482),\" \")","v":{"$error":"#VALUE!"}},{"$f":"IF(FÓRMULAS!J483>0.001,((1/LOG10(FÓRMULAS!J483))*(LOG10(FÓRMULAS!J484))*FÓRMULAS!J482),\" \")","v":{"$error":"#VALUE!"}}]
[null,"vulnerabilidade",{"$f":"IF('2 INDICADORES'!D323>0.001,('2 INDICADORES'!D323*'2 INDICADORES'!D324*'2 INDICADORES'!D325),0)","v":{"v":0,"d":"0.00"}},{"$f":"IF('2 INDICADORES'!E323>0.001,('2 INDICADORES'!E323*'2 INDICADORES'!E324*'2 INDICADORES'!E325),0)","v":{"v":0,"d":"0.00"}},{"$f":"IF('2 INDICADORES'!F323>0.001,('2 INDICADORES'!F323*'2 INDICADORES'!F324*'2 INDICADORES'!F325),0)","v":{"v":0,"d":"0.00"}},null,null,{"$f":"IF(FÓRMULAS!D493>0.001,(FÓRMULAS!D493*FÓRMULAS!D494*FÓRMULAS!D495),0)","v":{"v":0,"d":"0.00"}},{"$f":"IF(FÓRMULAS!E493>0.001,(FÓRMULAS!E493*FÓRMULAS!E494*FÓRMULAS!E495),0)","v":{"v":0,"d":"0.00"}},{"$f":"IF(FÓRMULAS!F493>0.001,(FÓRMULAS!F493*FÓRMULAS!F494*FÓRMULAS!F495),0)","v":{"v":0,"d":"0.00"}},{"$f":"IF(FÓRMULAS!G493>0.001,(FÓRMULAS!G493*FÓRMULAS!G494*FÓRMULAS!G495),0)","v":{"v":0,"d":"0.00"}},{"$f":"IF(FÓRMULAS!H493>0.001,(FÓRMULAS!H493*FÓRMULAS!H494*FÓRMULAS!H495),0)","v":{"v":0,"d":"0.00"}},{"$f":"IF(FÓRMULAS!I493>0.001,(FÓRMULAS!I493*FÓRMULAS!I494*FÓRMULAS!I495),0)","v":{"v":0,"d":"0.00"}},{"$f":"IF(FÓRMULAS!J493>0.001,(FÓRMULAS!J493*FÓRMULAS!J494*FÓRMULAS!J495),0)","v":{"v":0,"d":"0.00"}}]
[]
[null,"Risco",{"$f":"IF('2 INDICADORES'!D326>0.01,('2 INDICADORES'!D326*'2 INDICADORES'!D316),\" \")","v":{"$error":"#VALUE!"}},{"$f":"IF('2 INDICADORES'!E326>0.01,('2 INDICADORES'!E326*'2 INDICADORES'!E316),\" \")","v":{"$error":"#VALUE!"}},{"$f":"IF('2 INDICADORES'!F326>0.01,('2 INDICADORES'!F326*'2 INDICADORES'!F316),\" \")","v":{"$error":"#VALUE!"}},null,null,{"$f":"IF(FÓRMULAS!D496>0.01,(FÓRMULAS!D496*FÓRMULAS!D486),\" \")","v":{"$error":"#VALUE!"}},{"$f":"IF(FÓRMULAS!E496>0.01,(FÓRMULAS!E496*FÓRMULAS!E486),\" \")","v":{"$error":"#VALUE!"}},{"$f":"IF(FÓRMULAS!F496>0.01,(FÓRMULAS!F496*FÓRMULAS!F486),\" \")","v":{"$error":"#VALUE!"}},{"$f":"IF(FÓRMULAS!G496>0.01,(FÓRMULAS!G496*FÓRMULAS!G486),\" \")","v":{"$error":"#VALUE!"}},{"$f":"IF(FÓRMULAS!H496>0.01,(FÓRMULAS!H496*FÓRMULAS!H486),\" \")","v":{"$error":"#VALUE!"}},{"$f":"IF(FÓRMULAS!I496>0.01,(FÓRMULAS!I496*FÓRMULAS!I486),\" \")","v":{"$error":"#VALUE!"}},{"$f":"IF(FÓRMULAS!J496>0.01,(FÓRMULAS!J496*FÓRMULAS!J486),\" \")","v":{"$error":"#VALUE!"}}]
[null,{"$f":"IF(C449=B456,C450,IF(D449=B456,D450,IF(E449=B456,E450,IF(F449=B456,F450,IF(G449=B456,G450,IF(H449=B456,H450,IF(I449=B456,I450,IF(J449=B456,J450,IF(K449=B456,K450,IF(L449=B456,L450,IF(M449=B456,M450,IF(N449=B456,N450,IF(FÓRMULAS!B461=B456,FÓRMULAS!B462,IF(FÓRMULAS!C461=B456,FÓRMULAS!C462,IF('2 INDICADORES'!BT307=B456,'2 INDICADORES'!BT308,IF(FÓRMULAS!D461=B456,FÓRMULAS!D462,IF(FÓRMULAS!E461=B456,FÓRMULAS!E462,IF(FÓRMULAS!F461=B456,FÓRMULAS!F462,IF(FÓRMULAS!G461=B456,FÓRMULAS!G462,IF(FÓRMULAS!H461=B456,FÓRMULAS!H462,IF(FÓRMULAS!I461=B456,FÓRMULAS!I462,IF(FÓRMULAS!J461=B456,FÓRMULAS!J462,IF(FÓRMULAS!K461=B456,FÓRMULAS!K462,IF(FÓRMULAS!L461=B456,FÓRMULAS!L462,IF(FÓRMULAS!M461=B456,FÓRMULAS!M462,IF(FÓRMULAS!N461=B456,FÓRMULAS!N462,IF(FÓRMULAS!B467=B456,FÓRMULAS!B468,IF(FÓRMULAS!C467=B456,FÓRMULAS!C468,IF(FÓRMULAS!D467=B456,FÓRMULAS!D468)))))))))))))))))))))))))))))","v":{"$error":"#VALUE!"}}]
[]
[null,"Cálculo do risco"]
[null,{"$f":"MAX(C449:N449)","v":{"$error":"#VALUE!"}}]
[null,{"$f":"IF(OR(B456=0.83,B456<0.83),1,IF(OR(AND(0.83<B456,B456<=1.66)),2,IF(B456>1.66,3,\"\")))","v":{"$error":"#VALUE!"}},{"$f":"B453","v":{"$error":"#VALUE!"}}]
[null,{"$f":"B457*C458","v":{"$error":"#VALUE!"}},{"$f":"IF(OR(AND(1<=C457,C457<=3)),1,IF(OR(AND(3<C457,C457<=9)),2,IF(C457>9,3)))","v":{"$error":"#VALUE!"}}]
[]
[null,{"$f":"FÓRMULAS!K473","v":{"v":0,"d":"0.00"}},{"$f":"FÓRMULAS!L473","v":{"v":0,"d":"0.00"}},{"$f":"FÓRMULAS!D501","v":{"v":0,"d":"0.00"}},{"$f":"FÓRMULAS!E501","v":{"v":0,"d":"0.00"}},{"$f":"FÓRMULAS!F501","v":{"v":0,"d":"0.00"}},{"$f":"FÓRMULAS!G501","v":{"v":0,"d":"0.00"}},{"$f":"FÓRMULAS!H501","v":{"v":0,"d":"0.00"}},{"$f":"FÓRMULAS!I501","v":{"v":0,"d":"0.00"}},{"$f":"FÓRMULAS!J501","v":{"v":0,"d":"0.00"}},{"$f":"FÓRMULAS!K501","v":{"v":0,"d":"0.00"}},{"$f":"FÓRMULAS!L501","v":{"v":0,"d":"0.00"}},{"$f":"FÓRMULAS!D528","v":{"v":0,"d":"0.00"}},{"$f":"FÓRMULAS!E528","v":{"v":0,"d":"0.00"}}]
[null,{"$f":"IF(FÓRMULAS!K483>0.001,((1/LOG10(FÓRMULAS!K483))*(LOG10(FÓRMULAS!K484))*FÓRMULAS!K482),\" \")","v":{"$error":"#VALUE!"}},{"$f":"IF(FÓRMULAS!L483>0.001,((1/LOG10(FÓRMULAS!L483))*(LOG10(FÓRMULAS!L484))*FÓRMULAS!L482),\" \")","v":{"$error":"#VALUE!"}},{"$f":"IF(FÓRMULAS!D511>0.001,((1/LOG10(FÓRMULAS!D511))*(LOG10(FÓRMULAS!D512))*FÓRMULAS!D510),\" \")","v":{"$error":"#VALUE!"}},{"$f":"IF(FÓRMULAS!E511>0.001,((1/LOG10(FÓRMULAS!E511))*(LOG10(FÓRMULAS!E512))*FÓRMULAS!E510),\" \")","v":{"$error":"#VALUE!"}},{"$f":"IF(FÓRMULAS!F511>0.001,((1/LOG10(FÓRMULAS!F511))*(LOG10(FÓRMULAS!F512))*FÓRMULAS!F510),\" \")","v":{"$error":"#VALUE!"}},{"$f":"IF(FÓRMULAS!G511>0.001,((1/LOG10(FÓRMULAS!G511))*(LOG10(FÓRMULAS!G512))*FÓRMULAS!G510),\" \")","v":{"$error":"#VALUE!"}},{"$f":"IF(FÓRMULAS!H511>0.001,((1/LOG10(FÓRMULAS!H511))*(LOG10(FÓRMULAS!H512))*FÓRMULAS!H510),\" \")","v":{"$error":"#VALUE!"}},{"$f":"IF(FÓRMULAS!I511>0.001,((1/LOG10(FÓRMULAS!I511))*(LOG10(FÓRMULAS!I512))*FÓRMULAS!I510),\" \")","v":{"$error":"#VALUE!"}},{"$f":"IF(FÓRMULAS!J511>0.001,((1/LOG10(FÓRMULAS!J511))*(LOG10(FÓRMULAS!J512))*FÓRMULAS!J510),\" \")","v":{"$error":"#VALUE!"}},{"$f":"IF(FÓRMULAS!K511>0.001,((1/LOG10(FÓRMULAS!K511))*(LOG10(FÓRMULAS!K512))*FÓRMULAS!K510),\" \")","v":{"$error":"#VALUE!"}},{"$f":"IF(FÓRMULAS!L511>0.001,((1/LOG10(FÓRMULAS!L511))*(LOG10(FÓRMULAS!L512))*FÓRMULAS!L510),\" \")","v":{"$error":"#VALUE!"}},{"$f":"IF(FÓRMULAS!D538>0.001,((1/LOG10(FÓRMULAS!D538))*(LOG10(FÓRMULAS!D539))*FÓRMULAS!D537),\" \")","v":{"$error":"#VALUE!"}},{"$f":"IF(FÓRMULAS!E538>0.001,((1/LOG10(FÓRMULAS!E538))*(LOG10(FÓRMULAS!E539))*FÓRMULAS!E537),\" \")","v":{"$error":"#VALUE!"}}]
[null,{"$f":"IF(FÓRMULAS!K493>0.001,(FÓRMULAS!K493*FÓRMULAS!K494*FÓRMULAS!K495),0)","v":{"v":0,"d":"0.00"}},{"$f":"IF(FÓRMULAS!L493>0.001,(FÓRMULAS!L493*FÓRMULAS!L494*FÓRMULAS!L495),0)","v":{"v":0,"d":"0.00"}},{"$f":"IF(FÓRMULAS!D521>0.001,(FÓRMULAS!D521*FÓRMULAS!D522*FÓRMULAS!D523),0)","v":{"v":0,"d":"0.00"}},{"$f":"IF(FÓRMULAS!E521>0.001,(FÓRMULAS!E521*FÓRMULAS!E522*FÓRMULAS!E523),0)","v":{"v":0,"d":"0.00"}},{"$f":"IF(FÓRMULAS!F521>0.001,(FÓRMULAS!F521*FÓRMULAS!F522*FÓRMULAS!F523),0)","v":{"v":0,"d":"0.00"}},{"$f":"IF(FÓRMULAS!G521>0.001,(FÓRMULAS!G521*FÓRMULAS!G522*FÓRMULAS!G523),0)","v":{"v":0,"d":"0.00"}},{"$f":"IF(FÓRMULAS!H521>0.001,(FÓRMULAS!H521*FÓRMULAS!H522*FÓRMULAS!H523),0)","v":{"v":0,"d":"0.00"}},{"$f":"IF(FÓRMULAS!I521>0.001,(FÓRMULAS!I521*FÓRMULAS!I522*FÓRMULAS!I523),0)","v":{"v":0,"d":"0.00"}},{"$f":"IF(FÓRMULAS!J521>0.001,(FÓRMULAS!J521*FÓRMULAS!J522*FÓRMULAS!J523),0)","v":{"v":0,"d":"0.00"}},{"$f":"IF(FÓRMULAS!K521>0.001,(FÓRMULAS!K521*FÓRMULAS!K522*FÓRMULAS!K523),0)","v":{"v":0,"d":"0.00"}},{"$f":"IF(FÓRMULAS!L521>0.001,(FÓRMULAS!L521*FÓRMULAS!L522*FÓRMULAS!L523),0)","v":{"v":0,"d":"0.00"}},{"$f":"IF(FÓRMULAS!D548>0.001,(FÓRMULAS!D548*FÓRMULAS!D549*FÓRMULAS!D550),0)","v":{"v":0,"d":"0.00"}},{"$f":"IF(FÓRMULAS!E548>0.001,(FÓRMULAS!E548*FÓRMULAS!E549*FÓRMULAS!E550),0)","v":{"v":0,"d":"0.00"}}]
[]
[null,{"$f":"IF(FÓRMULAS!K496>0.01,(FÓRMULAS!K496*FÓRMULAS!K486),\" \")","v":{"$error":"#VALUE!"}},{"$f":"IF(FÓRMULAS!L496>0.01,(FÓRMULAS!L496*FÓRMULAS!L486),\" \")","v":{"$error":"#VALUE!"}},{"$f":"IF(FÓRMULAS!D524>0.01,(FÓRMULAS!D524*FÓRMULAS!D514),\" \")","v":{"$error":"#VALUE!"}},{"$f":"IF(FÓRMULAS!E524>0.01,(FÓRMULAS!E524*FÓRMULAS!E514),\" \")","v":{"$error":"#VALUE!"}},{"$f":"IF(FÓRMULAS!F524>0.01,(FÓRMULAS!F524*FÓRMULAS!F514),\" \")","v":{"$error":"#VALUE!"}},{"$f":"IF(FÓRMULAS!G524>0.01,(FÓRMULAS!G524*FÓRMULAS!G514),\" \")","v":{"$error":"#VALUE!"}},{"$f":"IF(FÓRMULAS!H524>0.01,(FÓRMULAS!H524*FÓRMULAS!H514),\" \")","v":{"$error":"#VALUE!"}},{"$f":"IF(FÓRMULAS!I524>0.01,(FÓRMULAS!I524*FÓRMULAS!I514),\" \")","v":{"$error":"#VALUE!"}},{"$f":"IF(FÓRMULAS!J524>0.01,(FÓRMULAS!J524*FÓRMULAS!J514),\" \")","v":{"$error":"#VALUE!"}},{"$f":"IF(FÓRMULAS!K524>0.01,(FÓRMULAS!K524*FÓRMULAS!K514),\" \")","v":{"$error":"#VALUE!"}},{"$f":"IF(FÓRMULAS!L524>0.01,(FÓRMULAS!L524*FÓRMULAS!L514),\" \")","v":{"$error":"#VALUE!"}},{"$f":"IF(FÓRMULAS!D551>0.01,(FÓRMULAS!D551*FÓRMULAS!D541),\" \")","v":{"$error":"#VALUE!"}},{"$f":"IF(FÓRMULAS!E551>0.01,(FÓRMULAS!E551*FÓRMULAS!E541),\" \")","v":{"$error":"#VALUE!"}}]
[]
[null,{"$f":"FÓRMULAS!F528","v":{"v":0,"d":"0.00"}},{"$f":"FÓRMULAS!G528","v":{"v":0,"d":"0.00"}},{"$f":"FÓRMULAS!H528","v":{"v":0,"d":"0.00"}}]
[null,{"$f":"IF(FÓRMULAS!F538>0.001,((1/LOG10(FÓRMULAS!F538))*(LOG10(FÓRMULAS!F539))*FÓRMULAS!F537),\" \")","v":{"$error":"#VALUE!"}},{"$f":"IF(FÓRMULAS!G538>0.001,((1/LOG10(FÓRMULAS!G538))*(LOG10(FÓRMULAS!G539))*FÓRMULAS!G537),\" \")","v":{"$error":"#VALUE!"}},{"$f":"IF(FÓRMULAS!H538>0.001,((1/LOG10(FÓRMULAS!H538))*(LOG10(FÓRMULAS!H539))*FÓRMULAS!H537),\" \")","v":{"$error":"#VALUE!"}},{"$f":"IF(FÓRMULAS!I538>0.001,((1/LOG10(FÓRMULAS!I538))*(LOG10(FÓRMULAS!I539))*FÓRMULAS!I537),\" \")","v":{"$error":"#VALUE!"}}]
[null,{"$f":"IF(FÓRMULAS!F548>0.001,(FÓRMULAS!F548*FÓRMULAS!F549*FÓRMULAS!F550),0)","v":{"v":0,"d":"0.00"}},{"$f":"IF(FÓRMULAS!G548>0.001,(FÓRMULAS!G548*FÓRMULAS!G549*FÓRMULAS!G550),0)","v":{"v":0,"d":"0.00"}},{"$f":"IF(FÓRMULAS!H548>0.001,(FÓRMULAS!H548*FÓRMULAS!H549*FÓRMULAS!H550),0)","v":{"v":0,"d":"0.00"}},{"$f":"IF(FÓRMULAS!I548>0.001,(FÓRMULAS!I548*FÓRMULAS!I549*FÓRMULAS!I550),0)","v":{"v":0,"d":"0.00"}}]
[]
[null,{"$f":"IF(FÓRMULAS!F551>0.01,(FÓRMULAS!F551*FÓRMULAS!F541),\" \")","v":{"$error":"#VALUE!"}},{"$f":"IF(FÓRMULAS!G551>0.01,(FÓRMULAS!G551*FÓRMULAS!G541),\" \")","v":{"$error":"#VALUE!"}},{"$f":"IF(FÓRMULAS!H551>0.01,(FÓRMULAS!H551*FÓRMULAS!H541),\" \")","v":{"$error":"#VALUE!"}},{"$f":"IF(FÓRMULAS!I551>0.01,(FÓRMULAS!I551*FÓRMULAS!I541),\" \")","v":{"$error":"#VALUE!"}}]
[]
[]
[null,{"$f":"+'2 INDICADORES'!B304:C304","v":"Nome comercial do produto (selecione)"},{"$nulls":10},1]
[null,{"$f":"+'2 INDICADORES'!B305:C305","v":"Descrição da cultura "},{"$nulls":10},2]
[null,{"$f":"+'2 INDICADORES'!B306:C306","v":"Área aplicada (ha)"},{"$nulls":10},3]
[null,{"$f":"+'2 INDICADORES'!B307:C307","v":"Volume aplicado L/ha ou kg/ha "}]
[null,{"$f":"+'2 INDICADORES'!B308:C308","v":"Volume total aplicado por produto"},null,{"$f":"+D476*D475","v":{"v":0,"d":"0.0"}},{"v":0,"d":"0.0"},{"v":0,"d":"0.0"},{"v":0,"d":"0.0"},{"v":0,"d":"0.0"},{"v":0,"d":"0.0"},{"v":0,"d":"0.0"},{"v":0,"d":"0.0"},{"v":0,"d":"0.0"}]
[]
[null,{"$f":"+'2 INDICADORES'!B309:C309","v":"Ingrediente ativo do produto "},null,{"$f":"IF(D$475>0,(HLOOKUP(D$473,'Base de dados'!$B$5:$AIN$11,$M479,0)),\"\")","v":""},{"$f":"IF(E$475>0,(HLOOKUP(E$473,'Base de dados'!$B$5:$AIN$11,$M479,0)),\"\")","v":""},{"$f":"IF(F$475>0,(HLOOKUP(F$473,'Base de dados'!$B$5:$AIN$11,$M479,0)),\"\")","v":""},{"$f":"IF(G$475>0,(HLOOKUP(G$473,'Base de dados'!$B$5:$AIN$11,$M479,0)),\"\")","v":""},{"$f":"IF(H$475>0,(HLOOKUP(H$473,'Base de dados'!$B$5:$AIN$11,$M479,0)),\"\")","v":""},{"$f":"IF(I$475>0,(HLOOKUP(I$473,'Base de dados'!$B$5:$AIN$11,$M479,0)),\"\")","v":""},{"$f":"IF(J$475>0,(HLOOKUP(J$473,'Base de dados'!$B$5:$AIN$11,$M479,0)),\"\")","v":""},{"$f":"IF(K$475>0,(HLOOKUP(K$473,'Base de dados'!$B$5:$AIN$11,$M479,0)),\"\")","v":""},{"$f":"IF(L$475>0,(HLOOKUP(L$473,'Base de dados'!$B$5:$AIN$11,$M479,0)),\"\")","v":""},2]
[null,{"$f":"+'2 INDICADORES'!B310:C310","v":"Toxicidade para peixes - 96h LC50 (mg L-1)"},null,{"$f":"IF(D$475>0,(HLOOKUP(D$473,'Base de dados'!$B$5:$AIN$11,$M480,0)),\"\")","v":""},{"$f":"IF(E$475>0,(HLOOKUP(E$473,'Base de dados'!$B$5:$AIN$11,$M480,0)),\"\")","v":""},{"$f":"IF(F$475>0,(HLOOKUP(F$473,'Base de dados'!$B$5:$AIN$11,$M480,0)),\"\")","v":""},{"$f":"IF(G$475>0,(HLOOKUP(G$473,'Base de dados'!$B$5:$AIN$11,$M480,0)),\"\")","v":""},{"$f":"IF(H$475>0,(HLOOKUP(H$473,'Base de dados'!$B$5:$AIN$11,$M480,0)),\"\")","v":""},{"$f":"IF(I$475>0,(HLOOKUP(I$473,'Base de dados'!$B$5:$AIN$11,$M480,0)),\"\")","v":""},{"$f":"IF(J$475>0,(HLOOKUP(J$473,'Base de dados'!$B$5:$AIN$11,$M480,0)),\"\")","v":""},{"$f":"IF(K$475>0,(HLOOKUP(K$473,'Base de dados'!$B$5:$AIN$11,$M480,0)),\"\")","v":""},{"$f":"IF(L$475>0,(HLOOKUP(L$473,'Base de dados'!$B$5:$AIN$11,$M480,0)),\"\")","v":""},3]
[null,{"$f":"+'2 INDICADORES'!B311:C311","v":"Toxicidade - DAH (mg kg-1 dia-1)"},null,{"$f":"IF(D$475>0,(HLOOKUP(D$473,'Base de dados'!$B$5:$AIN$11,$M481,0)),\"\")","v":""},{"$f":"IF(E$475>0,(HLOOKUP(E$473,'Base de dados'!$B$5:$AIN$11,$M481,0)),\"\")","v":""},{"$f":"IF(F$475>0,(HLOOKUP(F$473,'Base de dados'!$B$5:$AIN$11,$M481,0)),\"\")","v":""},{"$f":"IF(G$475>0,(HLOOKUP(G$473,'Base de dados'!$B$5:$AIN$11,$M481,0)),\"\")","v":""},{"$f":"IF(H$475>0,(HLOOKUP(H$473,'Base de dados'!$B$5:$AIN$11,$M481,0)),\"\")","v":""},{"$f":"IF(I$475>0,(HLOOKUP(I$473,'Base de dados'!$B$5:$AIN$11,$M481,0)),\"\")","v":""},{"$f":"IF(J$475>0,(HLOOKUP(J$473,'Base de dados'!$B$5:$AIN$11,$M481,0)),\"\")","v":""},{"$f":"IF(K$475>0,(HLOOKUP(K$473,'Base de dados'!$B$5:$AIN$11,$M481,0)),\"\")","v":""},{"$f":"IF(L$475>0,(HLOOKUP(L$473,'Base de dados'!$B$5:$AIN$11,$M481,0)),\"\")","v":""},4]
[null,{"$f":"+'2 INDICADORES'!B312:C312","v":"Índice para toxicidade do produto"},null,{"$f":"IF(D$475>0,(HLOOKUP(D$473,'Base de dados'!$B$5:$AIN$11,$M482,0)),\"\")","v":""},{"$f":"IF(E$475>0,(HLOOKUP(E$473,'Base de dados'!$B$5:$AIN$11,$M482,0)),\"\")","v":""},{"$f":"IF(F$475>0,(HLOOKUP(F$473,'Base de dados'!$B$5:$AIN$11,$M482,0)),\"\")","v":""},{"$f":"IF(G$475>0,(HLOOKUP(G$473,'Base de dados'!$B$5:$AIN$11,$M482,0)),\"\")","v":""},{"$f":"IF(H$475>0,(HLOOKUP(H$473,'Base de dados'!$B$5:$AIN$11,$M482,0)),\"\")","v":""},{"$f":"IF(I$475>0,(HLOOKUP(I$473,'Base de dados'!$B$5:$AIN$11,$M482,0)),\"\")","v":""},{"$f":"IF(J$475>0,(HLOOKUP(J$473,'Base de dados'!$B$5:$AIN$11,$M482,0)),\"\")","v":""},{"$f":"IF(K$475>0,(HLOOKUP(K$473,'Base de dados'!$B$5:$AIN$11,$M482,0)),\"\")","v":""},{"$f":"IF(L$475>0,(HLOOKUP(L$473,'Base de dados'!$B$5:$AIN$11,$M482,0)),\"\")","v":""},5]
[null,{"$f":"+'2 INDICADORES'!B313:C313","v":"Koc"},null,{"$f":"IF(D$475>0,(HLOOKUP(D$473,'Base de dados'!$B$5:$AIN$11,$M483,0)),\"\")","v":""},{"$f":"IF(E$475>0,(HLOOKUP(E$473,'Base de dados'!$B$5:$AIN$11,$M483,0)),\"\")","v":""},{"$f":"IF(F$475>0,(HLOOKUP(F$473,'Base de dados'!$B$5:$AIN$11,$M483,0)),\"\")","v":""},{"$f":"IF(G$475>0,(HLOOKUP(G$473,'Base de dados'!$B$5:$AIN$11,$M483,0)),\"\")","v":""},{"$f":"IF(H$475>0,(HLOOKUP(H$473,'Base de dados'!$B$5:$AIN$11,$M483,0)),\"\")","v":""},{"$f":"IF(I$475>0,(HLOOKUP(I$473,'Base de dados'!$B$5:$AIN$11,$M483,0)),\"\")","v":""},{"$f":"IF(J$475>0,(HLOOKUP(J$473,'Base de dados'!$B$5:$AIN$11,$M483,0)),\"\")","v":""},{"$f":"IF(K$475>0,(HLOOKUP(K$473,'Base de dados'!$B$5:$AIN$11,$M483,0)),\"\")","v":""},{"$f":"IF(L$475>0,(HLOOKUP(L$473,'Base de dados'!$B$5:$AIN$11,$M483,0)),\"\")","v":""},6]
[null,{"$f":"+'2 INDICADORES'!B314:C314","v":"t1/2 (DT50)"},null,{"$f":"IF(D$475>0,(HLOOKUP(D$473,'Base de dados'!$B$5:$AIN$11,$M484,0)),\"\")","v":""},{"$f":"IF(E$475>0,(HLOOKUP(E$473,'Base de dados'!$B$5:$AIN$11,$M484,0)),\"\")","v":""},{"$f":"IF(F$475>0,(HLOOKUP(F$473,'Base de dados'!$B$5:$AIN$11,$M484,0)),\"\")","v":""},{"$f":"IF(G$475>0,(HLOOKUP(G$473,'Base de dados'!$B$5:$AIN$11,$M484,0)),\"\")","v":""},{"$f":"IF(H$475>0,(HLOOKUP(H$473,'Base de dados'!$B$5:$AIN$11,$M484,0)),\"\")","v":""},{"$f":"IF(I$475>0,(HLOOKUP(I$473,'Base de dados'!$B$5:$AIN$11,$M484,0)),\"\")","v":""},{"$f":"IF(J$475>0,(HLOOKUP(J$473,'Base de dados'!$B$5:$AIN$11,$M484,0)),\"\")","v":""},{"$f":"IF(K$475>0,(HLOOKUP(K$473,'Base de dados'!$B$5:$AIN$11,$M484,0)),\"\")","v":""},{"$f":"IF(L$475>0,(HLOOKUP(L$473,'Base de dados'!$B$5:$AIN$11,$M484,0)),\"\")","v":""},7]
[null,"GUS",null,{"$f":"IF(D475=0,\"\",IF(LOG10(D484)*(4-LOG10(D483))<=0,0,IF(OR(LOG10(D484)*(4-LOG10(D483))>0,),(LOG10(D484)*(4-LOG10(D483))),IF((LOG10(D484)*(4-LOG10(D483))>0),(LOG10(D484)*(4-LOG10(D483)))))))","v":""},{"$f":"IF(E475=0,\"\",IF(LOG10(E484)*(4-LOG10(E483))<=0,0,IF(OR(LOG10(E484)*(4-LOG10(E483))>0,),(LOG10(E484)*(4-LOG10(E483))),IF((LOG10(E484)*(4-LOG10(E483))>0),(LOG10(E484)*(4-LOG10(E483)))))))","v":""},"","","","","","",""]
[null,"Potencial de contaminação",null,{"$f":"IF(D475>0,(IF(OR(FÓRMULAS!H449=0.83,FÓRMULAS!H449<0.83),1,IF(OR(AND(0.83<FÓRMULAS!H449,FÓRMULAS!H449<=1.66)),2,IF(FÓRMULAS!H449>1.66,3,\"\")))),\"\")","v":""},{"$f":"IF(E475>0,(IF(OR(FÓRMULAS!I449=0.83,FÓRMULAS!I449<0.83),1,IF(OR(AND(0.83<FÓRMULAS!I449,FÓRMULAS!I449<=1.66)),2,IF(FÓRMULAS!I449>1.66,3,\"\")))),\"\")","v":""},{"$f":"IF(F475>0,(IF(OR(FÓRMULAS!J449=0.83,FÓRMULAS!J449<0.83),1,IF(OR(AND(0.83<FÓRMULAS!J449,FÓRMULAS!J449<=1.66)),2,IF(FÓRMULAS!J449>1.66,3,\"\")))),\"\")","v":""},{"$f":"IF(G475>0,(IF(OR(FÓRMULAS!K449=0.83,FÓRMULAS!K449<0.83),1,IF(OR(AND(0.83<FÓRMULAS!K449,FÓRMULAS!K449<=1.66)),2,IF(FÓRMULAS!K449>1.66,3,\"\")))),\"\")","v":""},{"$f":"IF(H475>0,(IF(OR(FÓRMULAS!L449=0.83,FÓRMULAS!L449<0.83),1,IF(OR(AND(0.83<FÓRMULAS!L449,FÓRMULAS!L449<=1.66)),2,IF(FÓRMULAS!L449>1.66,3,\"\")))),\"\")","v":""},{"$f":"IF(I475>0,(IF(OR(FÓRMULAS!M449=0.83,FÓRMULAS!M449<0.83),1,IF(OR(AND(0.83<FÓRMULAS!M449,FÓRMULAS!M449<=1.66)),2,IF(FÓRMULAS!M449>1.66,3,\"\")))),\"\")","v":""},{"$f":"IF(J475>0,(IF(OR(FÓRMULAS!N449=0.83,FÓRMULAS!N449<0.83),1,IF(OR(AND(0.83<FÓRMULAS!N449,FÓRMULAS!N449<=1.66)),2,IF(FÓRMULAS!N449>1.66,3,\"\")))),\"\")","v":""},{"$f":"IF(K475>0,(IF(OR(B461=0.83,B461<0.83),1,IF(OR(AND(0.83<B461,B461<=1.66)),2,IF(B461>1.66,3,\"\")))),\"\")","v":""},{"$f":"IF(L475>0,(IF(OR(C461=0.83,C461<0.83),1,IF(OR(AND(0.83<C461,C461<=1.66)),2,IF(C461>1.66,3,\"\")))),\"\")","v":""}]
[null,"EIQ Impacto ao trabalhador rural",null,{"$f":"IF(D$475>0,(HLOOKUP(D$473,'Base de dados'!$B$5:$AIN$18,$M487,0)),\"\")","v":""},{"$f":"IF(E$475>0,(HLOOKUP(E$473,'Base de dados'!$B$5:$AIN$18,$M487,0)),\"\")","v":""},{"$f":"IF(F$475>0,(HLOOKUP(F$473,'Base de dados'!$B$5:$AIN$18,$M487,0)),\"\")","v":""},{"$f":"IF(G$475>0,(HLOOKUP(G$473,'Base de dados'!$B$5:$AIN$18,$M487,0)),\"\")","v":""},{"$f":"IF(H$475>0,(HLOOKUP(H$473,'Base de dados'!$B$5:$AIN$18,$M487,0)),\"\")","v":""},{"$f":"IF(I$475>0,(HLOOKUP(I$473,'Base de dados'!$B$5:$AIN$18,$M487,0)),\"\")","v":""},{"$f":"IF(J$475>0,(HLOOKUP(J$473,'Base de dados'!$B$5:$AIN$18,$M487,0)),\"\")","v":""},{"$f":"IF(K$475>0,(HLOOKUP(K$473,'Base de dados'!$B$5:$AIN$18,$M487,0)),\"\")","v":""},{"$f":"IF(L$475>0,(HLOOKUP(L$473,'Base de dados'!$B$5:$AIN$18,$M487,0)),\"\")","v":""},12]
[null,"EIQ Impacto ao consumidor",null,{"$f":"IF(D$475>0,(HLOOKUP(D$473,'Base de dados'!$B$5:$AIN$18,$M488,0)),\"\")","v":""},{"$f":"IF(E$475>0,(HLOOKUP(E$473,'Base de dados'!$B$5:$AIN$18,$M488,0)),\"\")","v":""},{"$f":"IF(F$475>0,(HLOOKUP(F$473,'Base de dados'!$B$5:$AIN$18,$M488,0)),\"\")","v":""},{"$f":"IF(G$475>0,(HLOOKUP(G$473,'Base de dados'!$B$5:$AIN$18,$M488,0)),\"\")","v":""},{"$f":"IF(H$475>0,(HLOOKUP(H$473,'Base de dados'!$B$5:$AIN$18,$M488,0)),\"\")","v":""},{"$f":"IF(I$475>0,(HLOOKUP(I$473,'Base de dados'!$B$5:$AIN$18,$M488,0)),\"\")","v":""},{"$f":"IF(J$475>0,(HLOOKUP(J$473,'Base de dados'!$B$5:$AIN$18,$M488,0)),\"\")","v":""},{"$f":"IF(K$475>0,(HLOOKUP(K$473,'Base de dados'!$B$5:$AIN$18,$M488,0)),\"\")","v":""},{"$f":"IF(L$475>0,(HLOOKUP(L$473,'Base de dados'!$B$5:$AIN$18,$M488,0)),\"\")","v":""},13]
[null,"EIQ Impacto ao meio ambiente",null,{"$f":"IF(D$475>0,(HLOOKUP(D$473,'Base de dados'!$B$5:$AIN$18,$M489,0)),\"\")","v":""},{"$f":"IF(E$475>0,(HLOOKUP(E$473,'Base de dados'!$B$5:$AIN$18,$M489,0)),\"\")","v":""},{"$f":"IF(F$475>0,(HLOOKUP(F$473,'Base de dados'!$B$5:$AIN$18,$M489,0)),\"\")","v":""},{"$f":"IF(G$475>0,(HLOOKUP(G$473,'Base de dados'!$B$5:$AIN$18,$M489,0)),\"\")","v":""},{"$f":"IF(H$475>0,(HLOOKUP(H$473,'Base de dados'!$B$5:$AIN$18,$M489,0)),\"\")","v":""},{"$f":"IF(I$475>0,(HLOOKUP(I$473,'Base de dados'!$B$5:$AIN$18,$M489,0)),\"\")","v":""},{"$f":"IF(J$475>0,(HLOOKUP(J$473,'Base de dados'!$B$5:$AIN$18,$M489,0)),\"\")","v":""},{"$f":"IF(K$475>0,(HLOOKUP(K$473,'Base de dados'!$B$5:$AIN$18,$M489,0)),\"\")","v":""},{"$f":"IF(L$475>0,(HLOOKUP(L$473,'Base de dados'!$B$5:$AIN$18,$M489,0)),\"\")","v":""},14]
[null,"Índice Final (Quociente do Impacto Ambiental - EIQ)",null,{"$f":"IF(D$475>0,(HLOOKUP(D$473,'Base de dados'!$B$5:$AIN$18,$M490,0)),\"\")","v":""},{"$f":"IF(E$475>0,(HLOOKUP(E$473,'Base de dados'!$B$5:$AIN$18,$M490,0)),\"\")","v":""},{"$f":"IF(F$475>0,(HLOOKUP(F$473,'Base de dados'!$B$5:$AIN$18,$M490,0)),\"\")","v":""},{"$f":"IF(G$475>0,(HLOOKUP(G$473,'Base de dados'!$B$5:$AIN$18,$M490,0)),\"\")","v":""},{"$f":"IF(H$475>0,(HLOOKUP(H$473,'Base de dados'!$B$5:$AIN$18,$M490,0)),\"\")","v":""},{"$f":"IF(I$475>0,(HLOOKUP(I$473,'Base de dados'!$B$5:$AIN$18,$M490,0)),\"\")","v":""},{"$f":"IF(J$475>0,(HLOOKUP(J$473,'Base de dados'!$B$5:$AIN$18,$M490,0)),\"\")","v":""},{"$f":"IF(K$475>0,(HLOOKUP(K$473,'Base de dados'!$B$5:$AIN$18,$M490,0)),\"\")","v":""},{"$f":"IF(L$475>0,(HLOOKUP(L$473,'Base de dados'!$B$5:$AIN$18,$M490,0)),\"\")","v":""},11]
[null,"Produto banido na União Européia (X)",null,{"$f":"IF(D$475>0,(HLOOKUP(D$473,'Base de dados'!$B$5:$AIN$19,$M491,0)),\"\")","v":""},{"$f":"IF(E$475>0,(HLOOKUP(E$473,'Base de dados'!$B$5:$AIN$19,$M491,0)),\"\")","v":""},{"$f":"IF(F$475>0,(HLOOKUP(F$473,'Base de dados'!$B$5:$AIN$19,$M491,0)),\"\")","v":""},{"$f":"IF(G$475>0,(HLOOKUP(G$473,'Base de dados'!$B$5:$AIN$19,$M491,0)),\"\")","v":""},{"$f":"IF(H$475>0,(HLOOKUP(H$473,'Base de dados'!$B$5:$AIN$19,$M491,0)),\"\")","v":""},{"$f":"IF(I$475>0,(HLOOKUP(I$473,'Base de dados'!$B$5:$AIN$19,$M491,0)),\"\")","v":""},{"$f":"IF(J$475>0,(HLOOKUP(J$473,'Base de dados'!$B$5:$AIN$19,$M491,0)),\"\")","v":""},{"$f":"IF(K$475>0,(HLOOKUP(K$473,'Base de dados'!$B$5:$AIN$19,$M491,0)),\"\")","v":""},{"$f":"IF(L$475>0,(HLOOKUP(L$473,'Base de dados'!$B$5:$AIN$19,$M491,0)),\"\")","v":""},15]
[]
[null,{"$f":"+'2 INDICADORES'!B323:C323","v":"Conteúdo de argila no solo (no talhão)                        > 60% (1);     30% - 60% (2);        <30% (3)"}]
[null,{"$f":"+'2 INDICADORES'!B324:C324","v":"Distância do curso d' água (borda do talhão)     >1.000m (1);  300 - 1.000m (2);  <300m (3)"}]
[null,{"$f":"+'2 INDICADORES'!B325:C325","v":"Tipo de manejo do solo: Solo protegido (1); Solo sem revolvimento (2); Solo com revolvimento (3)"}]
[null,{"$f":"+'2 INDICADORES'!B326:C326","v":"Vulnerabilidade do talhão "},null,{"$f":"IF(D476>0,(IF(OR(AND(1<=FÓRMULAS!H450,FÓRMULAS!H450<=3)),1,IF(OR(AND(3<FÓRMULAS!H450,FÓRMULAS!H450<=9)),2,IF(FÓRMULAS!H450>9,3)))),\"\")","v":""},{"$f":"IF(E476>0,(IF(OR(AND(1<=FÓRMULAS!I450,FÓRMULAS!I450<=3)),1,IF(OR(AND(3<FÓRMULAS!I450,FÓRMULAS!I450<=9)),2,IF(FÓRMULAS!I450>9,3)))),\"\")","v":""},{"$f":"IF(F476>0,(IF(OR(AND(1<=FÓRMULAS!J450,FÓRMULAS!J450<=3)),1,IF(OR(AND(3<FÓRMULAS!J450,FÓRMULAS!J450<=9)),2,IF(FÓRMULAS!J450>9,3)))),\"\")","v":""},{"$f":"IF(G476>0,(IF(OR(AND(1<=FÓRMULAS!K450,FÓRMULAS!K450<=3)),1,IF(OR(AND(3<FÓRMULAS!K450,FÓRMULAS!K450<=9)),2,IF(FÓRMULAS!K450>9,3)))),\"\")","v":""},{"$f":"IF(H476>0,(IF(OR(AND(1<=FÓRMULAS!L450,FÓRMULAS!L450<=3)),1,IF(OR(AND(3<FÓRMULAS!L450,FÓRMULAS!L450<=9)),2,IF(FÓRMULAS!L450>9,3)))),\"\")","v":""},{"$f":"IF(I476>0,(IF(OR(AND(1<=FÓRMULAS!M450,FÓRMULAS!M450<=3)),1,IF(OR(AND(3<FÓRMULAS!M450,FÓRMULAS!M450<=9)),2,IF(FÓRMULAS!M450>9,3)))),\"\")","v":""},{"$f":"IF(J476>0,(IF(OR(AND(1<=FÓRMULAS!N450,FÓRMULAS!N450<=3)),1,IF(OR(AND(3<FÓRMULAS!N450,FÓRMULAS!N450<=9)),2,IF(FÓRMULAS!N450>9,3)))),\"\")","v":""},{"$f":"IF(K476>0,(IF(OR(AND(1<=FÓRMULAS!B462,FÓRMULAS!B462<=3)),1,IF(OR(AND(3<FÓRMULAS!B462,FÓRMULAS!B462<=9)),2,IF(FÓRMULAS!B462>9,3)))),\"\")","v":""},{"$f":"IF(L476>0,(IF(OR(AND(1<=FÓRMULAS!C462,FÓRMULAS!C462<=3)),1,IF(OR(AND(3<FÓRMULAS!C462,FÓRMULAS!C462<=9)),2,IF(FÓRMULAS!C462>9,3)))),\"\")","v":""}]
[]
[null,"Risco de contaminação",null,{"$f":"IF(D476>0,(IF(OR(AND(1<=FÓRMULAS!H452,FÓRMULAS!H452<=2)),1,IF(OR(AND(2<FÓRMULAS!H452,FÓRMULAS!H452<=4)),2,IF(FÓRMULAS!H452>4,3)))),\"\")","v":""},{"$f":"IF(E476>0,(IF(OR(AND(1<=FÓRMULAS!I452,FÓRMULAS!I452<=2)),1,IF(OR(AND(2<FÓRMULAS!I452,FÓRMULAS!I452<=4)),2,IF(FÓRMULAS!I452>4,3)))),\"\")","v":""},{"$f":"IF(F476>0,(IF(OR(AND(1<=FÓRMULAS!J452,FÓRMULAS!J452<=2)),1,IF(OR(AND(2<FÓRMULAS!J452,FÓRMULAS!J452<=4)),2,IF(FÓRMULAS!J452>4,3)))),\"\")","v":""},{"$f":"IF(G476>0,(IF(OR(AND(1<=FÓRMULAS!K452,FÓRMULAS!K452<=2)),1,IF(OR(AND(2<FÓRMULAS!K452,FÓRMULAS!K452<=4)),2,IF(FÓRMULAS!K452>4,3)))),\"\")","v":""},{"$f":"IF(H476>0,(IF(OR(AND(1<=FÓRMULAS!L452,FÓRMULAS!L452<=2)),1,IF(OR(AND(2<FÓRMULAS!L452,FÓRMULAS!L452<=4)),2,IF(FÓRMULAS!L452>4,3)))),\"\")","v":""},{"$f":"IF(I476>0,(IF(OR(AND(1<=FÓRMULAS!M452,FÓRMULAS!M452<=2)),1,IF(OR(AND(2<FÓRMULAS!M452,FÓRMULAS!M452<=4)),2,IF(FÓRMULAS!M452>4,3)))),\"\")","v":""},{"$f":"IF(J476>0,(IF(OR(AND(1<=FÓRMULAS!N452,FÓRMULAS!N452<=2)),1,IF(OR(AND(2<FÓRMULAS!N452,FÓRMULAS!N452<=4)),2,IF(FÓRMULAS!N452>4,3)))),\"\")","v":""},{"$f":"IF(K476>0,(IF(OR(AND(1<=FÓRMULAS!B464,FÓRMULAS!B464<=2)),1,IF(OR(AND(2<FÓRMULAS!B464,FÓRMULAS!B464<=4)),2,IF(FÓRMULAS!B464>4,3)))),\"\")","v":""},{"$f":"IF(L476>0,(IF(OR(AND(1<=FÓRMULAS!C464,FÓRMULAS!C464<=2)),1,IF(OR(AND(2<FÓRMULAS!C464,FÓRMULAS!C464<=4)),2,IF(FÓRMULAS!C464>4,3)))),\"\")","v":""}]
[]
[]
[null,{"$f":"+'2 INDICADORES'!B304:C304","v":"Nome comercial do produto (selecione)"}]
[null,{"$f":"+'2 INDICADORES'!B305:C305","v":"Descrição da cultura "}]
[null,{"$f":"+'2 INDICADORES'!B306:C306","v":"Área aplicada (ha)"}]
[null,{"$f":"+'2 INDICADORES'!B307:C307","v":"Volume aplicado L/ha ou kg/ha "}]
[null,"Volume total aplicado por produto",null,{"$f":"+D504*D503","v":{"v":0,"d":"0.0"}},{"v":0,"d":"0.0"},{"v":0,"d":"0.0"},{"v":0,"d":"0.0"},{"v":0,"d":"0.0"},{"v":0,"d":"0.0"},{"v":0,"d":"0.0"},{"v":0,"d":"0.0"},{"v":0,"d":"0.0"}]
[]
[null,{"$f":"+'2 INDICADORES'!B309:C309","v":"Ingrediente ativo do produto "},null,{"$f":"IF(D$503>0,(HLOOKUP(D$501,'Base de dados'!$B$5:$AIN$11,$M507,0)),\"\")","v":""},{"$f":"IF(E$503>0,(HLOOKUP(E$501,'Base de dados'!$B$5:$AIN$11,$M507,0)),\"\")","v":""},{"$f":"IF(F$503>0,(HLOOKUP(F$501,'Base de dados'!$B$5:$AIN$11,$M507,0)),\"\")","v":""},{"$f":"IF(G$503>0,(HLOOKUP(G$501,'Base de dados'!$B$5:$AIN$11,$M507,0)),\"\")","v":""},{"$f":"IF(H$503>0,(HLOOKUP(H$501,'Base de dados'!$B$5:$AIN$11,$M507,0)),\"\")","v":""},{"$f":"IF(I$503>0,(HLOOKUP(I$501,'Base de dados'!$B$5:$AIN$11,$M507,0)),\"\")","v":""},{"$f":"IF(J$503>0,(HLOOKUP(J$501,'Base de dados'!$B$5:$AIN$11,$M507,0)),\"\")","v":""},{"$f":"IF(K$503>0,(HLOOKUP(K$501,'Base de dados'!$B$5:$AIN$11,$M507,0)),\"\")","v":""},{"$f":"IF(L$503>0,(HLOOKUP(L$501,'Base de dados'!$B$5:$AIN$11,$M507,0)),\"\")","v":""},2]
[null,{"$f":"+'2 INDICADORES'!B310:C310","v":"Toxicidade para peixes - 96h LC50 (mg L-1)"},null,{"$f":"IF(D$503>0,(HLOOKUP(D$501,'Base de dados'!$B$5:$AIN$11,$M508,0)),\"\")","v":""},{"$f":"IF(E$503>0,(HLOOKUP(E$501,'Base de dados'!$B$5:$AIN$11,$M508,0)),\"\")","v":""},{"$f":"IF(F$503>0,(HLOOKUP(F$501,'Base de dados'!$B$5:$AIN$11,$M508,0)),\"\")","v":""},{"$f":"IF(G$503>0,(HLOOKUP(G$501,'Base de dados'!$B$5:$AIN$11,$M508,0)),\"\")","v":""},{"$f":"IF(H$503>0,(HLOOKUP(H$501,'Base de dados'!$B$5:$AIN$11,$M508,0)),\"\")","v":""},{"$f":"IF(I$503>0,(HLOOKUP(I$501,'Base de dados'!$B$5:$AIN$11,$M508,0)),\"\")","v":""},{"$f":"IF(J$503>0,(HLOOKUP(J$501,'Base de dados'!$B$5:$AIN$11,$M508,0)),\"\")","v":""},{"$f":"IF(K$503>0,(HLOOKUP(K$501,'Base de dados'!$B$5:$AIN$11,$M508,0)),\"\")","v":""},{"$f":"IF(L$503>0,(HLOOKUP(L$501,'Base de dados'!$B$5:$AIN$11,$M508,0)),\"\")","v":""},3]
[null,{"$f":"+'2 INDICADORES'!B311:C311","v":"Toxicidade - DAH (mg kg-1 dia-1)"},null,{"$f":"IF(D$503>0,(HLOOKUP(D$501,'Base de dados'!$B$5:$AIN$11,$M509,0)),\"\")","v":""},{"$f":"IF(E$503>0,(HLOOKUP(E$501,'Base de dados'!$B$5:$AIN$11,$M509,0)),\"\")","v":""},{"$f":"IF(F$503>0,(HLOOKUP(F$501,'Base de dados'!$B$5:$AIN$11,$M509,0)),\"\")","v":""},{"$f":"IF(G$503>0,(HLOOKUP(G$501,'Base de dados'!$B$5:$AIN$11,$M509,0)),\"\")","v":""},{"$f":"IF(H$503>0,(HLOOKUP(H$501,'Base de dados'!$B$5:$AIN$11,$M509,0)),\"\")","v":""},{"$f":"IF(I$503>0,(HLOOKUP(I$501,'Base de dados'!$B$5:$AIN$11,$M509,0)),\"\")","v":""},{"$f":"IF(J$503>0,(HLOOKUP(J$501,'Base de dados'!$B$5:$AIN$11,$M509,0)),\"\")","v":""},{"$f":"IF(K$503>0,(HLOOKUP(K$501,'Base de dados'!$B$5:$AIN$11,$M509,0)),\"\")","v":""},{"$f":"IF(L$503>0,(HLOOKUP(L$501,'Base de dados'!$B$5:$AIN$11,$M509,0)),\"\")","v":""},4]
[null,"Índice para toxicidade do produto",null,{"$f":"IF(D$503>0,(HLOOKUP(D$501,'Base de dados'!$B$5:$AIN$11,$M510,0)),\"\")","v":""},{"$f":"IF(E$503>0,(HLOOKUP(E$501,'Base de dados'!$B$5:$AIN$11,$M510,0)),\"\")","v":""},{"$f":"IF(F$503>0,(HLOOKUP(F$501,'Base de dados'!$B$5:$AIN$11,$M510,0)),\"\")","v":""},{"$f":"IF(G$503>0,(HLOOKUP(G$501,'Base de dados'!$B$5:$AIN$11,$M510,0)),\"\")","v":""},{"$f":"IF(H$503>0,(HLOOKUP(H$501,'Base de dados'!$B$5:$AIN$11,$M510,0)),\"\")","v":""},{"$f":"IF(I$503>0,(HLOOKUP(I$501,'Base de dados'!$B$5:$AIN$11,$M510,0)),\"\")","v":""},{"$f":"IF(J$503>0,(HLOOKUP(J$501,'Base de dados'!$B$5:$AIN$11,$M510,0)),\"\")","v":""},{"$f":"IF(K$503>0,(HLOOKUP(K$501,'Base de dados'!$B$5:$AIN$11,$M510,0)),\"\")","v":""},{"$f":"IF(L$503>0,(HLOOKUP(L$501,'Base de dados'!$B$5:$AIN$11,$M510,0)),\"\")","v":""},5]
[null,{"$f":"+'2 INDICADORES'!B313:C313","v":"Koc"},null,{"$f":"IF(D$503>0,(HLOOKUP(D$501,'Base de dados'!$B$5:$AIN$11,$M511,0)),\"\")","v":""},{"$f":"IF(E$503>0,(HLOOKUP(E$501,'Base de dados'!$B$5:$AIN$11,$M511,0)),\"\")","v":""},{"$f":"IF(F$503>0,(HLOOKUP(F$501,'Base de dados'!$B$5:$AIN$11,$M511,0)),\"\")","v":""},{"$f":"IF(G$503>0,(HLOOKUP(G$501,'Base de dados'!$B$5:$AIN$11,$M511,0)),\"\")","v":""},{"$f":"IF(H$503>0,(HLOOKUP(H$501,'Base de dados'!$B$5:$AIN$11,$M511,0)),\"\")","v":""},{"$f":"IF(I$503>0,(HLOOKUP(I$501,'Base de dados'!$B$5:$AIN$11,$M511,0)),\"\")","v":""},{"$f":"IF(J$503>0,(HLOOKUP(J$501,'Base de dados'!$B$5:$AIN$11,$M511,0)),\"\")","v":""},{"$f":"IF(K$503>0,(HLOOKUP(K$501,'Base de dados'!$B$5:$AIN$11,$M511,0)),\"\")","v":""},{"$f":"IF(L$503>0,(HLOOKUP(L$501,'Base de dados'!$B$5:$AIN$11,$M511,0)),\"\")","v":""},6]
[null,{"$f":"+'2 INDICADORES'!B314:C314","v":"t1/2 (DT50)"},null,{"$f":"IF(D$503>0,(HLOOKUP(D$501,'Base de dados'!$B$5:$AIN$11,$M512,0)),\"\")","v":""},{"$f":"IF(E$503>0,(HLOOKUP(E$501,'Base de dados'!$B$5:$AIN$11,$M512,0)),\"\")","v":""},{"$f":"IF(F$503>0,(HLOOKUP(F$501,'Base de dados'!$B$5:$AIN$11,$M512,0)),\"\")","v":""},{"$f":"IF(G$503>0,(HLOOKUP(G$501,'Base de dados'!$B$5:$AIN$11,$M512,0)),\"\")","v":""},{"$f":"IF(H$503>0,(HLOOKUP(H$501,'Base de dados'!$B$5:$AIN$11,$M512,0)),\"\")","v":""},{"$f":"IF(I$503>0,(HLOOKUP(I$501,'Base de dados'!$B$5:$AIN$11,$M512,0)),\"\")","v":""},{"$f":"IF(J$503>0,(HLOOKUP(J$501,'Base de dados'!$B$5:$AIN$11,$M512,0)),\"\")","v":""},{"$f":"IF(K$503>0,(HLOOKUP(K$501,'Base de dados'!$B$5:$AIN$11,$M512,0)),\"\")","v":""},{"$f":"IF(L$503>0,(HLOOKUP(L$501,'Base de dados'!$B$5:$AIN$11,$M512,0)),\"\")","v":""},7]
[null,"GUS",null,{"$f":"IF(D503=0,\"\",IF(LOG10(D512)*(4-LOG10(D511))<=0,0,IF(OR(LOG10(D512)*(4-LOG10(D511))>0,),(LOG10(D512)*(4-LOG10(D511))),IF((LOG10(D512)*(4-LOG10(D511))>0),(LOG10(D512)*(4-LOG10(D511)))))))","v":""},{"$f":"IF(E503=0,\"\",IF(LOG10(E512)*(4-LOG10(E511))<=0,0,IF(OR(LOG10(E512)*(4-LOG10(E511))>0,),(LOG10(E512)*(4-LOG10(E511))),IF((LOG10(E512)*(4-LOG10(E511))>0),(LOG10(E512)*(4-LOG10(E511)))))))","v":""},"","","","","","",""]
[null,"Potencial de contaminação",null,{"$f":"IF(D503>0,(IF(OR(D461=0.83,D461<0.83),1,IF(OR(AND(0.83<D461,D461<=1.66)),2,IF(D461>1.66,3,\"\")))),\"\")","v":""},{"$f":"IF(E503>0,(IF(OR(E461=0.83,E461<0.83),1,IF(OR(AND(0.83<E461,E461<=1.66)),2,IF(E461>1.66,3,\"\")))),\"\")","v":""},"","","","","","",""]
[null,"EIQ Impacto ao trabalhador rural",null,{"$f":"IF(D$503>0,(HLOOKUP(D$501,'Base de dados'!$B$5:$AIN$18,$M515,0)),\"\")","v":""},{"$f":"IF(E$503>0,(HLOOKUP(E$501,'Base de dados'!$B$5:$AIN$18,$M515,0)),\"\")","v":""},{"$f":"IF(F$503>0,(HLOOKUP(F$501,'Base de dados'!$B$5:$AIN$18,$M515,0)),\"\")","v":""},{"$f":"IF(G$503>0,(HLOOKUP(G$501,'Base de dados'!$B$5:$AIN$18,$M515,0)),\"\")","v":""},{"$f":"IF(H$503>0,(HLOOKUP(H$501,'Base de dados'!$B$5:$AIN$18,$M515,0)),\"\")","v":""},{"$f":"IF(I$503>0,(HLOOKUP(I$501,'Base de dados'!$B$5:$AIN$18,$M515,0)),\"\")","v":""},{"$f":"IF(J$503>0,(HLOOKUP(J$501,'Base de dados'!$B$5:$AIN$18,$M515,0)),\"\")","v":""},{"$f":"IF(K$503>0,(HLOOKUP(K$501,'Base de dados'!$B$5:$AIN$18,$M515,0)),\"\")","v":""},{"$f":"IF(L$503>0,(HLOOKUP(L$501,'Base de dados'!$B$5:$AIN$18,$M515,0)),\"\")","v":""},12]
[null,"EIQ Impacto ao consumidor",null,{"$f":"IF(D$503>0,(HLOOKUP(D$501,'Base de dados'!$B$5:$AIN$18,$M516,0)),\"\")","v":""},{"$f":"IF(E$503>0,(HLOOKUP(E$501,'Base de dados'!$B$5:$AIN$18,$M516,0)),\"\")","v":""},{"$f":"IF(F$503>0,(HLOOKUP(F$501,'Base de dados'!$B$5:$AIN$18,$M516,0)),\"\")","v":""},{"$f":"IF(G$503>0,(HLOOKUP(G$501,'Base de dados'!$B$5:$AIN$18,$M516,0)),\"\")","v":""},{"$f":"IF(H$503>0,(HLOOKUP(H$501,'Base de dados'!$B$5:$AIN$18,$M516,0)),\"\")","v":""},{"$f":"IF(I$503>0,(HLOOKUP(I$501,'Base de dados'!$B$5:$AIN$18,$M516,0)),\"\")","v":""},{"$f":"IF(J$503>0,(HLOOKUP(J$501,'Base de dados'!$B$5:$AIN$18,$M516,0)),\"\")","v":""},{"$f":"IF(K$503>0,(HLOOKUP(K$501,'Base de dados'!$B$5:$AIN$18,$M516,0)),\"\")","v":""},{"$f":"IF(L$503>0,(HLOOKUP(L$501,'Base de dados'!$B$5:$AIN$18,$M516,0)),\"\")","v":""},13]
[null,"EIQ Impacto ao meio ambiente",null,{"$f":"IF(D$503>0,(HLOOKUP(D$501,'Base de dados'!$B$5:$AIN$18,$M517,0)),\"\")","v":""},{"$f":"IF(E$503>0,(HLOOKUP(E$501,'Base de dados'!$B$5:$AIN$18,$M517,0)),\"\")","v":""},{"$f":"IF(F$503>0,(HLOOKUP(F$501,'Base de dados'!$B$5:$AIN$18,$M517,0)),\"\")","v":""},{"$f":"IF(G$503>0,(HLOOKUP(G$501,'Base de dados'!$B$5:$AIN$18,$M517,0)),\"\")","v":""},{"$f":"IF(H$503>0,(HLOOKUP(H$501,'Base de dados'!$B$5:$AIN$18,$M517,0)),\"\")","v":""},{"$f":"IF(I$503>0,(HLOOKUP(I$501,'Base de dados'!$B$5:$AIN$18,$M517,0)),\"\")","v":""},{"$f":"IF(J$503>0,(HLOOKUP(J$501,'Base de dados'!$B$5:$AIN$18,$M517,0)),\"\")","v":""},{"$f":"IF(K$503>0,(HLOOKUP(K$501,'Base de dados'!$B$5:$AIN$18,$M517,0)),\"\")","v":""},{"$f":"IF(L$503>0,(HLOOKUP(L$501,'Base de dados'!$B$5:$AIN$18,$M517,0)),\"\")","v":""},14]
[null,"Índice Final (Quociente do Impacto Ambiental - EIQ)",null,{"$f":"IF(D$503>0,(HLOOKUP(D$501,'Base de dados'!$B$5:$AIN$18,$M518,0)),\"\")","v":""},{"$f":"IF(E$503>0,(HLOOKUP(E$501,'Base de dados'!$B$5:$AIN$18,$M518,0)),\"\")","v":""},{"$f":"IF(F$503>0,(HLOOKUP(F$501,'Base de dados'!$B$5:$AIN$18,$M518,0)),\"\")","v":""},{"$f":"IF(G$503>0,(HLOOKUP(G$501,'Base de dados'!$B$5:$AIN$18,$M518,0)),\"\")","v":""},{"$f":"IF(H$503>0,(HLOOKUP(H$501,'Base de dados'!$B$5:$AIN$18,$M518,0)),\"\")","v":""},{"$f":"IF(I$503>0,(HLOOKUP(I$501,'Base de dados'!$B$5:$AIN$18,$M518,0)),\"\")","v":""},{"$f":"IF(J$503>0,(HLOOKUP(J$501,'Base de dados'!$B$5:$AIN$18,$M518,0)),\"\")","v":""},{"$f":"IF(K$503>0,(HLOOKUP(K$501,'Base de dados'!$B$5:$AIN$18,$M518,0)),\"\")","v":""},{"$f":"IF(L$503>0,(HLOOKUP(L$501,'Base de dados'!$B$5:$AIN$18,$M518,0)),\"\")","v":""},11]
[null,"Produto banido na União Européia (X)",null,{"$f":"IF(D$503>0,(HLOOKUP(D$501,'Base de dados'!$B$5:$AIN$19,$M519,0)),\"\")","v":""},{"$f":"IF(E$503>0,(HLOOKUP(E$501,'Base de dados'!$B$5:$AIN$19,$M519,0)),\"\")","v":""},{"$f":"IF(F$503>0,(HLOOKUP(F$501,'Base de dados'!$B$5:$AIN$19,$M519,0)),\"\")","v":""},{"$f":"IF(G$503>0,(HLOOKUP(G$501,'Base de dados'!$B$5:$AIN$19,$M519,0)),\"\")","v":""},{"$f":"IF(H$503>0,(HLOOKUP(H$501,'Base de dados'!$B$5:$AIN$19,$M519,0)),\"\")","v":""},{"$f":"IF(I$503>0,(HLOOKUP(I$501,'Base de dados'!$B$5:$AIN$19,$M519,0)),\"\")","v":""},{"$f":"IF(J$503>0,(HLOOKUP(J$501,'Base de dados'!$B$5:$AIN$19,$M519,0)),\"\")","v":""},{"$f":"IF(K$503>0,(HLOOKUP(K$501,'Base de dados'!$B$5:$AIN$19,$M519,0)),\"\")","v":""},{"$f":"IF(L$503>0,(HLOOKUP(L$501,'Base de dados'!$B$5:$AIN$19,$M519,0)),\"\")","v":""},15]
[]
[null,{"$f":"+'2 INDICADORES'!B323:C323","v":"Conteúdo de argila no solo (no talhão)                        > 60% (1);     30% - 60% (2);        <30% (3)"}]
[null,{"$f":"+'2 INDICADORES'!B324:C324","v":"Distância do curso d' água (borda do talhão)     >1.000m (1);  300 - 1.000m (2);  <300m (3)"}]
[null,{"$f":"+'2 INDICADORES'!B325:C325","v":"Tipo de manejo do solo: Solo protegido (1); Solo sem revolvimento (2); Solo com revolvimento (3)"}]
[null,"Vulnerabilidade do talhão",null,{"$f":"IF(D504>0,(IF(OR(AND(1<=FÓRMULAS!D462,FÓRMULAS!D462<=3)),1,IF(OR(AND(3<FÓRMULAS!D462,FÓRMULAS!D462<=9)),2,IF(FÓRMULAS!D462>9,3)))),\"\")","v":""},{"$f":"IF(E504>0,(IF(OR(AND(1<=FÓRMULAS!E462,FÓRMULAS!E462<=3)),1,IF(OR(AND(3<FÓRMULAS!E462,FÓRMULAS!E462<=9)),2,IF(FÓRMULAS!E462>9,3)))),\"\")","v":""},{"$f":"IF(F504>0,(IF(OR(AND(1<=FÓRMULAS!F462,FÓRMULAS!F462<=3)),1,IF(OR(AND(3<FÓRMULAS!F462,FÓRMULAS!F462<=9)),2,IF(FÓRMULAS!F462>9,3)))),\"\")","v":""},{"$f":"IF(G504>0,(IF(OR(AND(1<=FÓRMULAS!G462,FÓRMULAS!G462<=3)),1,IF(OR(AND(3<FÓRMULAS!G462,FÓRMULAS!G462<=9)),2,IF(FÓRMULAS!G462>9,3)))),\"\")","v":""},{"$f":"IF(H504>0,(IF(OR(AND(1<=FÓRMULAS!H462,FÓRMULAS!H462<=3)),1,IF(OR(AND(3<FÓRMULAS!H462,FÓRMULAS!H462<=9)),2,IF(FÓRMULAS!H462>9,3)))),\"\")","v":""},{"$f":"IF(I504>0,(IF(OR(AND(1<=FÓRMULAS!I462,FÓRMULAS!I462<=3)),1,IF(OR(AND(3<FÓRMULAS!I462,FÓRMULAS!I462<=9)),2,IF(FÓRMULAS!I462>9,3)))),\"\")","v":""},{"$f":"IF(J504>0,(IF(OR(AND(1<=FÓRMULAS!J462,FÓRMULAS!J462<=3)),1,IF(OR(AND(3<FÓRMULAS!J462,FÓRMULAS!J462<=9)),2,IF(FÓRMULAS!J462>9,3)))),\"\")","v":""},{"$f":"IF(K504>0,(IF(OR(AND(1<=FÓRMULAS!K462,FÓRMULAS!K462<=3)),1,IF(OR(AND(3<FÓRMULAS!K462,FÓRMULAS!K462<=9)),2,IF(FÓRMULAS!K462>9,3)))),\"\")","v":""},{"$f":"IF(L504>0,(IF(OR(AND(1<=FÓRMULAS!L462,FÓRMULAS!L462<=3)),1,IF(OR(AND(3<FÓRMULAS!L462,FÓRMULAS!L462<=9)),2,IF(FÓRMULAS!L462>9,3)))),\"\")","v":""}]
[]
[null,"Risco de contaminação",null,{"$f":"IF(D504>0,(IF(OR(AND(1<=FÓRMULAS!D464,FÓRMULAS!D464<=2)),1,IF(OR(AND(2<FÓRMULAS!D464,FÓRMULAS!D464<=4)),2,IF(FÓRMULAS!D464>4,3)))),\"\")","v":""},{"$f":"IF(E504>0,(IF(OR(AND(1<=FÓRMULAS!E464,FÓRMULAS!E464<=2)),1,IF(OR(AND(2<FÓRMULAS!E464,FÓRMULAS!E464<=4)),2,IF(FÓRMULAS!E464>4,3)))),\"\")","v":""},{"$f":"IF(F504>0,(IF(OR(AND(1<=FÓRMULAS!F464,FÓRMULAS!F464<=2)),1,IF(OR(AND(2<FÓRMULAS!F464,FÓRMULAS!F464<=4)),2,IF(FÓRMULAS!F464>4,3)))),\"\")","v":""},{"$f":"IF(G504>0,(IF(OR(AND(1<=FÓRMULAS!G464,FÓRMULAS!G464<=2)),1,IF(OR(AND(2<FÓRMULAS!G464,FÓRMULAS!G464<=4)),2,IF(FÓRMULAS!G464>4,3)))),\"\")","v":""},{"$f":"IF(H504>0,(IF(OR(AND(1<=FÓRMULAS!H464,FÓRMULAS!H464<=2)),1,IF(OR(AND(2<FÓRMULAS!H464,FÓRMULAS!H464<=4)),2,IF(FÓRMULAS!H464>4,3)))),\"\")","v":""},{"$f":"IF(I504>0,(IF(OR(AND(1<=FÓRMULAS!I464,FÓRMULAS!I464<=2)),1,IF(OR(AND(2<FÓRMULAS!I464,FÓRMULAS!I464<=4)),2,IF(FÓRMULAS!I464>4,3)))),\"\")","v":""},{"$f":"IF(J504>0,(IF(OR(AND(1<=FÓRMULAS!J464,FÓRMULAS!J464<=2)),1,IF(OR(AND(2<FÓRMULAS!J464,FÓRMULAS!J464<=4)),2,IF(FÓRMULAS!J464>4,3)))),\"\")","v":""},{"$f":"IF(K504>0,(IF(OR(AND(1<=FÓRMULAS!K464,FÓRMULAS!K464<=2)),1,IF(OR(AND(2<FÓRMULAS!K464,FÓRMULAS!K464<=4)),2,IF(FÓRMULAS!K464>4,3)))),\"\")","v":""},{"$f":"IF(L504>0,(IF(OR(AND(1<=FÓRMULAS!L464,FÓRMULAS!L464<=2)),1,IF(OR(AND(2<FÓRMULAS!L464,FÓRMULAS!L464<=4)),2,IF(FÓRMULAS!L464>4,3)))),\"\")","v":""}]
[]
[null,{"$f":"+'2 INDICADORES'!B304:C304","v":"Nome comercial do produto (selecione)"}]
[null,{"$f":"+'2 INDICADORES'!B305:C305","v":"Descrição da cultura "}]
[null,{"$f":"+'2 INDICADORES'!B306:C306","v":"Área aplicada (ha)"}]
[null,{"$f":"+'2 INDICADORES'!B307:C307","v":"Volume aplicado L/ha ou kg/ha "}]
[null,"Volume total aplicado por produto",null,{"$f":"+D531*D530","v":{"v":0,"d":"0.0"}},{"v":0,"d":"0.0"},{"v":0,"d":"0.0"},{"v":0,"d":"0.0"},{"v":0,"d":"0.0"},{"v":0,"d":"0.0"}]
[]
[null,{"$f":"+'2 INDICADORES'!B309:C309","v":"Ingrediente ativo do produto "},null,{"$f":"IF(D$530>0,(HLOOKUP(D$528,'Base de dados'!$B$5:$AIN$11,$J534,0)),\"\")","v":""},{"$f":"IF(E$530>0,(HLOOKUP(E$528,'Base de dados'!$B$5:$AIN$11,$J534,0)),\"\")","v":""},{"$f":"IF(F$530>0,(HLOOKUP(F$528,'Base de dados'!$B$5:$AIN$11,$J534,0)),\"\")","v":""},{"$f":"IF(G$530>0,(HLOOKUP(G$528,'Base de dados'!$B$5:$AIN$11,$J534,0)),\"\")","v":""},{"$f":"IF(H$530>0,(HLOOKUP(H$528,'Base de dados'!$B$5:$AIN$11,$J534,0)),\"\")","v":""},{"$f":"IF(I$530>0,(HLOOKUP(I$528,'Base de dados'!$B$5:$AIN$11,$J534,0)),\"\")","v":""},2]
[null,{"$f":"+'2 INDICADORES'!B310:C310","v":"Toxicidade para peixes - 96h LC50 (mg L-1)"},null,{"$f":"IF(D$530>0,(HLOOKUP(D$528,'Base de dados'!$B$5:$AIN$11,$J535,0)),\"\")","v":""},{"$f":"IF(E$530>0,(HLOOKUP(E$528,'Base de dados'!$B$5:$AIN$11,$J535,0)),\"\")","v":""},{"$f":"IF(F$530>0,(HLOOKUP(F$528,'Base de dados'!$B$5:$AIN$11,$J535,0)),\"\")","v":""},{"$f":"IF(G$530>0,(HLOOKUP(G$528,'Base de dados'!$B$5:$AIN$11,$J535,0)),\"\")","v":""},{"$f":"IF(H$530>0,(HLOOKUP(H$528,'Base de dados'!$B$5:$AIN$11,$J535,0)),\"\")","v":""},{"$f":"IF(I$530>0,(HLOOKUP(I$528,'Base de dados'!$B$5:$AIN$11,$J535,0)),\"\")","v":""},3]
[null,{"$f":"+'2 INDICADORES'!B311:C311","v":"Toxicidade - DAH (mg kg-1 dia-1)"},null,{"$f":"IF(D$530>0,(HLOOKUP(D$528,'Base de dados'!$B$5:$AIN$11,$J536,0)),\"\")","v":""},{"$f":"IF(E$530>0,(HLOOKUP(E$528,'Base de dados'!$B$5:$AIN$11,$J536,0)),\"\")","v":""},{"$f":"IF(F$530>0,(HLOOKUP(F$528,'Base de dados'!$B$5:$AIN$11,$J536,0)),\"\")","v":""},{"$f":"IF(G$530>0,(HLOOKUP(G$528,'Base de dados'!$B$5:$AIN$11,$J536,0)),\"\")","v":""},{"$f":"IF(H$530>0,(HLOOKUP(H$528,'Base de dados'!$B$5:$AIN$11,$J536,0)),\"\")","v":""},{"$f":"IF(I$530>0,(HLOOKUP(I$528,'Base de dados'!$B$5:$AIN$11,$J536,0)),\"\")","v":""},4]
[null,"Índice para toxicidade do produto",null,{"$f":"IF(D$530>0,(HLOOKUP(D$528,'Base de dados'!$B$5:$AIN$11,$J537,0)),\"\")","v":""},{"$f":"IF(E$530>0,(HLOOKUP(E$528,'Base de dados'!$B$5:$AIN$11,$J537,0)),\"\")","v":""},{"$f":"IF(F$530>0,(HLOOKUP(F$528,'Base de dados'!$B$5:$AIN$11,$J537,0)),\"\")","v":""},{"$f":"IF(G$530>0,(HLOOKUP(G$528,'Base de dados'!$B$5:$AIN$11,$J537,0)),\"\")","v":""},{"$f":"IF(H$530>0,(HLOOKUP(H$528,'Base de dados'!$B$5:$AIN$11,$J537,0)),\"\")","v":""},{"$f":"IF(I$530>0,(HLOOKUP(I$528,'Base de dados'!$B$5:$AIN$11,$J537,0)),\"\")","v":""},5]
[null,{"$f":"+'2 INDICADORES'!B313:C313","v":"Koc"},null,{"$f":"IF(D$530>0,(HLOOKUP(D$528,'Base de dados'!$B$5:$AIN$11,$J538,0)),\"\")","v":""},{"$f":"IF(E$530>0,(HLOOKUP(E$528,'Base de dados'!$B$5:$AIN$11,$J538,0)),\"\")","v":""},{"$f":"IF(F$530>0,(HLOOKUP(F$528,'Base de dados'!$B$5:$AIN$11,$J538,0)),\"\")","v":""},{"$f":"IF(G$530>0,(HLOOKUP(G$528,'Base de dados'!$B$5:$AIN$11,$J538,0)),\"\")","v":""},{"$f":"IF(H$530>0,(HLOOKUP(H$528,'Base de dados'!$B$5:$AIN$11,$J538,0)),\"\")","v":""},{"$f":"IF(I$530>0,(HLOOKUP(I$528,'Base de dados'!$B$5:$AIN$11,$J538,0)),\"\")","v":""},6]
[null,{"$f":"+'2 INDICADORES'!B314:C314","v":"t1/2 (DT50)"},null,{"$f":"IF(D$530>0,(HLOOKUP(D$528,'Base de dados'!$B$5:$AIN$11,$J539,0)),\"\")","v":""},{"$f":"IF(E$530>0,(HLOOKUP(E$528,'Base de dados'!$B$5:$AIN$11,$J539,0)),\"\")","v":""},{"$f":"IF(F$530>0,(HLOOKUP(F$528,'Base de dados'!$B$5:$AIN$11,$J539,0)),\"\")","v":""},{"$f":"IF(G$530>0,(HLOOKUP(G$528,'Base de dados'!$B$5:$AIN$11,$J539,0)),\"\")","v":""},{"$f":"IF(H$530>0,(HLOOKUP(H$528,'Base de dados'!$B$5:$AIN$11,$J539,0)),\"\")","v":""},{"$f":"IF(I$530>0,(HLOOKUP(I$528,'Base de dados'!$B$5:$AIN$11,$J539,0)),\"\")","v":""},7]
[null,"GUS",null,{"$f":"IF(D530=0,\"\",IF(LOG10(D539)*(4-LOG10(D538))<=0,0,IF(OR(LOG10(D539)*(4-LOG10(D538))>0,),(LOG10(D539)*(4-LOG10(D538))),IF((LOG10(D539)*(4-LOG10(D538))>0),(LOG10(D539)*(4-LOG10(D538)))))))","v":""},{"$f":"IF(E530=0,\"\",IF(LOG10(E539)*(4-LOG10(E538))<=0,0,IF(OR(LOG10(E539)*(4-LOG10(E538))>0,),(LOG10(E539)*(4-LOG10(E538))),IF((LOG10(E539)*(4-LOG10(E538))>0),(LOG10(E539)*(4-LOG10(E538)))))))","v":""},{"$f":"IF(F530=0,\"\",IF(LOG10(F539)*(4-LOG10(F538))<=0,0,IF(OR(LOG10(F539)*(4-LOG10(F538))>0,),(LOG10(F539)*(4-LOG10(F538))),IF((LOG10(F539)*(4-LOG10(F538))>0),(LOG10(F539)*(4-LOG10(F538)))))))","v":""},"","",""]
[null,"Potencial de contaminação",null,{"$f":"IF(D530>0,(IF(OR(M461=0.83,M461<0.83),1,IF(OR(AND(0.83<M461,M461<=1.66)),2,IF(M461>1.66,3,\"\")))),\"\")","v":""},{"$f":"IF(E530>0,(IF(OR(FÓRMULAS!I499=0.83,FÓRMULAS!I499<0.83),1,IF(OR(AND(0.83<FÓRMULAS!I499,FÓRMULAS!I499<=1.66)),2,IF(FÓRMULAS!I499>1.66,3,\"\")))),\"\")","v":""},{"$f":"IF(F530>0,(IF(OR(FÓRMULAS!J499=0.83,FÓRMULAS!J499<0.83),1,IF(OR(AND(0.83<FÓRMULAS!J499,FÓRMULAS!J499<=1.66)),2,IF(FÓRMULAS!J499>1.66,3,\"\")))),\"\")","v":""},{"$f":"IF(G530>0,(IF(OR(FÓRMULAS!K499=0.83,FÓRMULAS!K499<0.83),1,IF(OR(AND(0.83<FÓRMULAS!K499,FÓRMULAS!K499<=1.66)),2,IF(FÓRMULAS!K499>1.66,3,\"\")))),\"\")","v":""},{"$f":"IF(H530>0,(IF(OR(FÓRMULAS!L499=0.83,FÓRMULAS!L499<0.83),1,IF(OR(AND(0.83<FÓRMULAS!L499,FÓRMULAS!L499<=1.66)),2,IF(FÓRMULAS!L499>1.66,3,\"\")))),\"\")","v":""},{"$f":"IF(I530>0,(IF(OR(FÓRMULAS!M499=0.83,FÓRMULAS!M499<0.83),1,IF(OR(AND(0.83<FÓRMULAS!M499,FÓRMULAS!M499<=1.66)),2,IF(FÓRMULAS!M499>1.66,3,\"\")))),\"\")","v":""}]
[null,"EIQ Impacto ao trabalhador rural",null,{"$f":"IF(D$530>0,(HLOOKUP(D$528,'Base de dados'!$B$5:$AIN$18,$J542,0)),\"\")","v":""},{"$f":"IF(E$530>0,(HLOOKUP(E$528,'Base de dados'!$B$5:$AIN$18,$J542,0)),\"\")","v":""},{"$f":"IF(F$530>0,(HLOOKUP(F$528,'Base de dados'!$B$5:$AIN$18,$J542,0)),\"\")","v":""},{"$f":"IF(G$530>0,(HLOOKUP(G$528,'Base de dados'!$B$5:$AIN$18,$J542,0)),\"\")","v":""},{"$f":"IF(H$530>0,(HLOOKUP(H$528,'Base de dados'!$B$5:$AIN$18,$J542,0)),\"\")","v":""},{"$f":"IF(I$530>0,(HLOOKUP(I$528,'Base de dados'!$B$5:$AIN$18,$J542,0)),\"\")","v":""},12]
[null,"EIQ Impacto ao consumidor",null,{"$f":"IF(D$530>0,(HLOOKUP(D$528,'Base de dados'!$B$5:$AIN$18,$J543,0)),\"\")","v":""},{"$f":"IF(E$530>0,(HLOOKUP(E$528,'Base de dados'!$B$5:$AIN$18,$J543,0)),\"\")","v":""},{"$f":"IF(F$530>0,(HLOOKUP(F$528,'Base de dados'!$B$5:$AIN$18,$J543,0)),\"\")","v":""},{"$f":"IF(G$530>0,(HLOOKUP(G$528,'Base de dados'!$B$5:$AIN$18,$J543,0)),\"\")","v":""},{"$f":"IF(H$530>0,(HLOOKUP(H$528,'Base de dados'!$B$5:$AIN$18,$J543,0)),\"\")","v":""},{"$f":"IF(I$530>0,(HLOOKUP(I$528,'Base de dados'!$B$5:$AIN$18,$J543,0)),\"\")","v":""},13]
[null,"EIQ Impacto ao meio ambiente",null,{"$f":"IF(D$530>0,(HLOOKUP(D$528,'Base de dados'!$B$5:$AIN$18,$J544,0)),\"\")","v":""},{"$f":"IF(E$530>0,(HLOOKUP(E$528,'Base de dados'!$B$5:$AIN$18,$J544,0)),\"\")","v":""},{"$f":"IF(F$530>0,(HLOOKUP(F$528,'Base de dados'!$B$5:$AIN$18,$J544,0)),\"\")","v":""},{"$f":"IF(G$530>0,(HLOOKUP(G$528,'Base de dados'!$B$5:$AIN$18,$J544,0)),\"\")","v":""},{"$f":"IF(H$530>0,(HLOOKUP(H$528,'Base de dados'!$B$5:$AIN$18,$J544,0)),\"\")","v":""},{"$f":"IF(I$530>0,(HLOOKUP(I$528,'Base de dados'!$B$5:$AIN$18,$J544,0)),\"\")","v":""},14]
[null,"Índice Final (Quociente do Impacto Ambiental - EIQ)",null,{"$f":"IF(D$530>0,(HLOOKUP(D$528,'Base de dados'!$B$5:$AIN$18,$J545,0)),\"\")","v":""},{"$f":"IF(E$530>0,(HLOOKUP(E$528,'Base de dados'!$B$5:$AIN$18,$J545,0)),\"\")","v":""},{"$f":"IF(F$530>0,(HLOOKUP(F$528,'Base de dados'!$B$5:$AIN$18,$J545,0)),\"\")","v":""},{"$f":"IF(G$530>0,(HLOOKUP(G$528,'Base de dados'!$B$5:$AIN$18,$J545,0)),\"\")","v":""},{"$f":"IF(H$530>0,(HLOOKUP(H$528,'Base de dados'!$B$5:$AIN$18,$J545,0)),\"\")","v":""},{"$f":"IF(I$530>0,(HLOOKUP(I$528,'Base de dados'!$B$5:$AIN$18,$J545,0)),\"\")","v":""},11]
[null,"Produto banido na União Européia (X)",null,{"$f":"IF(D$530>0,(HLOOKUP(D$528,'Base de dados'!$B$5:$AIN$19,$J546,0)),\"\")","v":""},{"$f":"IF(E$530>0,(HLOOKUP(E$528,'Base de dados'!$B$5:$AIN$19,$J546,0)),\"\")","v":""},{"$f":"IF(F$530>0,(HLOOKUP(F$528,'Base de dados'!$B$5:$AIN$19,$J546,0)),\"\")","v":""},{"$f":"IF(G$530>0,(HLOOKUP(G$528,'Base de dados'!$B$5:$AIN$19,$J546,0)),\"\")","v":""},{"$f":"IF(H$530>0,(HLOOKUP(H$528,'Base de dados'!$B$5:$AIN$19,$J546,0)),\"\")","v":""},{"$f":"IF(I$530>0,(HLOOKUP(I$528,'Base de dados'!$B$5:$AIN$19,$J546,0)),\"\")","v":""},15,{"$f":"COUNTIF('2 INDICADORES'!D321:F321,\"x\")","v":0},{"$f":"COUNTIF(D491:L491,\"x\")","v":0},{"$f":"COUNTIF(D519:L519,\"x\")","v":0},{"$f":"COUNTIF(D546:I546,\"x\")","v":0}]
[{"$nulls":13},{"$f":"SUM(K546:N546)","v":0}]
[null,{"$f":"+'2 INDICADORES'!B323:C323","v":"Conteúdo de argila no solo (no talhão)                        > 60% (1);     30% - 60% (2);        <30% (3)"}]
[null,{"$f":"+'2 INDICADORES'!B324:C324","v":"Distância do curso d' água (borda do talhão)     >1.000m (1);  300 - 1.000m (2);  <300m (3)"}]
[null,{"$f":"+'2 INDICADORES'!B325:C325","v":"Tipo de manejo do solo: Solo protegido (1); Solo sem revolvimento (2); Solo com revolvimento (3)"}]
[null,"Vulnerabilidade do talhão",null,{"$f":"IF(D531>0,(IF(OR(AND(1<=FÓRMULAS!M462,FÓRMULAS!M462<=3)),1,IF(OR(AND(3<FÓRMULAS!M462,FÓRMULAS!M462<=9)),2,IF(FÓRMULAS!M462>9,3)))),\"\")","v":""},{"$f":"IF(E531>0,(IF(OR(AND(1<=FÓRMULAS!N462,FÓRMULAS!N462<=3)),1,IF(OR(AND(3<FÓRMULAS!N462,FÓRMULAS!N462<=9)),2,IF(FÓRMULAS!N462>9,3)))),\"\")","v":""},{"$f":"IF(F531>0,(IF(OR(AND(1<=FÓRMULAS!B468,FÓRMULAS!B468<=3)),1,IF(OR(AND(3<FÓRMULAS!B468,FÓRMULAS!B468<=9)),2,IF(FÓRMULAS!B468>9,3)))),\"\")","v":""},{"$f":"IF(G531>0,(IF(OR(AND(1<=FÓRMULAS!C468,FÓRMULAS!C468<=3)),1,IF(OR(AND(3<FÓRMULAS!C468,FÓRMULAS!C468<=9)),2,IF(FÓRMULAS!C468>9,3)))),\"\")","v":""},{"$f":"IF(H531>0,(IF(OR(AND(1<=FÓRMULAS!D468,FÓRMULAS!D468<=3)),1,IF(OR(AND(3<FÓRMULAS!D468,FÓRMULAS!D468<=9)),2,IF(FÓRMULAS!D468>9,3)))),\"\")","v":""},{"$f":"IF(I531>0,(IF(OR(AND(1<=FÓRMULAS!E468,FÓRMULAS!E468<=3)),1,IF(OR(AND(3<FÓRMULAS!E468,FÓRMULAS!E468<=9)),2,IF(FÓRMULAS!E468>9,3)))),\"\")","v":""}]
[]
[null,"Risco de contaminação",null,{"$f":"IF(D531>0,(IF(OR(AND(1<=FÓRMULAS!M464,FÓRMULAS!M464<=2)),1,IF(OR(AND(2<FÓRMULAS!M464,FÓRMULAS!M464<=4)),2,IF(FÓRMULAS!M464>4,3)))),\"\")","v":""},{"$f":"IF(E531>0,(IF(OR(AND(1<=FÓRMULAS!N464,FÓRMULAS!N464<=2)),1,IF(OR(AND(2<FÓRMULAS!N464,FÓRMULAS!N464<=4)),2,IF(FÓRMULAS!N464>4,3)))),\"\")","v":""},{"$f":"IF(F531>0,(IF(OR(AND(1<=FÓRMULAS!B470,FÓRMULAS!B470<=2)),1,IF(OR(AND(2<FÓRMULAS!B470,FÓRMULAS!B470<=4)),2,IF(FÓRMULAS!B470>4,3)))),\"\")","v":""},{"$f":"IF(G531>0,(IF(OR(AND(1<=FÓRMULAS!C470,FÓRMULAS!C470<=2)),1,IF(OR(AND(2<FÓRMULAS!C470,FÓRMULAS!C470<=4)),2,IF(FÓRMULAS!C470>4,3)))),\"\")","v":""},{"$f":"IF(H531>0,(IF(OR(AND(1<=FÓRMULAS!D470,FÓRMULAS!D470<=2)),1,IF(OR(AND(2<FÓRMULAS!D470,FÓRMULAS!D470<=4)),2,IF(FÓRMULAS!D470>4,3)))),\"\")","v":""},{"$f":"IF(I531>0,(IF(OR(AND(1<=FÓRMULAS!E470,FÓRMULAS!E470<=2)),1,IF(OR(AND(2<FÓRMULAS!E470,FÓRMULAS!E470<=4)),2,IF(FÓRMULAS!E470>4,3)))),\"\")","v":""}]
[]
[null,{"$f":"+'2 INDICADORES'!B329:C329","v":"Identificação da cultura"},null,{"$f":"+'2 INDICADORES'!D329","v":0},{"$f":"+'2 INDICADORES'!E329","v":0},{"$f":"+'2 INDICADORES'!F329","v":0},{"$f":"'2 INDICADORES'!H329","v":0},{"$f":"+'2 INDICADORES'!H329","v":0}]
[null,{"$f":"+'2 INDICADORES'!B330:C330","v":"Área (ha)"},null,{"$f":"+'2 INDICADORES'!D330","v":0},{"$f":"+'2 INDICADORES'!E330","v":0},{"$f":"+'2 INDICADORES'!F330","v":0},{"$f":"'2 INDICADORES'!H330","v":0},{"$f":"+'2 INDICADORES'!H330","v":0}]
[null,{"$f":"+'2 INDICADORES'!B331:C331","v":"Risco máximo identificado (1 - baixo), (2 - médio) ou (3 - alto)"},null,{"$f":"+'2 INDICADORES'!D331","v":0},{"$f":"+'2 INDICADORES'!E331","v":0},{"$f":"+'2 INDICADORES'!F331","v":0},{"$f":"'2 INDICADORES'!H331","v":0},{"$f":"+'2 INDICADORES'!H331","v":0}]
[null,"Média do risco de contaminação",null,{"$f":"IF('2 INDICADORES'!D307>0,((FÓRMULAS!E561*'2 INDICADORES'!D330+FÓRMULAS!F561*'2 INDICADORES'!E330+FÓRMULAS!G561*'2 INDICADORES'!F330+FÓRMULAS!H561*'2 INDICADORES'!G330+FÓRMULAS!H562*'2 INDICADORES'!H330)/D560),\"\")","v":""},{"$f":"IF(AND('2 INDICADORES'!D306>0,D557=1),0.6,\"\")","v":""},{"$f":"IF(AND('2 INDICADORES'!D306>0,E557=1),0.6,\"\")","v":""},{"$f":"IF(AND('2 INDICADORES'!D306>0,F557=1),0.6,\"\")","v":""},{"$f":"IF(AND('2 INDICADORES'!D306>0,G557=1),0.6,\"\")","v":""}]
[null,"Volume total de agrotóxicos utilizados em 1 ano",null,{"$f":"IF('2 INDICADORES'!D307>0,'2 INDICADORES'!D308+'2 INDICADORES'!E308+'2 INDICADORES'!F308+'2 INDICADORES'!G308+'2 INDICADORES'!H308+FÓRMULAS!D477+FÓRMULAS!E477+FÓRMULAS!F477+FÓRMULAS!G477+FÓRMULAS!H477+FÓRMULAS!I477+FÓRMULAS!J477+FÓRMULAS!K477+FÓRMULAS!L477+FÓRMULAS!D505+FÓRMULAS!E505+FÓRMULAS!F505+FÓRMULAS!G505+FÓRMULAS!H505+FÓRMULAS!I505+FÓRMULAS!J505+FÓRMULAS!K505+FÓRMULAS!L505+FÓRMULAS!D532+FÓRMULAS!E532+FÓRMULAS!F532+FÓRMULAS!G532+FÓRMULAS!H532+FÓRMULAS!I532,\"\")","v":""},{"$f":"IF(AND('2 INDICADORES'!D306>0,D557=2),0.3,\"\")","v":""},{"$f":"IF(AND('2 INDICADORES'!D306>0,E557=2),0.3,\"\")","v":""},{"$f":"IF(AND('2 INDICADORES'!D306>0,F557=2),0.3,\"\")","v":""},{"$f":"IF(AND('2 INDICADORES'!D306>0,G557=2),0.3,\"\")","v":""}]
[null,"Área total de lavoura (incluindo rotações)",null,{"$f":"IF('2 INDICADORES'!D330>0,(SUM('2 INDICADORES'!D330:H330)),\"\")","v":""},{"$f":"IF(AND('2 INDICADORES'!D306>0,D557=3),0.1,\"\")","v":""},{"$f":"IF(AND('2 INDICADORES'!D306>0,E557=3),0.1,\"\")","v":""},{"$f":"IF(AND('2 INDICADORES'!D306>0,F557=3),0.1,\"\")","v":""},{"$f":"IF(AND('2 INDICADORES'!D306>0,G557=3),0.1,\"\")","v":""}]
[null,"Volume total / área identificada nos talhões",null,{"$f":"IF('2 INDICADORES'!D307>0,(D559/D560),\"\")","v":""},{"$f":"SUM(E558:E560)","v":0},{"$f":"SUM(F558:F560)","v":0},{"$f":"SUM(G558:G560)","v":0},{"$f":"SUM(H558:H560)","v":0}]
[null,"Volume total / área com uso agropecuário",null,{"$f":"IF('2 INDICADORES'!D307>0,D559/('1 QUESTIONÁRIO'!D76+'1 QUESTIONÁRIO'!D77+'1 QUESTIONÁRIO'!D78+'1 QUESTIONÁRIO'!D79),\"\")","v":""},{"$f":"IF(AND('2 INDICADORES'!D306>0,H557=1),0.6,\"\")","v":""},{"$f":"IF(AND('2 INDICADORES'!D306>0,H557=2),0.3,\"\")","v":""},{"$f":"IF(AND('2 INDICADORES'!D306>0,H557=2),0.3,\"\")","v":""},{"$f":"SUM(E562:G562)","v":0}]
[null,{"$f":"IF(AND('2 INDICADORES'!D306>0,'2 INDICADORES'!D331=1),0.6,\"\")","v":""},{"$f":"IF(AND('2 INDICADORES'!D306>0,'2 INDICADORES'!E331=1),0.6,\"\")","v":""},{"$f":"IF(AND('2 INDICADORES'!D306>0,'2 INDICADORES'!F331=1),0.6,\"\")","v":""},{"$f":"IF(AND('2 INDICADORES'!D306>0,'2 INDICADORES'!G331=1),0.6,\"\")","v":""}]
[null,{"$f":"IF(AND('2 INDICADORES'!D306>0,'2 INDICADORES'!D331=3),0.1,\"\")","v":""},{"$f":"IF(AND('2 INDICADORES'!D306>0,'2 INDICADORES'!E331=3),0.1,\"\")","v":""},{"$f":"IF(AND('2 INDICADORES'!D306>0,'2 INDICADORES'!F331=3),0.1,\"\")","v":""},{"$f":"IF(AND('2 INDICADORES'!D306>0,'2 INDICADORES'!G331=3),0.1,\"\")","v":""}]
[]
[15,"Fator de Ponderação",null,null,"Fórmulas",null,"Até 5%","5%-10%","> 10%",null,null,"Inicial","Redução"]
[null,"item 15.1","Ponderação",{"$nulls":3},{"$f":"IF(E575>0,1,\" \")","v":" "},{"$f":"IF(G575>0,1,\" \")","v":" "},{"$f":"IF(I575>0,1,\" \")","v":" "},null,null,"Intermediário","Inalterado"]
[null,"Até 5%",0.55,{"$nulls":3},{"$f":"IF(E573>0,1,\" \")","v":" "},{"$f":"IF(G573>0,1,\" \")","v":" "},{"$f":"IF(I573>0,1,\" \")","v":" "},null,null,"Avançado","Intensificação"]
[null,"5 - 10%",0.45,{"$nulls":3},{"$f":"IF(E571>0,1,\" \")","v":" "},{"$f":"IF(G571>0,1,\" \")","v":" "},{"$f":"IF(I571>0,1,\" \")","v":" "}]
[null,"Acima de 10%",0.35,null,{"$f":"IF('2 INDICADORES'!$F$336<0.05,'2 INDICADORES'!$E$336,0)","v":0},null,{"$f":"IF('2 INDICADORES'!$F$336>=0.05,'2 INDICADORES'!$E$336,0)","v":0},null,{"$f":"IF('2 INDICADORES'!$F$336>0.1,'2 INDICADORES'!$E$336,0)","v":0}]
[null,"item 15.1","Ponderação",null,{"$f":"IF('2 INDICADORES'!D336=FÓRMULAS!L566,FÓRMULAS!E570,0)","v":0},null,{"$f":"IF(I570>0.99,0,IF('2 INDICADORES'!D336=FÓRMULAS!L566,FÓRMULAS!G570,0))","v":0},null,{"$f":"IF('2 INDICADORES'!D336=FÓRMULAS!L566,FÓRMULAS!I570,0)","v":0}]
[null,"avançado",{"v":0.5,"d":"0.50"},null,{"$f":"IF('2 INDICADORES'!$F$336<0.05,'2 INDICADORES'!$E$336,0)","v":0},null,{"$f":"IF('2 INDICADORES'!$F$336>=0.05,'2 INDICADORES'!$E$336,0)","v":0},null,{"$f":"IF('2 INDICADORES'!$F$336>0.1,'2 INDICADORES'!$E$336,0)","v":0}]
[null,"intermediário",{"v":0.8,"d":"0.80"},null,{"$f":"IF('2 INDICADORES'!D336=FÓRMULAS!L567,FÓRMULAS!E572,0)","v":0},null,{"$f":"IF(I572>0.99,0,IF('2 INDICADORES'!D336=FÓRMULAS!L567,FÓRMULAS!G572,0))","v":0},null,{"$f":"IF('2 INDICADORES'!D336=FÓRMULAS!L567,FÓRMULAS!I572,0)","v":0},null,{"$f":"+C568","v":0.55}]
[null,"inicial",1,null,{"$f":"IF('2 INDICADORES'!$F$336<0.05,'2 INDICADORES'!$E$336,0)","v":0},null,{"$f":"IF('2 INDICADORES'!$F$336>=0.05,'2 INDICADORES'!$E$336,0)","v":0},null,{"$f":"IF('2 INDICADORES'!$F$336>0.1,'2 INDICADORES'!$E$336,0)","v":0},null,{"$f":"+C569","v":0.45}]
[null,"item 15.2","Ponderação",null,{"$f":"IF('2 INDICADORES'!D336=FÓRMULAS!L568,FÓRMULAS!E574,0)","v":0},null,{"$f":"IF(I574>0.99,0,IF('2 INDICADORES'!D336=FÓRMULAS!L568,FÓRMULAS!G574,0))","v":0},null,{"$f":"IF('2 INDICADORES'!D336=FÓRMULAS!L568,FÓRMULAS!I574,0)","v":0},null,{"$f":"+C570","v":0.35}]
[null,"redução",1.2,null,{"$f":"IF(E578>0,E578,0)+IF(F578>0,F578,0)+IF(G578>0,G578,0)","v":{"v":0,"d":"0.00"}}]
[null,"inalterado",{"v":1,"d":"1.0"},null,{"$f":"IF('2 INDICADORES'!D338=\"Redução\",1,0)","v":{"v":0,"d":"0.00"}},{"$f":"IF('2 INDICADORES'!D338=\"Inalterado\",1,0)","v":{"v":0,"d":"0.00"}},{"$f":"IF('2 INDICADORES'!D338=\"Intensificação\",1,0)","v":{"v":0,"d":"0.00"}}]
[null,"intensificação",0.8,null,{"$f":"IF(E571>0,'2 INDICADORES'!G336*FÓRMULAS!K573,0)+IF(E573>0,'2 INDICADORES'!G337*FÓRMULAS!K573,0)+IF(E575>0,'2 INDICADORES'!G338*FÓRMULAS!K573,0)","v":0},{"$f":"IF(G571>0,'2 INDICADORES'!G336*FÓRMULAS!K574,0)+IF(G573>0,'2 INDICADORES'!G337*FÓRMULAS!K574,0)+IF(G575>0,'2 INDICADORES'!G338*FÓRMULAS!K574,0)","v":0},{"$f":"IF(I571>0,'2 INDICADORES'!G336*FÓRMULAS!K575,0)+IF(I573>0,'2 INDICADORES'!G337*FÓRMULAS!K575,0)+IF(I575>0,'2 INDICADORES'!G338*FÓRMULAS!K575,0)","v":0}]
[{"$nulls":4},"Fórmula - verifica a proporção da área em processo de degradação em relação à área total e ao grau de intensidade do fenômeno. Após o cálculo, multiplica o valor final pelo fator 1,2, se verificada tendência de redução do estádio de degradação ou pelo fator 0,8, se a tendência é de intensificação do estádio de degradação."]
[]
[]
[]
[16,"Fator de ponderação",null,null,"Fórmulas"]
[null,"Suficiente",0.9,null,{"$f":"'2 INDICADORES'!D345/FÓRMULAS!J587","v":{"$error":"#DIV/0!"}},{"$f":"'2 INDICADORES'!E345/FÓRMULAS!J587","v":{"$error":"#DIV/0!"}},{"$f":"'2 INDICADORES'!F345/FÓRMULAS!J587","v":{"$error":"#DIV/0!"}},{"$f":"'2 INDICADORES'!G345/FÓRMULAS!J587","v":{"$error":"#DIV/0!"}},null,{"$f":"FÓRMULAS!E584+FÓRMULAS!F584+FÓRMULAS!G584+FÓRMULAS!H584","v":{"$error":"#DIV/0!"}},null,"Suficiente"]
[null,"Insuficiente",0.3,null,{"$f":"'2 INDICADORES'!D346/FÓRMULAS!J587","v":{"$error":"#DIV/0!"}},{"$f":"'2 INDICADORES'!E346/FÓRMULAS!J587","v":{"$error":"#DIV/0!"}},{"$f":"'2 INDICADORES'!F346/FÓRMULAS!J587","v":{"$error":"#DIV/0!"}},{"$f":"'2 INDICADORES'!G346/FÓRMULAS!J587","v":{"$error":"#DIV/0!"}},null,{"$f":"FÓRMULAS!E585+FÓRMULAS!F585+FÓRMULAS!G585+FÓRMULAS!H585","v":{"$error":"#DIV/0!"}},null,"Insuficiente"]
[null,"Situação inadequada",0.1,null,{"$f":"'2 INDICADORES'!D347/FÓRMULAS!J587","v":{"$error":"#DIV/0!"}},{"$f":"'2 INDICADORES'!E347/FÓRMULAS!J587","v":{"$error":"#DIV/0!"}},{"$f":"'2 INDICADORES'!F347/FÓRMULAS!J587","v":{"$error":"#DIV/0!"}},{"$f":"'2 INDICADORES'!G347/FÓRMULAS!J587","v":{"$error":"#DIV/0!"}},null,{"$f":"FÓRMULAS!E586+FÓRMULAS!F586+FÓRMULAS!G586+FÓRMULAS!H586","v":{"$error":"#DIV/0!"}},null,"Situação crítica"]
[{"$nulls":4},"Área Total da propriedade no croqui (ha)=>",{"$nulls":3},{"$f":"+'1 QUESTIONÁRIO'!G92","v":{"v":0,"d":"0.00"}},{"$f":"'2 INDICADORES'!D345+'2 INDICADORES'!D346+'2 INDICADORES'!D347+'2 INDICADORES'!E345+'2 INDICADORES'!E346+'2 INDICADORES'!E347+'2 INDICADORES'!F345+'2 INDICADORES'!F346+'2 INDICADORES'!F347+'2 INDICADORES'!G345+'2 INDICADORES'!G346+'2 INDICADORES'!G347","v":{"v":0,"d":"0.0"}}]
[]
[null,"Ponderação",null,null,{"$f":"IF('2 INDICADORES'!D350=\"Suficiente\",FÓRMULAS!B590,0)","v":0},{"$f":"IF('2 INDICADORES'!D350=\"Insuficiente\",FÓRMULAS!B591,0)","v":0},{"$f":"IF('2 INDICADORES'!D350=\"Situação crítica\",FÓRMULAS!B592,0)","v":0},{"$f":"IF('2 INDICADORES'!D350=\"Suficiente\",FÓRMULAS!B590,0)","v":0}]
[null,{"$f":"+'2 INDICADORES'!E350","v":{"v":1,"d":"1.0"}},null,null,{"$f":"(FÓRMULAS!J584*FÓRMULAS!C584)+(FÓRMULAS!J585*FÓRMULAS!C585)+(FÓRMULAS!J586*FÓRMULAS!C586)","v":{"$error":"#DIV/0!"}},{"$f":"SUM(H589:H591)","v":{"v":0,"d":"0.00"}},null,{"$f":"IF('2 INDICADORES'!D350=\"Insuficiente\",FÓRMULAS!B591,0)","v":0}]
[null,{"$f":"+'2 INDICADORES'!E351","v":0.4},{"$nulls":5},{"$f":"IF('2 INDICADORES'!D350=\"Situação crítica\",FÓRMULAS!B592,0)","v":0}]
[null,{"$f":"+'2 INDICADORES'!E352","v":0.1}]
[]
[17,"Fator de ponderação",null,null,"Fórmulas"]
[null,{"$f":"+'2 INDICADORES'!C357","v":"Presença de declividade transversal ou abaulamento das estradas"},{"v":1,"d":"1.0"},null,{"$f":"IF(F595>1,1,F595)","v":{"v":0,"d":"0.00"}},{"$f":"IF(G595>0,H595/G595,H595)","v":{"v":0,"d":"0.00"}},{"$f":"COUNTIF('2 INDICADORES'!E357:E362,\">=0\")","v":0},{"$f":"('2 INDICADORES'!E357*0.8+'2 INDICADORES'!E358*0.8+'2 INDICADORES'!E359*0.8+K595+K597)","v":{"v":0,"d":"0.00"}},{"$f":"IF(E595>0,I596,E596*1.1)","v":{"v":0,"d":"0.00"}},{"$f":"IF(I595>1,1,I595)","v":{"v":0,"d":"0.00"}},{"$f":"IF('2 INDICADORES'!E361=\"\",0,1-'2 INDICADORES'!E361)","v":{"v":0,"d":"0%"}},{"$f":"IF(ISBLANK('2 INDICADORES'!H357),FÓRMULAS!$M$595,\"\")","v":"Não se aplica"},"Não se aplica"]
[null,{"$f":"+'2 INDICADORES'!C358","v":"Presença de lombadas para desvio de enxurrada"},{"v":1,"d":"1.0"},null,{"$f":"IF(F596>1,1,F596)","v":{"v":0,"d":"0.00"}},{"$f":"IF(G596>0,H596/G596,H596)","v":{"v":0,"d":"0.00"}},{"$f":"COUNTIF('2 INDICADORES'!F360:F362,\">=0\")","v":2},{"$f":"'2 INDICADORES'!H357*0.8+'2 INDICADORES'!H358*0.8+'2 INDICADORES'!H359*0.8+K596+K598","v":{"v":0,"d":"0.00"}},{"$f":"IF(E596=0,E595,((2*E595+E596)/3))","v":{"v":0,"d":"0.00"}},{"$f":"IF(OR('2 INDICADORES'!E364=\"sim\",'2 INDICADORES'!H364=\"x\"),FÓRMULAS!J595*0.7,FÓRMULAS!J595)","v":{"v":0,"d":"0.00"}},{"$f":"IF('2 INDICADORES'!H361=\"\",0,1-'2 INDICADORES'!H361)","v":{"v":0,"d":"0%"}},{"$f":"IF(ISBLANK('2 INDICADORES'!H358),FÓRMULAS!$M$595,\"\")","v":"Não se aplica"}]
[null,{"$f":"+'2 INDICADORES'!C359","v":"Presença de caixas de infiltração"},{"v":1,"d":"1.0"},{"$nulls":7},{"$f":"IF('2 INDICADORES'!E362=\"\",0,1-'2 INDICADORES'!E362)","v":{"v":0,"d":"0%"}},{"$f":"IF(ISBLANK('2 INDICADORES'!H359),FÓRMULAS!$M$595,\"\")","v":"Não se aplica"}]
[null,{"$f":"+'2 INDICADORES'!C361","v":"Presença de buracos nas estradas"},{"v":1,"d":"1.0"},{"$nulls":7},{"$f":"IF('2 INDICADORES'!H362=\"\",0,1-'2 INDICADORES'!H362)","v":{"v":0,"d":"0%"}},{"$f":"IF(ISBLANK('2 INDICADORES'!#REF!),FÓRMULAS!$M$595,\"\")","v":""}]
[null,{"$f":"+'2 INDICADORES'!C362","v":"Presença de sulcos de erosão nas estradas"},{"v":1,"d":"1.0"},{"$nulls":8},{"$f":"IF(ISBLANK('2 INDICADORES'!#REF!),FÓRMULAS!$M$595,\"\")","v":""}]
[{"$nulls":11},{"$f":"IF(ISBLANK('2 INDICADORES'!H364),FÓRMULAS!$M$595,\"\")","v":"Não se aplica"}]
[]
[18,"Fórmulas",{"$nulls":6},"Campo rupestre/altitude",null,"Fator de ponderação"]
[null,"18.1 - Fórmulas: Se a área total com vegetação nativa for superior a 20% da área total do estabelecimento, acréscimo de 10% no resultado final.",{"$nulls":6},"Campo higrófilo de várzea",null,"Estádio avançado",null,null,{"v":1,"d":"1.0"}]
[{"$nulls":8},"Cerrado ralo",null,"Estádio intermediário",null,null,0.9]
[null,{"$f":"'2 INDICADORES'!D371/FÓRMULAS!E626","v":{"$error":"#DIV/0!"}},{"$f":"'2 INDICADORES'!E371/FÓRMULAS!E626","v":{"$error":"#DIV/0!"}},{"$f":"'2 INDICADORES'!F371/FÓRMULAS!E626","v":{"$error":"#DIV/0!"}},{"$f":"'2 INDICADORES'!G371/FÓRMULAS!E626","v":{"$error":"#DIV/0!"}},{"$f":"IF('1 QUESTIONÁRIO'!$D$92=0,\"\",FÓRMULAS!B605+FÓRMULAS!C605+FÓRMULAS!D605+FÓRMULAS!E605)","v":""},null,null,"Cerrado típico",null,"Estádio inicial",null,null,0.7]
[null,{"$f":"'2 INDICADORES'!D372/FÓRMULAS!E626","v":{"$error":"#DIV/0!"}},{"$f":"'2 INDICADORES'!E372/FÓRMULAS!E626","v":{"$error":"#DIV/0!"}},{"$f":"'2 INDICADORES'!F372/FÓRMULAS!E626","v":{"$error":"#DIV/0!"}},{"$f":"'2 INDICADORES'!G372/FÓRMULAS!E626","v":{"$error":"#DIV/0!"}},{"$f":"IF('1 QUESTIONÁRIO'!$D$92=0,\"\",FÓRMULAS!B606+FÓRMULAS!C606+FÓRMULAS!D606+FÓRMULAS!E606)","v":""},null,null,"Cerradão"]
[null,{"$f":"'2 INDICADORES'!D373/FÓRMULAS!E626","v":{"$error":"#DIV/0!"}},{"$f":"'2 INDICADORES'!E373/FÓRMULAS!E626","v":{"$error":"#DIV/0!"}},{"$f":"'2 INDICADORES'!F373/FÓRMULAS!E626","v":{"$error":"#DIV/0!"}},{"$f":"'2 INDICADORES'!G373/FÓRMULAS!E626","v":{"$error":"#DIV/0!"}},{"$f":"IF('1 QUESTIONÁRIO'!$D$92=0,\"\",FÓRMULAS!B607+FÓRMULAS!C607+FÓRMULAS!D607+FÓRMULAS!E607)","v":""},null,null,"Mata de galeria"]
[null,{"$f":"IF(FÓRMULAS!E627>20%,(((FÓRMULAS!F605*FÓRMULAS!N603)+(FÓRMULAS!F606*FÓRMULAS!N604)+(FÓRMULAS!F607*FÓRMULAS!N605))*1.1),(FÓRMULAS!F605*FÓRMULAS!N603)+(FÓRMULAS!F606*FÓRMULAS!N604)+(FÓRMULAS!F607*FÓRMULAS!N605))","v":{"$error":"#DIV/0!"}},{"$f":"IF(B608>1,1,B608)","v":{"$error":"#DIV/0!"}},{"$nulls":5},"Veredas",null,"Fatores de ponderação"]
[null,{"$f":"'1 QUESTIONÁRIO'!D92","v":{"v":0,"d":"0.00"}},{"$nulls":6},"Mata Atlântica/Mata Seca",null,"Nº de fragmentos"]
[null,{"$f":"IF('2 INDICADORES'!G379=\"sim\",(('2 INDICADORES'!C374+'2 INDICADORES'!C377)/2*1.1),(('2 INDICADORES'!C377+'2 INDICADORES'!C374)/2))","v":{"$error":"#VALUE!"}},{"$f":"IF(B610>1,1,B610)","v":{"$error":"#VALUE!"}},{"$nulls":5},"Vegetação de caatinga",null,1,null,null,{"v":1,"d":"1.0"}]
[null,{"$f":"IF('2 INDICADORES'!G380=\"sim\",FÓRMULAS!C610,FÓRMULAS!C610*0.75)","v":{"$error":"#VALUE!"}},{"$nulls":8},2,null,null,0.9]
[{"$nulls":10},3,null,null,0.8]
[null,"Área total vegetação nativa (%)",{"$f":"B609/FÓRMULAS!I587","v":{"$error":"#DIV/0!"}},"18.2 - Se a área com vegetação nativa < 5% da área total, rebate de 35% no resultado final ",{"$nulls":6},4,null,null,0.7]
[{"$nulls":10},5,null,null,0.6]
[{"$nulls":10},6,null,null,0.5]
[null,{"$f":"1.1-0.1*'2 INDICADORES'!E376","v":1.1},{"$f":"IF(C613<5%,B616*0.65,B616)","v":{"$error":"#DIV/0!"}},{"$f":"IF('1 QUESTIONÁRIO'!D92=0,0.1,FÓRMULAS!C616)","v":0.1}]
[null,"18.2 - Fórmula= 1,1 - 0,1x"]
[]
[null,"Estádio inicial - ausência de estratificação definida/predominância de indivíduos jovens com até 5 m, diâmetro altura do peito de 10 cm; serapilheira fina camada/Embaúba, Esporão de Galo, Assa Peixe, Camará, etc. "]
[]
[null,"Estádio médio - estratificação incipiente - 2 estratos - dossel e sub-bosque; árvores de 5 a 12 m de altura, redução gradativa de arbustos e arboredos; presença marcante de cipós; maior riqueza e abundância de epífitas; serapilheira presente; DAP entre 10 e 20 cm; predomínio de arbóreas."]
[]
[null,"Estádio avançado - três estratos - dossel, subdossel e sub-bosque; dossel superior 1 m de altura com ocorrência frequente de árvores emergentes; sub-bosque menos expressivo em relação ao estádio médio; menor densidade de cipós e arbustos, riqueza de epífitas; trepadeiras lenhosas; DAP superior a 18 cm."]
[]
[]
[null,"Área com vegetação nativa - CAR (ha)",null,null,{"$f":"'1 QUESTIONÁRIO'!D92","v":{"v":0,"d":"0.00"}}]
[null,"Área com vegetação nativa/área total do estabelecimento (CAR)",null,null,{"$f":"E626/'1 QUESTIONÁRIO'!G92","v":{"$error":"#DIV/0!"}}]
[]
[]
[19,"Fator de ponderação",{"$nulls":3},"Fórmulas"]
[null,"Uso adequado + vegetação nativa  ",null,0.7,null,null,{"$f":"(((J632*FÓRMULAS!D631)+(J633*FÓRMULAS!D632))/100)","v":{"$error":"#DIV/0!"}},{"$f":"G631*('2 INDICADORES'!G388)","v":{"$error":"#DIV/0!"}},{"$f":"IF('2 INDICADORES'!G388=\"\",FÓRMULAS!G631,FÓRMULAS!H631)","v":{"$error":"#DIV/0!"}},"%"]
[null,"Uso inadequado",null,0.1,null,{"$f":"IF('1 QUESTIONÁRIO'!D97>0,FÓRMULAS!I632,0.7)","v":{"v":0.7,"d":"0.70"}},null,null,{"$f":"IF(FÓRMULAS!I631>1,1,FÓRMULAS!I631)","v":{"$error":"#DIV/0!"}},{"$f":"+'2 INDICADORES'!G385/'2 INDICADORES'!$G$387*100","v":{"$error":"#DIV/0!"}}]
[{"$nulls":9},{"$f":"+'2 INDICADORES'!G386/'2 INDICADORES'!$G$387*100","v":{"$error":"#DIV/0!"}}]
[]
[null,"Uso da APP com qualquer atividade antrópica posterior a 2008 (informação do produtor)"]
[]
[]
[null,"Proporção das APPs em relação a área total (%)  =>",{"$nulls":4},{"$f":"('2 INDICADORES'!G385+'2 INDICADORES'!G386)/FÓRMULAS!I587","v":{"$error":"#DIV/0!"}}]
[]
[]
[20,"Fator de ponderação",{"$nulls":3},"Fórmulas"]
[null,"Vegetação nativa excedente à RL",null,{"v":1,"d":"1.0"},null,"Atual %",{"$f":"IF('2 INDICADORES'!F395>0,L646,0)","v":{"v":0,"d":"0.00"}},{"$f":"IF('2 INDICADORES'!F396>0,+'2 INDICADORES'!F396/'2 INDICADORES'!D392*100,0)","v":{"v":0,"d":"0.00"}},{"$f":"IF('2 INDICADORES'!F397>0,+'2 INDICADORES'!F397/'2 INDICADORES'!D392*100,0)","v":{"$error":"#DIV/0!"}},null,{"$f":"'2 INDICADORES'!F395/'1 QUESTIONÁRIO'!B66","v":{"$error":"#DIV/0!"}},{"$f":"IF(K642>2,1,0)","v":{"$error":"#DIV/0!"}}]
[null,"RL fora do imóvel rural",null,0.7,null,null,{"$f":"IF('2 INDICADORES'!F398>0,+'2 INDICADORES'!F398/'2 INDICADORES'!D392*100,0)","v":{"v":0,"d":"0.00"}},{"$f":"SUM(F645:F646)","v":{"$error":"#DIV/0!"}},{"$nulls":3},{"$f":"IF(AND(K642>=1,K642<=2),0.67,0)","v":{"$error":"#DIV/0!"}}]
[null,"Áreas de/para RL não passíveis de recomposição",null,0.7,null,{"$f":"IF(AND('2 INDICADORES'!D394=0,G645=0),0.7,G645)","v":{"$error":"#DIV/0!"}},{"$f":"IF('2 INDICADORES'!F396>0,I645,F644)","v":{"$error":"#DIV/0!"}},{"$f":"FÓRMULAS!G655","v":0},{"$f":"IF(FÓRMULAS!G662>20%,0,FÓRMULAS!G655)","v":{"$error":"#DIV/0!"}},null,null,{"$f":"IF(AND(K642<1,K642>0),0.34,0)","v":{"$error":"#DIV/0!"}}]
[null,"Áreas de/para RL que necessitam de recomposição",null,0.1,null,{"$f":"IF(G644>1,1,G644)","v":{"$error":"#DIV/0!"}},{"$f":"IF('2 INDICADORES'!F398=\"\",((((H642*FÓRMULAS!D643)+(I642*FÓRMULAS!D644)+(G643*FÓRMULAS!D645))/100)+G642*0.3),(((H642*FÓRMULAS!D643)+(I642*FÓRMULAS!D644)+(G643*FÓRMULAS!D645))/100))","v":{"$error":"#DIV/0!"}},null,{"$f":"IF(AND('2 INDICADORES'!F397=\"\",'2 INDICADORES'!F398=\"\"),0.7,FÓRMULAS!F644)","v":{"$error":"#DIV/0!"}},null,null,{"$f":"IF(K642=0,0,0)","v":{"$error":"#DIV/0!"}}]
[{"$nulls":11},{"$f":"SUM(L642:L645)","v":{"$error":"#DIV/0!"}}]
[null,"Área de RL (20%)",{"$nulls":3},{"$f":"+FÓRMULAS!M655","v":{"v":0,"d":"0.00"}}]
[null,"Área de vegetação nativa em APP passível de ser computada na RL"]
[null,"Demais áreas de vegetação nativa existente na propriedade passíveis de comporem a RL"]
[null,"Área a ser recomposta ou compensada para fins de RL",{"$nulls":3},{"v":0,"d":"0.00"}]
[null,"Área de vegetação nativa passível de constituir Cota de Reserva Ambiental (CRA)"]
[]
[null,"Áreas de Reserva Legal (gerada no geoprocessamento para estabelecimentos > 4MF)"]
[null,"*Para estabelecimentos acima de 4MF (considerando a área total do estabelecimento descrita no CAR, menos a área de Servidão Administrativa)",{"$nulls":10},{"$f":"'3 RELATÓRIO'!G9","v":{"v":0,"d":"0.00"}}]
[null,"Área correspondente à Reserva Legal (ha)*",{"$nulls":4},{"$f":"IF('3 RELATÓRIO'!G10<4,0,('1 QUESTIONÁRIO'!G92-'1 QUESTIONÁRIO'!D93)*0.2)","v":{"v":0,"d":"0.00"}},{"$nulls":5},{"$f":"+M654*'1 QUESTIONÁRIO'!H104","v":0}]
[{"$nulls":12},{"$f":"+M655-'1 QUESTIONÁRIO'!#REF!","v":{"$error":"#REF!"}}]
[null,"Área de vegetação nativa passível de ser considerada como Reserva Legal (ha)*",{"$nulls":10},{"$f":"+'1 QUESTIONÁRIO'!D92-'1 QUESTIONÁRIO'!#REF!","v":{"$error":"#REF!"}}]
[]
[{"$nulls":5},"Área (ha) ","% (área total)"]
[null,"Área total cultivada (culturas, silvicultura) + pastagens",{"$nulls":3},{"$f":"+'1 QUESTIONÁRIO'!D88","v":{"v":0,"d":"0.00"}},{"$f":"F660/'1 QUESTIONÁRIO'!$G$92","v":{"$error":"#DIV/0!"}},null,null,"Área de Reserva Legal (ha)  =>",null,{"$f":"'2 INDICADORES'!D392","v":{"v":0,"d":"0.00"}}]
[null,"Área total com Vegetação Nativa",{"$nulls":3},{"$f":"+'1 QUESTIONÁRIO'!D92","v":{"v":0,"d":"0.00"}},{"$f":"F661/'1 QUESTIONÁRIO'!$G$92","v":{"$error":"#DIV/0!"}},null,"Área necessária de recomposição para RL no imóvel =>",null,null,{"$f":"IF('1 QUESTIONÁRIO'!H93<4,0,IF('1 QUESTIONÁRIO'!G104=0,L660-'1 QUESTIONÁRIO'!D92,0))","v":{"$error":"#DIV/0!"}}]
[null,"Área total classificada como APP",{"$nulls":3},{"$f":"'1 QUESTIONÁRIO'!D97","v":{"v":0,"d":"0.00"}},{"$f":"F662/'1 QUESTIONÁRIO'!$G$92","v":{"$error":"#DIV/0!"}}]
[null,"Total de áreas a serem recuperadas nas APPs",{"$nulls":3},{"$f":"+'1 QUESTIONÁRIO'!D98","v":{"v":0,"d":"0.00"}},{"$f":"F663/'1 QUESTIONÁRIO'!$G$92","v":{"$error":"#DIV/0!"}}]
[null,"Área de vegetação nativa fora das APPs e RL ",{"$nulls":3},{"$f":"F661-L660","v":{"v":0,"d":"0.00"}},{"$f":"F664/'1 QUESTIONÁRIO'!$G$92","v":{"$error":"#DIV/0!"}}]
[]
[]
[21,"Fator de ponderação",null,null,"21.1","Fórmulas"]
[null,"Suficiente",0.9]
[null,"Insuficiente",0.5]
[null,"Situação inadequada**",0.1,{"$nulls":9},{"$f":"FÓRMULAS!E671+FÓRMULAS!F671+FÓRMULAS!G671+FÓRMULAS!H671","v":{"$error":"#DIV/0!"}}]
[{"$nulls":4},{"$f":"'2 INDICADORES'!D405/FÓRMULAS!M674","v":{"$error":"#DIV/0!"}},{"$f":"'2 INDICADORES'!E405/FÓRMULAS!M674","v":{"$error":"#DIV/0!"}},{"$f":"'2 INDICADORES'!F405/FÓRMULAS!M674","v":{"$error":"#DIV/0!"}},{"$f":"'2 INDICADORES'!G405/FÓRMULAS!M674","v":{"$error":"#DIV/0!"}},{"$nulls":4},{"$f":"FÓRMULAS!E672+FÓRMULAS!F672+FÓRMULAS!G672+FÓRMULAS!H672","v":{"$error":"#DIV/0!"}}]
[null,"Fator de ponderação",null,null,{"$f":"'2 INDICADORES'!D406/FÓRMULAS!M674","v":{"$error":"#DIV/0!"}},{"$f":"'2 INDICADORES'!E406/FÓRMULAS!M674","v":{"$error":"#DIV/0!"}},{"$f":"'2 INDICADORES'!F406/FÓRMULAS!M674","v":{"$error":"#DIV/0!"}},{"$f":"'2 INDICADORES'!G406/FÓRMULAS!M674","v":{"$error":"#DIV/0!"}},{"$nulls":4},{"$f":"FÓRMULAS!E673+FÓRMULAS!F673+FÓRMULAS!G673+FÓRMULAS!H673","v":{"$error":"#DIV/0!"}}]
[null,0,{"v":0,"d":"0.0"},null,{"$f":"'2 INDICADORES'!D407/FÓRMULAS!M674","v":{"$error":"#DIV/0!"}},{"$f":"'2 INDICADORES'!E407/FÓRMULAS!M674","v":{"$error":"#DIV/0!"}},{"$f":"'2 INDICADORES'!F407/FÓRMULAS!M674","v":{"$error":"#DIV/0!"}},{"$f":"'2 INDICADORES'!G407/FÓRMULAS!M674","v":{"$error":"#DIV/0!"}}]
[null,5,0.1,{"$nulls":9},{"$f":"'2 INDICADORES'!D405+'2 INDICADORES'!D406+'2 INDICADORES'!D407+'2 INDICADORES'!E405+'2 INDICADORES'!E406+'2 INDICADORES'!E407+'2 INDICADORES'!F405+'2 INDICADORES'!F406+'2 INDICADORES'!F407+'2 INDICADORES'!G405+'2 INDICADORES'!G406+'2 INDICADORES'!G407","v":{"v":0,"d":"0.0"}}]
[null,10,0.2]
[null,20,0.4,{"$nulls":4},"Uso da terra",null,"Área","% relativa","pi*Loge"]
[null,40,0.6,{"$nulls":4},"Índice Shanon - áreas produtivas e habitats naturais"]
[null,60,0.7,{"$nulls":4},"Lavoura Permanente",null,{"$f":"+'1 QUESTIONÁRIO'!D76","v":{"v":0,"d":"0.00"}},{"$f":"J678/$J$687","v":{"$error":"#DIV/0!"}},{"$f":"IF(K678>0,K678*LOG10(K678),0)","v":{"$error":"#DIV/0!"}}]
[null,70,0.8,null,"21.2","Fórmulas",null,"Lavoura temporária",null,{"$f":"+'1 QUESTIONÁRIO'!D77","v":{"v":0,"d":"0.00"}},{"$error":"#DIV/0!"},{"$error":"#DIV/0!"}]
[null,80,0.9,null,"Fórmula =  y=a(1-exp(-bx))",null,null,"Pastagens",null,{"$f":"+'1 QUESTIONÁRIO'!D78","v":{"v":0,"d":"0.00"}},{"$error":"#DIV/0!"},{"$error":"#DIV/0!"}]
[null,100,{"v":1,"d":"1.0"},null,"r2",0.9914,null,"Silvicultura",null,{"$f":"+'1 QUESTIONÁRIO'!D79","v":{"v":0,"d":"0.00"}},{"$error":"#DIV/0!"},{"$error":"#DIV/0!"}]
[{"$nulls":4},"a",{"v":1.168,"d":"1.1680"},null,"Pousio",null,{"$f":"+'1 QUESTIONÁRIO'!D81","v":{"v":0,"d":"0.00"}},{"$error":"#DIV/0!"},{"$error":"#DIV/0!"}]
[{"$nulls":4},"b",{"v":0.017645063,"d":"0.0176"},null,"Vegetação nativa 1",null,{"$f":"SUM('2 INDICADORES'!D371:D373)","v":{"v":0,"d":"0.00"}},{"$error":"#DIV/0!"},{"$error":"#DIV/0!"}]
[{"$nulls":4},"x"," - Σpi loge pi",null,"Vegetação nativa 2",null,{"$f":"SUM('2 INDICADORES'!E371:E373)","v":{"v":0,"d":"0.00"}},{"$error":"#DIV/0!"},{"$error":"#DIV/0!"}]
[{"$nulls":7},"Vegetação nativa 3",null,{"$f":"SUM('2 INDICADORES'!F371:F373)","v":{"v":0,"d":"0.00"}},{"$error":"#DIV/0!"},{"$error":"#DIV/0!"}]
[{"$nulls":7},"Vegetação nativa 4",null,{"$f":"SUM('2 INDICADORES'!G371:G373)","v":{"v":0,"d":"0.00"}},{"$error":"#DIV/0!"},{"$error":"#DIV/0!"}]
[{"$nulls":7},"Soma",null,{"$f":"SUM(J678:J686)","v":{"v":0,"d":"0.00"}},{"$f":"SUM(K678:K686)","v":{"$error":"#DIV/0!"}},{"$f":"-(SUM(L678:L686))","v":{"$error":"#DIV/0!"}}]

{"sheet":"Base de dados","index":12,"n_rows":53,"n_cols":1065,"rows_kept":53}
["ISA",null,"BASE DE DADOS"]
["AGROTÓXICOS",null,{"$f":"COUNTA(C13:AIN13)","v":753},{"$nulls":887}," "]
["Ação",null,"Herbicida","Fungicida","Inseticida","Inseticida","Herbicida","Herbicida","Inseticida","Inseticida","Inseticida","Inseticida","Herbicida","Fungicida","Herbicida","Herbicida","Acaridica","Fungicida","Inseticida","Herbicida","Herbicida","Herbicida","Inseticida","Fungicida","Herbicida","Herbicida","Herbicida","Fungicida","Inseticida","Fungicida","Herbicida","Herbicida","Inseticida","Fungicida","Inseticida","Inseticida","Fungicida","Herbicida","Herbicida","Herbicida","Herbicida","Herbicida","Fungicida","Acaridica","Inseticida","Herbicida","Fungicida","Fungicida","Inseticida","Inseticida","Fungicida","Fungicida","Fungicida","Fungicida","Inseticida","Herbicida","Herbicida","Herbicida","Fungicida","Herbicida","Herbicida","Inseticida","Fungicida","Fungicida","Herbicida","Herbicida","Herbicida","Herbicida","Fungicida","Fungicida","Fungicida","Herbicida","Herbicida","Inseticida","Herbicida","Inseticida","Inseticida","Inseticida","Inseticida","Inseticida","Herbicida","Fungicida","Fungicida","Inseticida","Herbicida","Fungicida","Fungicida","Inseticida","Inseticida","Fungicida","Fungicida","Fungicida","Inseticida","Inseticida","Inseticida","Herbicida","Fungicida","Inseticida","Fungicida","Inseticida","Fungicida","Inseticida","Inseticida","Fungicida","Fungicida","Herbicida","Inseticida","Inseticida","Inseticida","Herbicida","Herbicida","Inseticida","Herbicida","Fungicida","Fungicida","Inseticida","Herbicida","Fungicida","Fungicida","Inseticida","Herbicida","Inseticida","Herbicida","Inseticida","Herbicida","Fungicida","Inseticida","Herbicida","Fungicida","Fungicida","Fungicida","Inseticida","Inseticida","Inseticida","Fungicida","Fungicida","Inseticida","Fungicida","Inseticida","Fungicida","Herbicida","Herbicida","Inseticida","Inseticida","Inseticida","Fungicida","Inseticida","Inseticida","Fungicida","Fungicida","Herbicida","Fungicida","Fungicida","Inseticida","Fungicida","Inseticida","Inseticida","Inseticida","Fungicida","Inseticida","Herbicida","Inseticida","Inseticida","Fungicida","Fungicida","Inseticida","Inseticida","Fungicida","Fungicida","Inseticida","Herbicida","Herbicida","Herbicida","Herbicida","Herbicida","Inseticida","Inseticida","Inseticida","Fungicida","Herbicida","Herbicida","Herbicida","Fungicida","Inseticida","Inseticida","Herbicida","Herbicida","Fungicida","Inseticida","Fungicida","Fungicida","Inseticida","Herbicida","Fungicida","Inseticida","Inseticida","Herbicida","Fungicida","Inseticida","Inseticida","Herbicida","Fungicida","Fungicida","Fungicida","Fungicida","Inseticida","Inseticida","Acaridica","Inseticida","Fungicida","Fungicida","Fungicida","Inseticida","Fungicida","Inseticida","Fungicida","Inseticida","Inseticida","Fungicida","Fungicida","Herbicida","Inseticida","Herbicida","Herbicida","Herbicida","Herbicida","Fungicida","Fungicida","Inseticida","Inseticida","Inseticida","Inseticida","Inseticida","Fungicida","Inseticida","Inseticida","Herbicida","Inseticida","Herbicida","Herbicida","Herbicida","Herbicida","Herbicida","Fungicida","Fungicida","Herbicida","Herbicida","Herbicida","Herbicida","Fungicida","Fungicida","Herbicida","Herbicida","Fungicida","Fungicida","Inseticida","Fungicida","Fungicida","Fungicida","Inseticida","Inseticida","Herbicida","Fungicida","Fungicida","Fungicida","Fungicida","Herbicida","Fungicida","Fungicida","Inseticida","Inseticida","Inseticida","Inseticida","Inseticida","Herbicida","Inseticida","Acaridica","Herbicida","Fungicida","Inseticida","Inseticida","Inseticida","Herbicida","Herbicida","Herbicida","Fungicida","Herbicida","Inseticida","Fungicida","Inseticida","Herbicida","Fungicida","Acaridica","Inseticida","Fungicida","Inseticida","Inseticida","Herbicida","Inseticida","Fungicida","Herbicida","Herbicida","Fungicida","Inseticida","Herbicida","Herbicida","Fungicida","Inseticida","Fungicida","Inseticida","Herbicida","Herbicida","Herbicida","Herbicida","Fungicida","Fungicida","Inseticida","Fungicida","Herbicida","Fungicida","Fungicida","Fungicida","Fungicida","Fungicida","Fungicida","Fungicida","Herbicida","Herbicida","Herbicida","Herbicida","Inseticida","Fungicida","Fungicida","Inseticida","Inseticida","Inseticida","Fungicida","Fungicida","Fungicida","Fungicida","Inseticida","Fungicida","Herbicida","Herbicida","Inseticida","Fungicida","Inseticida","Inseticida","Inseticida","Inseticida","Inseticida","Herbicida","Herbicida","Inseticida","Herbicida","Herbicida","Herbicida","Herbicida","Fungicida","Herbicida","Herbicida","Herbicida","Herbicida","Herbicida","Herbicida","Inseticida","Herbicida","Herbicida","Herbicida","Herbicida","Herbicida","Fungicida","Inseticida","Inseticida","Herbicida","Herbicida","Herbicida","Herbicida","Herbicida","Inseticida","Herbicida","Herbicida","Herbicida","Herbicida","Inseticida","Fungicida","Fungicida","Fungicida","Herbicida","Fungicida","Fungicida","Fungicida","Herbicida","Herbicida","Herbicida","Herbicida","Herbicida","Fungicida","Inseticida","Inseticida","Inseticida","Fungicida","Inseticida","Fungicida","Inseticida","Herbicida","Inseticida","Fungicida","Inseticida","Inseticida","Inseticida","Herbicida","Herbicida","Fungicida","Fungicida","Fungicida","Fungicida","Herbicida","Fungicida","Inseticida","Inseticida","Herbicida","Fungicida","Inseticida","Herbicida","Fungicida","Herbicida","Herbicida","Fungicida","Herbicida","Herbicida","Inseticida","Herbicida","Fungicida","Herbicida","Herbicida","Herbicida","Inseticida","Inseticida","Inseticida","Herbicida","Herbicida","Herbicida","Herbicida","Inseticida","Inseticida","Herbicida","Inseticida","Fungicida","Herbicida","Inseticida","Fungicida","Fungicida","Fungicida","Fungicida","Inseticida","Inseticida","Inseticida","Fungicida","Fungicida","Inseticida","Herbicida","Fungicida","Inseticida","Herbicida","Fungicida","Fungicida","Herbicida","Herbicida","Inseticida","Inseticida","Fungicida","Herbicida","Fungicida","Inseticida","Inseticida","Fungicida","Herbicida","Herbicida","Inseticida","Inseticida","Herbicida","Herbicida","Herbicida","Herbicida","Fungicida","Inseticida","Fungicida","Inseticida","Fungicida","Fungicida","Herbicida","Herbicida","Herbicida","Fungicida","Inseticida","Herbicida","Herbicida","Herbicida","Fungicida","Inseticida","Inseticida","Inseticida","Inseticida","Herbicida","Inseticida","Herbicida","Inseticida","Fungicida","Acaridica","Acaridica","Herbicida","Herbicida","Fungicida","Fungicida","Fungicida","Fungicida","Inseticida","Fungicida","Herbicida","Acaridica","Herbicida","Fungicida","Fungicida","Herbicida","Herbicida","Herbicida","Herbicida","Herbicida","Herbicida","Fungicida","Herbicida","Fungicida","Herbicida","Inseticida","Fungicida","Fungicida","Herbicida","Fungicida","Fungicida","Herbicida","Inseticida","Fungicida","Inseticida","Inseticida","Inseticida","Fungicida","Inseticida","Inseticida","Herbicida","Herbicida","Herbicida","Herbicida","Herbicida","Inseticida","Fungicida","Inseticida","Herbicida","Inseticida","Herbicida","Inseticida","Fungicida","Herbicida","Inseticida","Fungicida","Herbicida","Herbicida","Herbicida","Herbicida","Herbicida","Fungicida","Herbicida","Fungicida","Fungicida","Fungicida","Inseticida","Fungicida","Inseticida","Inseticida","Herbicida","Fungicida","Fungicida","Herbicida","Herbicida","Acaridica","Fungicida","Fungicida","Fungicida","Fungicida","Fungicida","Herbicida","Herbicida","Herbicida","Herbicida","Herbicida","Herbicida","Herbicida","Herbicida","Fungicida","Inseticida","Herbicida","Herbicida","Herbicida","Herbicida","Herbicida","Inseticida","Inseticida","Herbicida","Herbicida","Inseticida","Herbicida","Fungicida","Fungicida","Inseticida","Fungicida","Inseticida","Inseticida","Herbicida","Herbicida","Herbicida","Fungicida","Herbicida","Herbicida","Herbicida","Fungicida","Acaridica","Inseticida","Inseticida","Herbicida","Inseticida","Herbicida","Herbicida","Fungicida","Herbicida","Herbicida","Herbicida","Fungicida","Inseticida","Herbicida","Herbicida","Herbicida","Herbicida","Inseticida","Fungicida","Herbicida","Inseticida","Fungicida","Acaridica","Herbicida","Herbicida","Inseticida","Herbicida","Fungicida","Inseticida","Fungicida","Herbicida","Herbicida","Fungicida","Herbicida","Inseticida","Herbicida","Inseticida","Inseticida","Herbicida","Inseticida","Inseticida","Herbicida","Fungicida","Fungicida","Fungicida","Herbicida","Inseticida","Herbicida","Inseticida","Inseticida","Inseticida","Inseticida","Fungicida","Fungicida","Herbicida","Inseticida","Herbicida","Fungicida","Fungicida","Inseticida","Herbicida","Fungicida","Fungicida","Inseticida","Inseticida","Inseticida","Herbicida","Fungicida","Fungicida","Fungicida","Inseticida","Fungicida","Herbicida","Fungicida","Fungicida","Inseticida","Herbicida","Herbicida","Herbicida","Inseticida","Herbicida","Herbicida","Fungicida","Fungicida","Herbicida","Inseticida","Fungicida","Inseticida","Herbicida","Inseticida","Fungicida","Inseticida","Fungicida","Fungicida","Herbicida","Herbicida","Inseticida","Herbicida","Fungicida","Herbicida","Fungicida","Fungicida","Fungicida","Inseticida","Fungicida","Fungicida","Herbicida","Fungicida","Fungicida","Fungicida","Herbicida","Fungicida","Inseticida","Herbicida","Fungicida","Inseticida","Herbicida","Fungicida","Fungicida","Herbicida","Herbicida","Fungicida","Inseticida","Fungicida","Herbicida","Herbicida","Fungicida","Fungicida","Fungicida","Fungicida","Herbicida","Inseticida","Inseticida","Fungicida","Inseticida","Inseticida","Fungicida","Fungicida","Fungicida","Fungicida","Herbicida","Herbicida","Inseticida","Fungicida","Herbicida","Fungicida","Fungicida","Herbicida","Herbicida","Fungicida","Fungicida","Herbicida","Fungicida","Fungicida","Fungicida",{"$nulls":284},{"$f":"COUNTA(AIP3:ANW3)","v":0}]
["Grupo Químico",null,"Ácido Ariloxialcanóico","Triazol","Avermectina","Avermectina","Sulfoniluréia","Sulfoniluréia","Organofosforado","Organofosforado","Organofosforado","Neonicotinóide","Cloracetanilida","Benzotiadiazol","éter difenílico","Éter difenílico","piretróide","Estrobilurina","Neonicotinoide","Triazolona","Uréia","  Triazolona","ácido tetramico ","Estrobilurina","ácido ariloxialcanóico","Cloracetanilida","Cloracetanilida","pirazol carboxamida","Piretroide ","fosfonato","Alquilazina","Sulfoniluréia","Antranilamida","Triazol","Semicarbazone","Piretróide","Pirimidilamina","Triazina","Triazina","triazolinona","Ácido Ariloxialcanóico","ácido piridiniloxialcanóico","Estrobilurina","arilformamidina","Avermectina","Imidazolinonas","Dimetilditiocarbamato","alquilenobis","Benzoiluréia","tiadiazinona","Fenilpiridinilamina","estrobilurina","Triazol","Acilalaninato","Benzoiluréia","oxima ciclohexanodiona","ácido piridiniloxialcanóico","ácido piridiniloxialcanóico","Triazol"," sulfanililcarbamato"," sulfanililcarbamato","benzoiluréia","Triazol","Triazol","Triazina","Triazina","Triazina","Triazina","Dicarboximida","Triazol","Inorgânico","oxima ciclohexanodiona","  Triazolona","Neonicotinóide","Uréia","Organofosforado","Oxadiazina","Avermectina","Tetranortriterpenóide","Tetranortriterpenóide","sulfoniluréia","Estrobilurina","Estrobilurina","Neonicotinóide","Benzotiadiazinona","isotiocianato de metila","Triazol","metilcarbamato de oxima","Diamida do ácido fitálico","triazol","acilalaninato","Benzimidazóis","Antranilamida","Metilcarbamato de benzofuranila ","Metilcarbamato de benzofuranila ","Benzotiadiazinona","Valinamida carbamato","avermectina","pirazol carboxamida","Piretróide","Composto inorgânico","Piretróide","Piretróide","benzotiazol","Benzotiadiazol","ácido pirimidiniloxibenzóico","Piretróide","benzoiluréia","Éter piridiloxipropílico","éter difenílico","Bipiridílio","Piretróide","Triazolona",{"$f":"DJ5","v":"Boscalid"},"Anilida","metilcarbamato de oxima","Uracila","alifático halogenado","triazol","Piretróide","isotiocianato de metila ","tiadiazinona","Uréia","organofosforado","Tricetona","inorgânico","neonicotinóide","ácido piridinocarboxílico","Anilida","Dicarboximida","Dicarboximida","Carbamato","Piretróide","Metilcarbamato de naftila","Benzimidazóis","Benzimidazóis","nicotinóide","Benzimidazóis","metilcarbamato de benzofuranila","carboxanilida","Éter difenílico","  Triazolona","tiocarbamato","tiocarbamato","Benzoiluréia","antibioótico","Organofosforado","Organofosforado","Triazol","Fenamidona","Oxima ciclohexanodiona","Benzimidazóis","Carbonitrilas","Benzoiluréia","Dicarboximida","Pirazol","piridina azometina","Antranilamida","imidazol","antranilamida","sulfoniluréia","organofosforado","Neonicotinóide","Fenilpiridinilamina","acetamida","Piretróide","Piretróide","Triazol","anilinopirimidina","Triazinamina","   Sulfoniluréia","Oxima ciclohexanodiona","ácido ariloxifenoxipropiônico","isoxazolidinona","sulfonanilida triazolopirimidina","Antranilamida","análogo de pirazol","benzoiluréia","carbamato","   Sulfoniluréia","   Sulfoniluréia","   Sulfoniluréia","Carbonitrilas","Organofosforado","Neocotinoide","Sulfonanilida triazolopirimidina","Uréia","Estrobilurina","Piretróide","Fenilpiridinilamina","triazol","Neonicotinóide","Imidazolinonas","Alquilenobis (ditiocarbamato)","Éter piridiloxipropílico","organofosforado","Triazina","Triazol","Neonicotinóide","Neonicotinoide","Imidazolinonas","Composto inorgânico","Carbonitrilas","Alquilenobis (ditiocarbamato)","Alquilenobis (ditiocarbamato)","Benzoiluréia","Organofosforado","acylacetonitrila","Piretróide","Carbonitrilas","Carbonitrilas","Carbonitrilas","Piretróide","isotiocianato de metila","Piretróide","quinona","Piretróide","Antranilamida","Benzimidazóis","Benzimidazóis","Bipiridílio","feniltiouréia","Bipiridílio","Ácido Benzóico","Bipiridílio","Sulfonanilida triazolopirimidina","Triazol","Triazol","Benzoiluréia","Benzoiluréia","Benzoiluréia","Benzoiluréia","organofosforado","morfolina","organofosforado","Benzoiluréia","triazolinona","Neonicotinóide","Uréia","Bipiridílio","Bipiridílio","Amônia Quaternária","Uréia","Alquilenobis (ditiocarbamato)","quinona","Uréia","Uréia","Ácido Ariloxialcanóico","Benzotiadiazinona","guanidina","guanidina","Éter difenílico","Cloroacetanilida","Triazol","Estrobilurina","Piretróide","Inorgânico","Triazol","Alquilenobis (ditiocarbamato)","Neonicotinoide","cetoenol","sulfoniluréia","Composto inorgânico","Triazol","acetamida","oxazolidinadiona ","Sulfoniluréia","Triazol","anilinopirimidina","Piretróide","espinosinas","espinosinas","cetoenol","cetoenol","Alquilazina","Piretróide","difenil oxazolina","sulfoniluréia","éter tiadiazólico","Organofosforado","espinosinas","sulfoxaminas","Triazina","Triazina","ácido quinolinocarboxílico","oxazolidinadiona ","Homoalanina substituída","Piretroide ","Fenamidona","Organophosphate","Ácido ariloxifenoxipropiônico","Pirazol","pirazol","Piretróide","Morfolina","Piretróide","Piretróide","Homoalanina substituída","Fenilpirazol","Triazol","Sulfoniluréia","Éter difenílico","Estrobilurina","nicotinóide","Arilpicolinato","Ácido ariloxifenoxipropiônico","Fenilpiridinilamina","Diamida do ácido fitálico","fenilpirrol","Benzoiluréia","Sulfonanilida triazolopirimidina","Ciclohexenodicarboximida","Ciclohexenodicarboximida","Ciclohexenodicarboximida","benzamida","Benzamida","Butenolida","Triazol","ácido piridiniloxialcanóico","carboxamida","Triazol","Carboxamida","Triazol","Acilalaninato","Dicarboximida","Dicarboximida","Éter difenílico","Sulfoniluréia","Isoxazol","Uréia","Antranilamida","morfolina","fosfonato","Composto inorgânico","organofosforado","organofosforado","Triazolintiona","Fenilpiridinilamina","Benzimidazóis","Carbonitrilas","Piretróide","Triazol","Éter difenílico","Ácido ariloxifenoxipropiônico","carbamato","acilalaninato","Neonicotinóide","Éter difenílico","piretróide","Piretróide","Benzoiluréia","Arilpicolinato","Cloroacetanilida","Composto inorgânico","triazina","Triazina","Triazina","sulfoniluréia","Carbonitrilas","Glicina Substituída","Homoalanina substituída","Glicina Substituída","Éter difenílico","Bipiridílio","Bipiridílio","Organofosforado","Uréia","sulfoniluréia","ácido piridinocarboxílico","sulfoniluréia","ácido ariloxifenoxipropiônico","imidazol","benzoiluréia","antranilamida","pirimidinadiona","Bipiridílio","Dinitroanilina","Triazina","Uréia","Piretróide","Triazinona","Triazinona","Triazinona","Triazinona","iazolidinacarboxamida","Inorgânico","Organoestânico","Triazol","Sulfoniluréia","Carbonitrilas","Imidazol","Imidazol","Imidazolinonas","Imidazolinonas","Imidazolinonas","Imidazolinonas","imidazolinona","Triazol","Neonicotinóide","Neonicotinóide","organofosforado","Triazol","Benzoiluréia","carboxamida","Benzoiluréia","Fluorakyltriazine","Oxadiazina","carbamato","Piretróide","Fenilpirazol","Diacilhidrazina","sulfoniluréia","Sulfoniluréia","Triazol","Dicarboximida","Carbonitrilas","phenyloxoethyl thiophene amide,","Isoxazol","Triazol","Piretróide","Piretróide","Cloracetanilida","Composto inorgânico","Piretróide","Uréia","antibioótico","Sulfoniluréia","sulfoniluréia","phenyloxoethyl thiophene amide,","Triazolona","Imidazolinonas","Organofosforado","Uracila","Composto inorgânico","Sulfoniluréia","Cloracetanilida","Éter difenílico","Piretróide","metilcarbamato de oxima","carbamato","Uréia","Homoalanina substituída","Uréia","Uréia","Organofosforado","Benzoiluréia","Tricetona","Fenilpirazol","Imidazol","Triazinona","Organofosforado","Triazol","Alquilenobis (ditiocarbamato)","éter mandelamida","Alquilenobis (ditiocarbamato)","Fenilpirazol","metilcarbamato de benzofuranila","Benzoiluréia","Acilalaninato","fenilpirrol","Neonicotinóide","ácido ariloxialcanóico","triazol","Piretróide","Tricetona","Dicarboximida","Organoestânico","Tricetona","Tricetona","semicarbazone","Semicarbazone","Acilalaninato","isotiocianato de metila ","triazol","metilcarbamato de oxima","organofosforado","alquilenobis","Cloroacetanilida","Cloroacetanilida","metilcarbamato de oxima","Diacilhidrazina","Triazinona","Alquilazina","Sulfoniluréia","Sulfoniluréia","Triazol","diacilhidrazina","carboxamida","sulfonamida fluoroalifática","feniluréia","carboxamida","organoarsênico","Éter difenílico","Sulfoniluréia","Triazol","espinosinas","Sulfoniluréia","Sulfoniluréia","Sulfoniluréia","Triazol","Benzoiluréia","Organofosforado","Éter difenílico","Organofosforado","Sulfoniluréia","Neonicotinóide","Bipiridílio","cetoenol","Triazol","acylacetonitrila","sulfito de alquila","Imidazolinonas","Imidazolinonas","Triazol","triazol","Triazol","Carboxamida","Organofosforado","Dicarboximida","sulfoniluréia","pirazol","oxadiazolona","Piperidinil Tiazol Izoxazolina","Composto inorgânico","Éter difenílico","Sulfonanilida triazolopirimidina","ácido ariloxifenoxipropiônico","   Sulfoniluréia","Bipiridílio","Homoalanina substituída","feniluréia","Dinitroanilina","Alquilenobis (ditiocarbamato)","sulfonanilida triazolopirimidina","Piretróide","Alquilenobis (ditiocarbamato)","Triazol","ácido piridinocarboxílico","estrobilurina","carboxamida","Ácido ariloxifenoxipropiônico","piridina azometina","Estrobilurina","análogo de pirazol","Piretróide","piridazinona","anilinopirimidina","Organofosforado","Éter piridiloxipropílico","análogo de ácido pirimidiniloxibenzóico","Pirazol","Imidazolinonas","oxima ciclohexanodiona","Ácido ariloxifenoxipropiônico","feniltiouréia","alquilenobis","Neocotinoide","Triazolona","Éter difenílico","Oxima ciclohexanodiona","Metilcarbamato de benzofuranila ","Triazol","Dinitroanilina","Antranilamida","triazol","Sulfonanilida triazolopirimidina","Triazina","Triazina","Triazina","Triazina","Triazol","Triazina","Estrobilurina","Estrobilurina","Triazol","Éter piridiloxipropílico","Dicarboximida","avermectina","Organofosforado","oxima ciclohexanodiona","Pirazol","Triazolintiona","triazina","Anilida","sulfito de alquila","Triazol","Triazol","alquilenobis","Triazol","Triazolintiona","Isoxazol","Alquilazina","ácido quinolinocarboxílico","Ácido ariloxifenoxipropiônico","ácido ariloxifenoxipropiônico","Ciclohexenodicarboximida","  Triazolona","Ácido Benzóico","Triazol","Organofosforado","Cloroacetanilida","Ácido ariloxifenoxipropiônico","Imidazolinonas","sulfonanilida triazolopirimidina","isoxazolidinona","Organofosforado","Fenilpirazol","Bipiridílio","Amônia Quaternária","Fenilpirazol","Ciclohexenodicarboximida","éter mandelamida","Dimetilditiocarbamato","Fenilpirazol","Alquilenobis (ditiocarbamato)","Neonicotinóide","Éter difenílico","ácido pirimidiniloxibenzóico","Sulfoniluréia","oxadiazolona","Dicarboximida","Glicina Substituída","Glicina Substituída","Glicina Substituída","Dicarboximida","piretróide","organofosforado","Piretróide","pirimidinadiona","piridazinona","Sulfoniluréia","  Triazolona","Triazol","Sulfonanilida triazolopirimidina","Oxima ciclohexanodiona","Ácido ariloxifenoxipropiônico","Dimetilditiocarbamato","carbamato","sulfoniluréia","Triazinona","Cloroacetanilida","oxima ciclohexanodiona","Metilcarbamato de naftila","Dicarboximida","Triazina","Butenolida","Triazol","difenil oxazolina","Benzoilciclohexanodiona","Triazolona","Neonicotinóide","Imidazolinonas","Triazol","Piretróide","Triazol","Sulfonanilida triazolopirimidina","Uréia","Anilida","  Triazolona","Piretróide","Anilida","Fenilpirazol","Fenilpirazol","análogo de ácido pirimidiniloxibenzóico","Piretróide","Fenilpirazol","Sulfoniluréia","Triazol","carboxamida","inorgânico","Triazolona","sulfonamida fluoroalifática","Sulfoniluréia","sulfoxaminas","Piretróide","Organofosforado","Organofosforado","Dicarboximida","Dicarboximida","Ciclohexenodicarboximida","Organofosforado","Ciclohexenodicarboximida","Inorgânico","Benzimidazóis","organofosforado","Cloracetanilida","Triazol","Triazol","iazolidinacarboxamida","Piretróide","Piretróide","Ácido ariloxifenoxipropiônico","Triazol","Triazol","Triazol","diacilhidrazina","Triazol","Uréia","Benzimidazóis","benzimidazol","Benzoiluréia","Benzoilciclohexanodiona","Triazinona","oxima ciclohexanodiona","organofosforado","Triazina","Triazina","éter tiadiazólico","Triazol","ácido piridinocarboxílico","Benzoiluréia","benzimidazol","neonicotinóide","Triazolona","Éter piridiloxipropílico","Triazol","Carbamato","Benzimidazóis","Dimetilditiocarbamato","Bipiridílio","Triazinona","Pirazol","ácido ariloxifenoxipropiônico","Benzimidazóis","ácido piridiniloxialcanóico","Triazol","Valinamida carbamato","Carbonitrilas","Piretróide","Triazol","benzotiazol","ácido piridiniloxialcanóico","Estrobilurina","imidazol","Estrobilurina","sulfoniluréia","imidazol","Benzoiluréia","Dinitroanilina","Triazol","Triazinamina","Ácido dioxociclohexanocarboxílico","Triazol","triazol","Ácido dioxociclohexanocarboxílico","Glicina Substituída","anilinopirimidina","Piretróide","Inorgânico","   Sulfoniluréia","Triazinona","Estrobilurina","Triazol","Benzamida","Triazol","ácido ariloxifenoxipropiônico","Antranilamida","Semicarbazone","Morfolina","Avermectina","Organofosforado","Triazol","Dimetilditiocarbamato","carboxanilida","Dimetilditiocarbamato","organoarsênico","Benzotiadiazinona","Benzoiluréia","benzamida","Pirazol","Estrobilurina","Pirimidilamina","imidazolinona","Sulfoniluréia","Carbonitrilas","Carbonitrilas","Ciclohexenodicarboximida","Triazol","Piperidinil Tiazol Izoxazolina","benzamida"]
["PRODUTO",null,"2,4 D ","Abacus","Abamectim","Abamectina","Accent","Accurate","Ace ","Acefato ","Acehero","Acetamiprido","Acetocloro","Acibenzolar-S-metílico ","Acifluorfem-sódico ","Acillatem","Acrinatrina","Acronis","Actara","Adengo","Afalon","Affinity","Afidopiropeno ","Agria","Agritone","Alaclor",{"$f":"AA6","v":"Alacloro"},"Alade",{"$f":"AC6","v":"Alfa-Cipermetrina "},"Aliette","Alion","Ally","Altacor","Alto 100","Alverde","Ametista","Ametoctradina","Ametrex ","Ametrina","Amicarbazona","Aminol 806","Aminopiralide","Amistar","Amitraz ","Ampligo","Amplo","Anchor ","Antracol","Antrimo ","Applaud","Approve","Aproach Power","Aproach Prima","Apron RFC","Aptika","Aramo","Arbust","Arreio","Artea","Asulam ","Asulox","Atabron","Atento","Ativum","Atranex","Atrasimex","Atrasimex",{"$f":"BP6","v":"Atrazina"},"Attic","AUG ","Auge","Aura","Aurora","Autêntico","Aval","Avant ","Avatar","Avicta ","Azadiractina ","Azamax","Azimsulfurom ","Azimut",{"$f":"CE6","v":"Azoxistrobina "},"Bamako ","Basagran","Basamid","Baytan ","Bazuka ","Belt","Belyan","Benalaxil ","Bendazol","Benevia","Benforce",{"$f":"CQ6","v":"Benfuracarb"},{"$f":"CR6","v":"Bentazona"},"Bentiavalicarbe isopropílico ","Benzoato de emamectina","Benzovindiflupir",{"$f":"CV6","v":"Beta-ciflutrina "},"Bicarbonato de potássio","Bifentrina","Biflex","Bim","Bion","Bispirabaque","Bistar","Bistrifluron","Blade","Blazer","Blowout","Bold","Boral ",{"$f":"DJ6","v":"Boscalid"},"Boscalida","Brilhante ","Bromacila","Brometo de metila ","Bromuconazol","Bulldock ","Bunema","Buprofezina","Butiron","Cadusafós ","Callisto","Calpik","Calypso","Campestre","Cantus","Captan","Captana","Captor","Capture","Carbaril ","Carben ","Carbendazim","Carbine","Carbomax ","Carbossulfano ","Carboxina ","Cardeal",{"$f":"EL6","v":"Carfentrazona-etílica"},"Cartape","Cartarys","Cascade","Casugamicina","Catcher ","Cefanol","Celeiro","Censor","Centurion","Cercobin","Cerconil","Certero","Certus","Chaser","Chess",{"$f":"FB6","v":"Ciantraniliprole"},"Ciazofamida ","Ciclaniliprole","Ciclossulfamurom","Cierto","Cigaral","Cignus","Cimoxanil","Cipermetrina","Cipertrin",{"$f":"FL6","v":"Ciproconazol "},"ciprodinil",{"$f":"FN6","v":"Ciromazina  "},"Classic","Cletodim","Clodinafope-Propargil ","Clomazona","Cloransulam-metílico",{"$f":"FT6","v":"Clorantraniliprole "},"Clorfenapir","Clorfuazurom","Cloridrato de propamocarbe ","Clorim",{"$f":"FY6","v":"Clorimurom-etílico"},"Clorimuron","Clorotalonil","Clorpirifós","Clotianidina","Coact","Combine ","Comet","Commanche ","Completto","Condor","Connect","Contain","Controller","Cordial","Counter","Coyote","Cronnos","Cropstar","Cruiser","Cultifix","Cupravit","Cuprodil ","Cuprosate Gold ","Cuprozeb","Curyom ","Curyom ","Cyflumetofen ","Cyptrin","Dacobre ","Daconil","Dacostar","Danimen ","Dazomete ","Decis","Delan",{"$f":"HI6","v":"Deltametrina"},"Dermacor","Derosal","Derox","Dessicash","Diafenturiom",{"$f":"HO6","v":"Dibrometo de diquate "},"Dicamba",{"$f":"HQ6","v":"Dicloreto de Paraquate"},{"$f":"HR6","v":"Diclosulam "},"Difcor",{"$f":"HT6","v":"Difenoconazol"},"Diflubenzuron","Diflucrop","Diflumax ","Dimax ","Dimetoato ","Dimetomorfe","Dimexion","Dimilim","Dinamic","Dinofeturam","Diox","Diquash ","Diquat ","Diquate","Direx ","Dithane","Ditianona","Diurex ","Diuron","DMA ","Doble","Dodex","Dodina ","Drible","Dual Gold","Egan","Elatus","Eleitto","Ellect","Eminent ","Emzeb ","Engeo","Envidor","Envoke","Enxofre","Epoxiconazol","Equation","Equation","Equip Plus","Erradicur","Erune",{"$f":"JJ6","v":"Esfenvalerato"},"Espinetoram ","Espinosade ","Espirodiclofeno","Espiromesifeno","Esplanade",{"$f":"JP6","v":"Etofenproxi"},"Etoxazol","Etoxissulfurom","Etridiazol","Evolution","Exalt","Expedition","Extrazin ","Facero ","Facet","Famoxadona","Fascinate ","Fastac",{"$f":"KC6","v":"Fenamidona"},"Fenitrotiona",{"$f":"KE6","v":"Fenoxaprop-P-ethyl "},"Fenpirazamina","Fenpiroximato ",{"$f":"KH6","v":"Fenpropatrina"},"Fenpropimorfe","Fentrol","Fersol","Finale","Fipronil","Flare",{"$f":"KO6","v":"Flazassulfurom"},"Flex","Flint ","Flonicamida","Florpirauxifen-benzil","Fluazifope-p-butil ",{"$f":"KU6","v":"Fluazinam"},{"$f":"KV6","v":"Flubendiamida"},"Fludioxonil",{"$f":"KX6","v":"Flufenoxurom"},{"$f":"KY6","v":"Flumetsulam"},{"$f":"KZ6","v":"Flumicloraque-pentílico "},{"$f":"LA6","v":"Flumioxazina"},"Flumyzin","Fluopicolide","Fluopiram",{"$f":"LE6","v":"Flupiradifurona "},"Fluquinconazol","Fluroxipir","Flutolanil","Flutriafol","Fluxapiroxade  ","Folicur","Folio Gold","Folpan Agricur  ",{"$f":"LN6","v":"Folpete"},"Fomesafen",{"$f":"LP6","v":"Foransulfurom"},"Fordor ","Fortaleza","Fortenza ","Forum","Fosetil","Fosfeto de alúminio","Fosmete","Fostiazato","Fox ","Frowncide","Fungicarb ","Funginil","Fury","Fusão","Fusiflex","Fusilade ","Futur","Galben","Galil","Gallaxy","Gama-cialotrina ","Gama-Cialotrina ","Game","Gapper","Gardomil","Gastoxin","Gesagard","Gesapax ","Gesaprim","Gladium","Glider ","Glifosato",{"$f":"MW6","v":"Glufosinato de amônio"},"Glyphotal ","Goal","Gramocil","Gramoxone","Graolin ","Graslan ","Gulliver","Halauxifen-metíl","Halossulfurom-metílico ","Haloxifope-P-metílico","Hanami","Hanaro","Hayate","Heat","Helmoxone","Herbadox","Herbipak ","Herburon","Hero","Hexafort","Hexanil ","Hexazinona ","Hexazuron","Hexitiazox",{"$f":"NV6","v":"Hidróxido de cobre"},{"$f":"NW6","v":"Hidróxido de Fentina"},"Horos","Hussar","Ichiban","Imazacure ",{"$f":"OB6","v":"Imazalil "},{"$f":"OC6","v":"Imazamoxi "},{"$f":"OD6","v":"Imazapique  "},{"$f":"OE6","v":"Imazapir"},"Imazaquim ","Imazetapir",{"$f":"OH6","v":"Imibenconazol "},"Imidacloprido ","Imidagold ","Imidam","Impact","Impessive ","Impirfluxam","Imunit","Indaziflam","Indoxacarb","Infinito","Insemat","Instal ","Intrepid","Invest",{"$f":"OW6","v":"Iodossulfurom-metílico-sódico"},"Ipconazol",{"$f":"OY6","v":"Iprodiona"},"Isatalonil","Isofetamida",{"$f":"PB6","v":"Isoxaflutol "},"Juno","K-Obiol","K-Othrine ","Kadett","Kaligreen","Karate zeon","Karmex","Kasumin","Katana","Kelion","Kenja","Kicker","Kifix","Klorpan ","Krovar","Kumulus","Kyron","Laço ","Lactofen",{"$f":"PV6","v":"Lambda-Cialotrina "},"Lannate","Larvin","Lava","Liberty","Linurex Agricur ",{"$f":"QB6","v":"Linurom "},"Lorsban",{"$f":"QD6","v":"Lufenuron "},"Lumica","Maestro","Magnate ","Magnus","Malation","Manage ","Mancozeb","mandipropamida","Manzate","Marathon ","Marshal","Match","Maxim","Maxim XL","Maxsan","MCPA ","mefentrifluconazol","Meothrin ","Meristo","Merpan","Mertin ","Meson ","Mesotriona","Metaflumizone ",{"$f":"RC6","v":"Metaflumizone "},{"$f":"RD6","v":"Metalaxil-M "},"Metam-sódico ","Metconazol ","Methomex ","Metidationa ","Metiram","Metolachlor ",{"$f":"RK6","v":"Metolacloro"},"Metomil",{"$f":"RM6","v":"Metoxifenozida "},{"$f":"RN6","v":"Metribuzim "},"Metribuzin",{"$f":"RP6","v":"Metsulfurom-metílico "},"Metsuram",{"$f":"RR6","v":"Miclobutanil "},"Mimic","Miravis","Mirex S","Moceren","Moncut","MSMA ","Naja","Narval ","Nativo","Natular","Nicopec","Nicosulfuron","Nippon ","Nomad ","Nomolt","Nordik",{"$f":"SI6","v":"Novalurom "},"Nufos ","Nufuron","Nuprid ","Nuquat","Oberon","Odin ","Okay","Omite","Oneshot","Only","Opera","Ópera Ultra","Orius ","Orkestra","Orthene","Orthocide ","Orthosulfamuron","Ortus","Oxadiazona ","Oxatiapiprolina","Oxicloreto de cobre",{"$f":"TE6","v":"Oxyfluorfem "},"Pacto","Panther","Panzer ","Paraquat ","Patrol ","Pencicurom ",{"$f":"TL6","v":"Pendimetalina"},"Penncozeb ","Penoxsulam","Permetrina","Persist ","Photon ","Picloram","Picoxistrobina","pidiflumetofen","Pilot","Pimetrozina",{"$f":"TW6","v":"Piraclostrobina"},"Pirate","Pirephos","Piridabem ","Pirimetanil",{"$f":"UB6","v":"Pirimifós-metílico"},{"$f":"UC6","v":"Piriproxifem "},"Piritiobaque-sódico","Piroxassulfona","Plateau","Poast","Podium ","Polo","Polyram","Poncho","Ponteiro ","Ponto","Poquer","Pottente","Praise","Premerlin ","Premio","Premis","Prevail","Primagram Gold","Primaiz Gold","Primatop ","Primestra Gold","Primo","Primóleo","Priori","Priori Xtra","Prisma","Privilege",{"$f":"VE6","v":"Procimidona"},"Proclaim","Profenofós","Profoxidim ","Prolectus","Proline","Prometrina ","Propanil","Propargito ","Propiconazol","Propiconazole ","Propinebe ","Prospect",{"$f":"VR6","v":"Protioconazol "},"Provence","Provence Total","Quincloraque ",{"$f":"VV6","v":"Quizalofop-P-ethyl "},"Quizalofope-P-tefurílico","Radiant ","Rage","Rainvel","Rancona","Rapel","Raprus","Rapsode","Raptor ","Raster","Reator","Record","Regent ","Reglone","Reglone","Rephon ","Resource ","Revus","Rhodiauram ","Rhyme","Ridomil Gold ","Rigol","Rimon ","Riper","Rometsol ","Ronstar","Rotaxil","Roundup","Roundup Ready","Roundup Transorb","Rovral ","Rufast","Rugby","Safety","Saflufenacil","Sanmite","Sanson","Savana","Score","Scorpion","Select ","Selefen ","Sementiran ","Semevin ","Sempra","Sencor ","Sequence","Setoxidim ","Sevin","Sialex ","Simazina","Sivanto","Skip ","Smite","Soberan","Solara ","Sombrero","Soyaquim ","Spectro","Sperto","Sphere Max","Spider","Spike","Spot","Spotlight","Stallion","Stam","Standak","Standak Top","Staple","Starion","Start","Stoy ","Stratego ","Sugoy","Sulfato de cobre",{"$f":"YU6","v":"Sulfentrazona  "},"Sulfluramida ","Sulfometuron metílico","Sulfoxaflor","Sumidan","Sumifog ","Sumigran ","Sumiguard ","Sumilex ","Sumisoya","Sumithion","Sumyzin","Supera","Support","Suprathion","Surpass","Systemic","Systhane","Talento","Talisman","Talstar","Targa ","Tasker","Tebuco ","Tebuconazol","Tebufenozida","Tebufort",{"$f":"ZV6","v":"Tebutiurom"},"Tebuzim ","Tecto",{"$f":"ZY6","v":"Teflubenzurom "},{"$f":"ZZ6","v":"Tembotriona"},"Tenace","Tepraloxidim ","Terbufós ","Terbumax","Terbutilazina","Terrazole",{"$f":"AAG6","v":"Tetraconazol"},"Texaro","Thorn","Tiabendazol","Tiacloprido","Tiencarbazona","Tiger ","Tilt","Tiodicarbe ",{"$f":"AAP6","v":"Tiofanato-metílico"},{"$f":"AAQ6","v":"Tiram "},"Tocha","Token","Tolfenpirade","Topic","Topsin ","Tordon Ultra","Tornado","Totalit","Totalit","Trebon ",{"$f":"ABB6","v":"Triadimenol  "},"Triciclazol","Tricopir-butolítico","Tridium","Trifimine",{"$f":"ABG6","v":"Trifloxistrobina"},"Trifloxisulfuron","Triflumizol",{"$f":"ABJ6","v":"Triflumurom"},"Trifluralina","Trifoli","Trigard ","Trinexapaque-etílico","Trinity ","Triticonazol ","Trix","Trop","Truzon","Turbo","Tutor","Twister","Unimark ","Unizeb ","UPL ","Verango Prime","Verdadero ","Verdict-max","Verimark","Verismo","Versatilis","Vertimec","Vexter","Vincit ","Vitavax ","Vitavax Thiram","Vitavax-Thiram","Volcane","Volt","Wasp ","Xavante","Yamato","Yoda","Zampo","Zaphir","Zartan","Zetanil","Zetaram ","Zethamaxx","Zoom","Zorvec","Zoxamida"]
["14.5 - Ingrediente Ativo do produto",null," 2,4 D","Epoxiconazol ","Abamectim","Abamectim","Nicossulfurom ","Metsulfurom-metílico ","Acefato","Acefato","Acefato","Acetamiprido","Acetocloro","Acibenzolar-S-metílico ","Acifluorfem-sódico ","lactofem","Acrinatrina","Piraclostrobina","Tiametoxam","Tiencarbazona","Linurom ","Carfentrazona-etílica","Afidopiropeno ","Azoxistrobina ","MCPA ","Alacloro","Alacloro","Benzovindiflupir","Alfa-Cipermetrina ","Fosetil","Indaziflam","Sulfometuron metílico","Clorantraniliprole ","Ciproconazol","Metaflumizone ","Cipermetrina","Ametoctradina","Ametrina","Ametrina","Amicarbazona"," 2,4 D","Aminopiralide","Azoxistrobina ","Amitraz ","Abamectim","Imazamoxi ","Tiram ","Propinebe ","Teflubenzurom ","Buprofezina","Fluazinam","Picoxistrobina","Ciproconazol","Metalaxil-M ","Lufenuron ","Tepraloxidim ","Tricopir-butolítico","Fluroxipir","Ciproconazol","Asulam ","Asulam ","Clorfuazurom","Fluquinconazol","Epoxiconazol ","Atrazina","Atrazina","Simazina","Atrazina","Iprodiona","Propiconazol ","Hidróxido de cobre","Profoxidim ","Carfentrazona-etílica","Acetamiprido","Tebutiurom","Acefato","Indoxacarb","Abamectim","Azadiractina ","Azadiractina ","Azimsulfurom ","Azoxistrobina ","Azoxistrobina ","Imidacloprido ","Bentazona","Dazomete ","Triadimenol  ","Metomil","Flubendiamida","mefentrifluconazol","Benalaxil ","Carbendazim","Ciantraniliprole","Benfuracarb","Benfuracarb","Bentazona","Bentiavalicarbe isopropílico ","Benzoato de emamectina","Benzovindiflupir","Beta-ciflutrina ","Bicarbonato de potássio","Bifentrina","Bifentrina","Triciclazol","Acibenzolar-S-metílico ","Bispirabaque","Bifentrina","Bistrifluron","Piriproxifem ","Acifluorfem-sódico ","Dibrometo de diquate ","Fenpropatrina","Sulfentrazona  ","Boscalid","Boscalid","Metomil","Bromacila","Brometo de metila","Bromuconazol","Beta-ciflutrina ","Metam-sódico ","Buprofezina","Tebutiurom","Cadusafós ","Mesotriona","Sulfato de cobre","Tiacloprido","Picloram","Boscalid","Captana","Captana","Tiodicarbe","Bifentrina","Carbaril ","Carbendazim","Carbendazim","Flonicamida","Carbendazim","Carbossulfano ","Carboxina ","Fomesafem","Carfentrazona-etílica","Cartape","Cartape","Flufenoxurom","Casugamicina","Clorpirifós","Acefato","Flutriafol ","Fenamidona","Cletodim","Tiofanato-metílico","Clorotalonil","Triflumurom","Iprodiona","Tolfenpirade","Pimetrozina","Ciantraniliprole","Ciazofamida ","Ciclaniliprole","Ciclossulfamurom","Fostiazato","Imidacloprido ","Fluazinam","Cimoxanil","Cipermetrina","Cipermetrina","Ciproconazol ","ciprodinil","Ciromazina  ","Clorimurom-etílico","Cletodim","Clodinafope-Propargil ","Clomazona","Cloransulam-metílico","Clorantraniliprole ","Clorfenapir","Clorfuazurom","Cloridrato de propamocarbe ","Clorimurom-etílico","Clorimurom-etílico","Clorimurom-etílico","Clorotalonil","Clorpirifós","Clotianidina","Diclosulam ","Tebutiurom","Piraclostrobina","Cipermetrina","Fluazinam","Bromuconazol","Imidacloprido ","Imazapir","Mancozebe","Piriproxifem ","Terbufós ","Atrazina","Tebuconazol ","Imidacloprido ","Tiametoxam","Imazapir","Oxicloreto de cobre","Clorotalonil","Mancozebe","Mancozebe","Lufenuron ","Profenofós","Cyflumetofen ","Cipermetrina","Clorotalonil","Clorotalonil","Clorotalonil","Fenpropatrina","Dazomete ","Deltametrina","Ditianona","Deltametrina","Clorantraniliprole ","Carbendazim","Carbendazim","Dibrometo de diquate ","Diafenturiom","Dibrometo de diquate ","Dicamba","Dicloreto de Paraquate","Diclosulam ","Difenoconazol","Difenoconazol","Diflubenzurom ","Diflubenzurom ","Diflubenzurom ","Diflubenzurom ","Dimetoato ","Dimetomorfe","Dimetoato ","Diflubenzurom ","Amicarbazona","Dinofeturam","Diurom ","Dibrometo de diquate ","Dibrometo de diquate ","Diquate","Diurom ","Mancozebe","Ditianona","Diurom ","Diurom "," 2,4 D","Bentazona","Dodina ","Dodina ","Lactofem ","Metolacloro","Tebuconazol ","Azoxistrobina ","Etofenproxi","Hidróxido de cobre","Tetraconazol","Mancozebe","Tiametoxam","Espirodiclofeno","Trifloxisulfuron","Enxofre","Epoxiconazol ","Cimoxanil","Famoxadona","Foransulfurom","Tebuconazol ","Pirimetanil","Esfenvalerato","Espinetoram ","Espinosade ","Espirodiclofeno","Espiromesifeno","Indaziflam","Etofenproxi","Etoxazol","Etoxissulfurom","Etridiazol","Acefato","Espinetoram ","Sulfoxaflor","Atrazina","Atrazina","Quincloraque ","Famoxadona","Glufosinato de amônio","Alfa-Cipermetrina ","Fenamidona","Fenitrotiona","Fenoxaprop-P-ethyl ","Fenpirazamina","Fenpiroximato ","Fenpropatrina","Fenpropimorfe","Gama-Cialotrina ","Permetrina","Glufosinato de amônio","Fipronil ","Difenoconazol","Flazassulfurom","Fomesafem","Trifloxistrobina","Flonicamida","Florpirauxifen-benzil","Fluazifope-p-butil ","Fluazinam","Flubendiamida","Fludioxonil","Flufenoxurom","Flumetsulam","Flumicloraque-pentílico ","Flumioxazina","Flumioxazina","Fluopicolide","Fluopiram","Flupiradifurona ","Fluquinconazol","Fluroxipir","Flutolanil","Flutriafol","Fluxapiroxade  ","Tebucozanol","Metalaxil-M ","Folpete","Folpete","Fomesafem","Foransulfurom","Isoxaflutol ","Tebutiurom","Ciantraniliprole","Dimetomorfe","Fosetil","Fosfeto de alúminio","Fosmete","Fostiazato","Protioconazol ","Fluazinam","Carbendazim","Clorotalonil","Cipermetrina","Tebuconazol ","Fomesafem","Fluazifope-p-butil ","Tiodicarbe","Benalaxil ","Imidacloprido ","Novalurom ","Gama-cialotrina ","Gama-Cialotrina ","Lufenuron ","Florpirauxifen-benzil","Metolacloro","Fosfeto de alúminio","Prometrina ","Ametrina","Atrazina","Etoxissulfurom","Clorotalonil","glifosato","Glufosinato de amônio","glifosato","Oxyfluorfem ","Dicloreto de Paraquate","Dicloreto de Paraquate","Pirimifós-metílico","Tebutiurom","Azimsulfurom ","Halauxifen-metíl","Halossulfurom-metílico ","Haloxifope-P-metílico","Ciazofamida ","Bistrifluron","Ciclaniliprole","Saflufenacil","Dicloreto de Paraquate","Pendimetalina","Ametrina","Diurom ","Cipermetrina","Hexazinona","Hexazinona","Hexazinona","Hexazinona","Hexitiazox","Hidróxido de cobre","Hidróxido de Fentina","Tebuconazol ","Iodossulfurom-metílico-sódico","Clorotalonil","Imazalil ","Imazalil ","Imazamoxi ","Imazapique  ","Imazapir","Imazaquim","Imazetapir","Imibenconazol ","Imidacloprido ","Imidacloprido ","Fosmete","Flutriafol ","Diflubenzurom ","Impirfluxam","Teflubenzurom ","Indaziflam","Indoxacarb","Cloridrato de propamocarbe ","Bifentrina","Fipronil ","Metoxifenozida ","Ciclossulfamurom","Iodossulfurom-metílico-sódico","Ipconazol","Iprodiona","Clorotalonil","Isofetamida","Isoxaflutol ","Propiconazol ","Deltametrina","Deltametrina","Acetocloro","Bicarbonato de potássio","Lambda-Cialotrina ","Diurom ","Casugamicina","Flazassulfurom","Orthosulfamuron","Isofetamida","Sulfentrazona  ","Imazapique  ","Clorpirifós","Bromacila","Enxofre","Nicossulfurom ","Alacloro","Lactofem ","Lambda-Cialotrina ","Metomil","Tiodicarbe","Tebutiurom","Glufosinato de amônio","Linurom ","Linurom ","Clorpirifós","Lufenuron ","Mesotriona","Fipronil ","Imazalil ","Hexazinona","Malation","Imibenconazol ","Mancozebe","mandipropamida","Mancozebe","Fipronil ","Carbossulfano ","Lufenuron","Metalaxil-M ","Fludioxonil","Dinofeturam","MCPA ","mefentrifluconazol","Fenpropatrina","Mesotriona","Captana","Hidróxido de Fentina","Mesotriona","Mesotriona","Metaflumizone ","Metaflumizone ","Metalaxil-M ","Metam-sódico ","Metconazol ","Metomil","Metidationa ","Metiram","Metolacloro","Metolacloro","Metomil","Metoxifenozida ","Metribuzim ","Indaziflam","Metsulfurom-metílico ","Metsulfurom-metílico ","Miclobutanil ","Tebufenozida","pidiflumetofen","Sulfluramida ","Pencicurom ","Flutolanil","MSMA ","lactofem","Nicossulfurom ","Tebuconazol ","Espinosade ","Nicossulfurom  ","Nicossulfurom  ","Nicossulfurom  ","Propiconazol ","Teflubenzurom ","Malation","Novalurom ","Clorpirifós","Metsulfurom-metílico ","Imidacloprido ","Dicloreto de Paraquate","Espiromesifeno","Tebuconazol ","Cyflumetofen ","Propargito ","Imazaquim","Imazapique  ","Epoxiconazol ","Metconazol ","Tebuconazol ","Fluxapiroxade  ","Acefato","Captana","Orthosulfamuron","Fenpiroximato ","Oxadiazona ","Oxatiapiprolina","Oxicloreto de cobre","Oxyfluorfem ","Cloransulam-metílico ","Quizalofope-P-tefurílico","Clorimurom-etílico","Dicloreto de Paraquate","Glufosinato de amônio","Pencicurom ","Pendimetalina","Mancozebe","Penoxsulam","Permetrina","Mancozebe","Triadimenol  ","Picloram","Picoxistrobina","pidiflumetofen","Fluazifope-p-butil ","Pimetrozina","Piraclostrobina","Clorfenapir","Esfenvalerato","Piridabem ","Pirimetanil","Pirimifós-metílico","Piriproxifem ","Piritiobaque-sódico","Piroxassulfona","Imazapique  ","Setoxidim ","Fenoxaprop-P-ethyl ","Diafenturiom","Metiram","Clotianidina","Sulfentrazona  ","Novalurom ","Cletodim","Benfuracarb","Epoxiconazol ","Trifluralina","Clorantraniliprole","Triticonazol ","Flumetsulam","Atrazina","Atrazina","Atrazina","Atrazina","Ciproconazol","Atrazina","Azoxistrobina ","Azoxistrobina ","Difenoconazol","Piriproxifem ","Procimidona","Benzoato de emamectina","Profenofós","Profoxidim ","Fenpirazamina","Protioconazol ","Prometrina ","Propanil","Propargito ","Propiconazol ","Propiconazol ","Propinebe ","Epoxiconazol ","Protioconazol ","Isoxaflutol ","Indaziflam","Quincloraque ","Quizalofop-P-ethyl ","Quizalofope-P-tefurílico","Flumicloraque-pentílico ","Carfentrazona-etílica","Dicamba","Ipconazol","Acefato","Metolacloro","Fenoxaprop-P-ethyl ","Imazamoxi ","Penoxsulam","Clomazona","Clorpirifós","Fipronil ","Dibrometo de diquate ","Diquate","Fipronil ","Flumicloraque-pentílico ","mandipropamida","Tiram ","Fipronil ","Mancozebe","Imidacloprido ","Novalurom ","Bispirabaque","Metsulfurom-metílico ","Oxadiazona ","Procimidona","Glifosato - Sal de Isopropilamina","glifosato","glifosato","Iprodiona","Acrinatrina","Cadusafós ","Etofenproxi","Saflufenacil","Piridabem ","Nicossulfurom ","Carfentrazona-etílica","Difenoconazol","Flumetsulam","Cletodim","Fenoxaprop-P-ethyl ","Tiram ","Tiodicarbe","Halossulfurom-metílico ","Metribuzim ","Metolacloro","Setoxidim ","Carbaril ","Procimidona","Simazina","Flupiradifurona ","Flutriafol","Etoxazol","Tembotriona","Sulfentrazona  ","Imidacloprido ","Imazaquim","Difenoconazol","Bifentrina","Ciproconazol","Diclosulam ","Tebutiurom","Boscalid","Carfentrazona-etílica","Gama-Cialotrina ","Propanil","Fipronil ","Fipronil ","Piritiobaque-sódico","Bifentrina","Fipronil ","Nicossulfurom  ","Propiconazol ","Impirfluxam","Sulfato de cobre","Sulfentrazona  ","Sulfluramida ","Sulfometuron metílico","Sulfoxaflor","Esfenvalerato","Fenitrotiona","Fenitrotiona","Procimidona","Procimidona","Flumioxazina","Fenitrotiona","Flumioxazina","Hidróxido de cobre","Tiofanato-metílico","Metidationa ","Acetocloro","Tebuconazol ","Miclobutanil ","Hexitiazox","Bifentrina","Bifentrina","Quizalofop-P-ethyl ","Flutriafol","Tebuconazol ","Tebuconazol ","Tebufenozida","Tebuconazol ","Tebutiurom","Carbendazim","Tiabendazol","Teflubenzurom ","Tembotriona","Metribuzim ","Tepraloxidim ","Terbufós ","Terbutilazina","Terbutilazina","Etridiazol","Tetraconazol","Halauxifen-metíl","Triflumurom","Tiabendazol","Tiacloprido","Tiencarbazona","Piriproxifem ","Propiconazol ","Tiodicarbe","Tiofanato-metílico","Tiram ","Dicloreto de Paraquate","Hexazinona","Tolfenpirade","Clodinafope-Propargil ","Tiofanato-metílico","Aminopiralide","Flutriafol","Bentiavalicarbe isopropílico ","Clorotalonil","Etofenproxi","Triadimenol  ","Triciclazol","Tricopir-butolítico","Azoxistrobina ","Triflumizol","Trifloxistrobina","Trifloxisulfuron","Triflumizol","Triflumurom","Trifluralina","Flutriafol","Ciromazina  ","Trinexapaque-etílico","Flutriafol","Triticonazol ","Trinexapaque-etílico","glifosato","ciprodinil","Beta-ciflutrina ","Hidróxido de cobre","Clorimurom-etílico","Metribuzim ","Azoxistrobina ","Ciproconazol","Fluopiram","Ciproconazol ","Haloxifope-P-metílico","Ciantraniliprole","Metaflumizone ","Fenpropimorfe","Abamectim","Clorpirifós","Flutriafol","Tiram ","Carboxina ","Tiram ","MSMA ","Bentazona","Triflumurom","Fluopicolide","Piroxassulfona","Azoxistrobina ","Ametoctradina","Imazetapir","Metsulfurom-metílico ","Clorotalonil","Clorotalonil","Flumioxazina","Flutriafol","Oxatiapiprolina","Zoxamida"]
["14.6 - Toxicidade para peixes - 96h LC50 (mg l-1)",null,63.4,3.14,0.0036,0.0036,65.7,150,0.63,0.63,0.63,100,0.36,null,17,0.1,0.0061,0.006,125,104,3.15,1.6,18.3,0.47,100,1.8,1.8,0.0035,1.8000000000000002E-3,122,1,12.5,12,19,0.228,2.8E-3,0.065,5,5,120,63.4,100,0.47,0.74,0.0036,122,"0,171",0.33,0.0065,0.33,0.055,0.075,19,"100",29,82.5,1.3,14.3,19,91.3,91.3,300,1.9,3.14,4.5,4.5,90,4.5,36.2,2.6,"0,017",15,1.6,100,87,0.63,0.17,0.0036,null,null,154,0.47,0.47,211,100,0.3,21.3,0.63,0.06,0.532,3.75,0.19,12.6,"0,038","0,038",100,10,null,0.0035,6.8e-05,1200,0.00026,0.00026,7.3,null,95,0.00026,0.5,0.27,17,67,2.3E-3,93.8,2.7,2.7,0.63,36,null,1.7,6.8e-05,0.175,0.33,87,0.13,"120",13.2,90.1,8.8,2.7,0.186,0.186,1.4,0.00026,2.6,0.19,0.19,100,0.19,0.015,2.3,170,1.6,1.6,1.6,0.0049,null,0.0013,0.63,33,0.74,25,11,17,0.021,36.2,0.049,100,12.6,0.56,0.195,7.7,114,211,0.055,29,2.8E-3,2.8E-3,19,2.41,100,8.4,25,0.21,14.4,86,12,0.007,300,99,8.4,8.4,8.4,17,0.0013,104.2,110,87,0.006,2.8E-3,0.055,1.7,211,"100",0.074,0.27,0.004,4.5,4.4,211,125,"100",43.8,17,0.074,0.074,29,0.08,0.63,2.8E-3,17,17,17,2.3E-3,0.3,0.00026,0.07,0.00026,12,0.19,0.19,67,0.007,67,98.85,19,110,1.1,1.1,0.13,0.13,0.13,0.13,30.2,6.1,30.2,0.13,120,100,6.7,67,67,21,6.7,0.074,0.07,6.7,6.7,63.4,100,0.57,0.57,0.1,1.23,4.4,0.47,0.0027,"0,017",4.3,0.074,125,0.035,730,0.063,3.14,29,0.011,100,4.4,10.56,1E-4,2.69,null,0.035,0.016,1,0.0027,null,80,2.4,0.63,2.69,101,4.5,4.5,100,0.011,710,1.8000000000000002E-3,0.74,1.3,0.19,5.2,0.00105,2.3E-3,2.3,"2000",0.0125,710,"0,248",1.1,22,170,"0,022",100,100,1.41,0.055,0.06,0.23,0.0049,300,1.1,2.3,2.3,0.36,0.98,70.5,1.9,14.3,5.4,33,546,4.4,"100","0,233","0,233",170,100,1.7000000000000002,87,12.6,6.1,122,0.0097,0.24,114,1.83,0.055,0.19,17,2.8E-3,4.4,170,1.41,"0,038",3.75,211,1,3.5E-4,"2000",29,100,1.23,0.0097,5.5,5,4.5,80,17,38,710,38,0.25,19,19,"0,404",87,154,1.33,118,0.088,0.56,0.5,0.195,98,19,"0,196",5,6.7,2.8E-3,320,320,320,320,3.2,"0,017",0.05,4.4,100,17,"1,48","1,48",122,"100","100",100,340,"0,0085",211,211,0.24,33,0.13,null,0.0065,1,0.17,99,0.00026,"0,248",4.2,7.7,100,1.5,36.2,17,2.27,1.7000000000000002,2.6,0.00026,0.00026,0.36,1200,0.00021,6.7,null,22,100,2.27,93.8,"100",0.0013,36,0.063,65.7,1.8,0.1,0.00021,0.63,"0,038",87,710,3.15,3.15,0.0013,29,"120","0,248","1,50",320,0.018,"0,0085",0.074,2.9,0.074,"0,248",0.015,29,"100",0.23,100,100,0.532,2.3E-3,"120",0.186,0.05,"120","120",0.288,0.228,"100",0.175,2.1,0.63,0.01,0.336,1.23,1.23,0.63,4.2,74.6,1,150,150,2,3,0.18,8,0.3,5.4,null,0.1,65.7,4.4,null,"65,21","65,7","65,24",2.6,0.0065,0.018,1,0.0013,150,211,19,0.016,4.4,0.63,0.043,100,"100",3.14,2.1,4.4,546,0.63,0.186,100,0.00105,1.2,0.69,43.8,0.25,5620,0.23,8.4,19,710,0.3,"0,196",0.074,100,0.0125,0.074,21.3,8.8,0.075,0.18,1.41,100,0.006,0.007,1E-4,0.0007,10.56,"0,404",0.27,930,2.2,"100",170,0.19,0.007,0.336,104.2,93.8,1,25,"0,038",3.14,"0,088",12,3.6,300,4.5,4.5,4.5,4.5,19,4.5,0.47,0.47,1.1,0.27,7.22,null,0.08,15,5.2,1.83,5.5,5.4,0.043,2.6,2.6,0.33,3.14,1.83,1.7000000000000002,1,100,0.21,0.23,1.1,1.6,98.85,1.5,0.63,1.23,0.19,122,100,14.4,0.0013,"0,248",67,21,"0,248",1.1,2.9,"0,171","0,248",0.074,211,1,95,150,1.2,7.22,38,38,38,36.2,0.0061,0.13,0.0027,98,0.0007,65.7,1.6,1.1,300,25,0.19,"0,171","0,038",118,74.6,1.23,170,2.6,7.22,90,70.5,33,null,100,93.8,211,100,1.1,0.00026,19,110,87,2.7,1.6,"2000",5.4,0.248,"0,248",930,0.00026,"0,248","65,32",2.6,null,13.2,93.8,8,12.5,101,1E-4,"1,3","1,3",7.22,7.22,2.3,"1,3",2.3,"0,017",11,0.01,0.36,4.4,2,3.2,0.00026,0.00026,0.21,33,4.4,4.4,3,4.4,87,0.19,0.55,0.0065,100,74.6,82.5,0.004,2.2,2.2,2.4,4.3,1.33,0.021,0.55,90.1,104,0.27,2.6,1.4,11,"0,171",19,320,0.049,0.21,11,100,33,10,17,0.0027,21.3,7.3,1.3,0.47,0.57,"0,022",730,0.57,0.021,"0,088",33,100,null,33,3.6,null,38,2.41,6.8e-05,"0,017",8.4,74.6,0.47,19,0.98,19,0.088,12.6,0.228,2.3,0.0036,0.0013,33,"0,171",2.3,"0,171",null,100,0.021,0.36,2.2,0.47,0.065,340,150,17,17,2.3,33,0.69,0.16]
["14.7 - Toxicidade - DAH (mg kg-1 dia-1)",null,{"v":0.05,"d":"0.050"},0.008,{"v":0.0025,"d":"0.003"},{"v":0.0025,"d":"0.003"},{"v":2,"d":"2.000"},{"v":0.22,"d":"0.220"},{"v":0.0025,"d":"0.003"},{"v":0.0025,"d":"0.003"},{"v":0.0025,"d":"0.003"},0.025,"0,0036",null,null,{"v":1.5E-3,"d":"0.002"},{"v":0.01,"d":"0.010"},{"v":0.03,"d":"0.030"},0.026,0.23,0.003,"0,03",null,"0,2",{"v":0.05,"d":"0.050"},"0,01","0,01",{"v":0.05,"d":"0.050"},"0,015",{"v":1,"d":"1.000"},"0,00001",null,{"v":1.58,"d":"1.580"},{"v":0.02,"d":"0.020"},{"v":0.03,"d":"0.030"},{"v":0.05,"d":"0.050"},{"v":10,"d":"10.000"},"0,0150","0,0150",null,{"v":0.05,"d":"0.050"},0.26,"0,2",0.003,{"v":0.0025,"d":"0.003"},{"v":9,"d":"9.000"},{"v":0.01,"d":"0.010"},0.025,{"v":0.01,"d":"0.010"},{"v":0.01,"d":"0.010"},{"v":0.01,"d":"0.010"},null,{"v":0.02,"d":"0.020"},"0,08",{"v":0.0155,"d":"0.016"},0.025,{"v":0.03,"d":"0.030"},{"v":0.8,"d":"0.800"},{"v":0.02,"d":"0.020"},0.36,0.36,null,{"v":2E-3,"d":"0.002"},0.008,{"v":0.02,"d":"0.020"},{"v":0.02,"d":"0.020"},null,{"v":0.02,"d":"0.020"},{"v":0.06,"d":"0.060"},{"v":0.04,"d":"0.040"},{"v":0.15,"d":"0.150"},0.005,"0,03",0.025,{"v":0.07,"d":"0.070"},{"v":0.0025,"d":"0.003"},0.005,{"v":0.0025,"d":"0.003"},null,null,{"v":0.1,"d":"0.10"},"0,2","0,2",{"v":0.06,"d":"0.060"},{"v":0.1,"d":"0.100"},{"v":0.01,"d":"0.010"},{"v":0.05,"d":"0.050"},{"v":0.0025,"d":"0.003"},0.017,0.035,{"v":0.04,"d":"0.040"},{"v":0.02,"d":"0.020"},{"v":0.01,"d":"0.010"},"0,01","0,01",{"v":0.1,"d":"0.100"},{"v":0.1,"d":"0.100"},null,{"v":0.05,"d":"0.050"},0.003,null,0.015,0.015,null,null,0.01,0.015,null,{"v":0.1,"d":"0.100"},null,"0,0024",{"v":0.03,"d":"0.030"},"0,0001",{"v":0.04,"d":"0.040"},{"v":0.04,"d":"0.040"},{"v":0.0025,"d":"0.003"},null,null,{"v":0.01,"d":"0.010"},0.003,{"v":1E-3,"d":"0.001"},{"v":0.01,"d":"0.010"},{"v":0.07,"d":"0.070"},{"v":0.0004,"d":"0.000"},"0,01",{"v":0.15,"d":"0.150"},{"v":0.01,"d":"0.010"},{"v":0.3,"d":"0.300"},{"v":0.04,"d":"0.040"},{"v":0.1,"d":"0.100"},{"v":0.1,"d":"0.100"},"0,01",0.015,{"v":0.007500000000000001,"d":"0.008"},{"v":0.02,"d":"0.020"},{"v":0.02,"d":"0.020"},0.025,{"v":0.02,"d":"0.020"},0.005,0.008,0.003,"0,03",null,null,"0,01",null,{"v":0.01,"d":"0.010"},{"v":0.0025,"d":"0.003"},{"v":0.01,"d":"0.010"},{"v":0.03,"d":"0.030"},"0,16",{"v":0.08,"d":"0.080"},{"v":15,"d":"15.000"},0.014,{"v":0.06,"d":"0.060"},null,{"v":0.03,"d":"0.030"},{"v":0.01,"d":"0.010"},{"v":0.17,"d":"0.170"},null,null,0.004,{"v":0.06,"d":"0.060"},{"v":0.01,"d":"0.010"},0.013,{"v":0.05,"d":"0.050"},{"v":0.05,"d":"0.050"},{"v":0.02,"d":"0.020"},{"v":0.03,"d":"0.030"},"0,06",{"v":0.02,"d":"0.020"},"0,16",0.003,0.133,null,{"v":1.58,"d":"1.580"},0.015,null,{"v":0.29,"d":"0.290"},{"v":0.02,"d":"0.020"},{"v":0.02,"d":"0.020"},{"v":0.02,"d":"0.020"},{"v":15,"d":"15.000"},{"v":0.01,"d":"0.010"},0.097,{"v":0.05,"d":"0.050"},{"v":0.07,"d":"0.070"},{"v":0.03,"d":"0.030"},{"v":0.05,"d":"0.050"},{"v":0.01,"d":"0.010"},{"v":0.01,"d":"0.010"},{"v":0.06,"d":"0.060"},"0,0001",{"v":0.05,"d":"0.050"},{"v":0.1,"d":"0.100"},{"v":0.0006,"d":"0.001"},{"v":0.02,"d":"0.020"},{"v":0.03,"d":"0.030"},{"v":0.06,"d":"0.060"},0.026,"0,0001",{"v":0.15,"d":"0.150"},{"v":15,"d":"15.000"},{"v":0.05,"d":"0.050"},{"v":0.05,"d":"0.050"},{"v":0.0155,"d":"0.016"},{"v":0.03,"d":"0.030"},{"v":0.17,"d":"0.170"},{"v":0.05,"d":"0.050"},{"v":15,"d":"15.000"},{"v":15,"d":"15.000"},{"v":15,"d":"15.000"},{"v":0.03,"d":"0.030"},{"v":0.01,"d":"0.010"},{"v":0.01,"d":"0.010"},{"v":0.01,"d":"0.010"},{"v":0.01,"d":"0.010"},{"v":1.58,"d":"1.580"},{"v":0.02,"d":"0.020"},{"v":0.02,"d":"0.020"},"0,0024",null,"0,0024",{"v":0.3,"d":"0.300"},0.004,{"v":0.05,"d":"0.050"},{"v":0.01,"d":"0.010"},{"v":0.01,"d":"0.010"},{"v":0.1,"d":"0.100"},{"v":0.1,"d":"0.100"},{"v":0.1,"d":"0.100"},{"v":0.1,"d":"0.100"},null,{"v":0.05,"d":"0.050"},null,{"v":0.1,"d":"0.100"},null,null,0.007,"0,0024","0,0024",{"v":2E-3,"d":"0.00"},0.007,{"v":0.05,"d":"0.050"},{"v":0.01,"d":"0.010"},0.007,0.007,{"v":0.05,"d":"0.050"},{"v":0.1,"d":"0.100"},{"v":0.1,"d":"0.100"},{"v":0.1,"d":"0.100"},{"v":1.5E-3,"d":"0.002"},{"v":0.1,"d":"0.100"},{"v":0.03,"d":"0.030"},"0,2",{"v":0.03,"d":"0.030"},{"v":0.15,"d":"0.150"},0.004,{"v":0.05,"d":"0.050"},0.026,0.015,0.04,null,0.008,0.013,0.006,{"v":0.25,"d":"0.250"},{"v":0.03,"d":"0.030"},{"v":0.17,"d":"0.170"},{"v":0.0175,"d":"0.018"},0.025,null,0.015,{"v":0.03,"d":"0.030"},"0,00001",{"v":0.03,"d":"0.030"},null,{"v":0.04,"d":"0.040"},0.015,{"v":0.0025,"d":"0.003"},0.025,{"v":0.04,"d":"0.040"},{"v":0.02,"d":"0.020"},{"v":0.02,"d":"0.020"},null,0.006,"0,021","0,015",{"v":0.03,"d":"0.030"},0.005,{"v":0.01,"d":"0.010"},{"v":0.13,"d":"0.130"},{"v":0.01,"d":"0.010"},{"v":0.03,"d":"0.030"},0.003,"0,0012",null,"0,021","0,0002",{"v":0.01,"d":"0.010"},"0,013",0.003,{"v":0.1,"d":"0.100"},0.025,{"v":0.5,"d":"0.50"},"0,01",{"v":0.01,"d":"0.010"},0.017,{"v":0.37,"d":"0.370"},"0,01",{"v":1E-4,"d":"0.000"},{"v":1E-4,"d":"0.000"},"0,009","0,009",{"v":0.08,"d":"0.080"},0.012,{"v":64,"d":"64.000"},{"v":2E-3,"d":"0.002"},{"v":0.8,"d":"0.800"},{"v":0.09,"d":"0.090"},{"v":0.01,"d":"0.010"},{"v":0.02,"d":"0.020"},{"v":0.03,"d":"0.030"},"0,08",{"v":0.1,"d":"0.100"},{"v":0.1,"d":"0.100"},0.003,{"v":0.25,"d":"0.250"},"0,02",{"v":0.07,"d":"0.070"},{"v":0.01,"d":"0.010"},{"v":0.05,"d":"0.050"},{"v":1,"d":"1.000"},0.019,{"v":1E-3,"d":"0.001"},0.004,{"v":0.05,"d":"0.050"},{"v":0.01,"d":"0.010"},{"v":0.02,"d":"0.020"},{"v":15,"d":"15.000"},{"v":0.05,"d":"0.050"},{"v":0.03,"d":"0.030"},0.003,"0,01","0,01",{"v":0.04,"d":"0.040"},{"v":0.06,"d":"0.060"},{"v":0.01,"d":"0.010"},{"v":0.0012,"d":"0.001"},"0,0012",{"v":0.0155,"d":"0.016"},{"v":0.5,"d":"0.50"},{"v":0.1,"d":"0.100"},0.019,null,"0,0150",{"v":0.02,"d":"0.020"},{"v":0.04,"d":"0.040"},{"v":15,"d":"15.000"},{"v":0.3,"d":"0.300"},"0,021",{"v":0.3,"d":"0.300"},{"v":3,"d":"3.000"},0.004,0.004,"0,004",{"v":0.07,"d":"0.070"},{"v":0.1,"d":"0.10"},{"v":0.058,"d":"0.06"},0.063,{"v":0.00065,"d":"0.00"},{"v":0.17,"d":"0.170"},{"$nulls":3},0.004,"0,125","0,0150",0.007,{"v":0.05,"d":"0.050"},{"v":0.05,"d":"0.050"},{"v":0.05,"d":"0.050"},{"v":0.05,"d":"0.050"},{"v":0.05,"d":"0.050"},{"v":0.03,"d":"0.030"},{"v":0.15,"d":"0.150"},{"v":0.0005,"d":"0.001"},{"v":0.03,"d":"0.030"},{"v":0.03,"d":"0.030"},{"v":15,"d":"15.000"},"0,025","0,025",{"v":9,"d":"9.000"},{"v":0.5,"d":"0.500"},"0,0001",{"v":0.25,"d":"0.250"},null,{"v":0.67,"d":"0.670"},{"v":0.06,"d":"0.060"},{"v":0.06,"d":"0.060"},{"v":1E-3,"d":"0.001"},{"v":0.01,"d":"0.010"},{"v":0.1,"d":"0.100"},null,{"v":0.01,"d":"0.010"},"0,00001",0.005,{"v":0.29,"d":"0.290"},0.015,"0,0002",{"v":0.1,"d":"0.100"},null,{"v":0.03,"d":"0.030"},0.015,{"v":0.06,"d":"0.060"},{"v":15,"d":"15.000"},{"v":0.02,"d":"0.020"},"0,02",{"v":0.04,"d":"0.040"},{"v":0.01,"d":"0.010"},{"v":0.01,"d":"0.010"},"0,0036",null,0.005,0.007,null,"0,013",null,{"v":0.02,"d":"0.020"},"0,0001",{"v":0.5,"d":"0.500"},{"v":0.01,"d":"0.010"},null,null,{"v":2,"d":"2.000"},{"v":0.01,"d":"0.010"},{"v":1.5E-3,"d":"0.002"},0.005,{"v":0.0025,"d":"0.003"},"0,01",{"v":0.07,"d":"0.070"},"0,021",0.003,0.003,{"v":0.01,"d":"0.010"},{"v":0.0155,"d":"0.016"},"0,01","0,0002","0,027",{"v":0.05,"d":"0.050"},{"v":0.03,"d":"0.030"},{"v":0.67,"d":"0.670"},{"v":0.05,"d":"0.050"},{"v":0.15,"d":"0.150"},{"v":0.05,"d":"0.050"},"0,0002",0.005,{"v":0.0155,"d":"0.016"},"0,08",{"v":0.37,"d":"0.370"},null,{"v":0.05,"d":"0.050"},0.035,{"v":0.03,"d":"0.030"},"0,01",{"v":0.1,"d":"0.100"},{"v":0.0005,"d":"0.001"},"0,01","0,01",{"v":0.01,"d":"0.010"},{"v":0.03,"d":"0.030"},"0,08",{"v":1E-3,"d":"0.001"},{"v":0.01,"d":"0.010"},{"v":0.0025,"d":"0.003"},{"v":1E-3,"d":"0.001"},{"v":0.03,"d":"0.030"},{"v":0.1,"d":"0.100"},{"v":0.1,"d":"0.100"},{"v":0.0025,"d":"0.003"},{"v":0.1,"d":"0.100"},"0,013","0,00001",{"v":0.22,"d":"0.220"},{"v":0.22,"d":"0.220"},"0,025",{"v":0.02,"d":"0.020"},0.092,null,{"v":0.2,"d":"0.200"},{"v":0.09,"d":"0.090"},null,{"v":1.5E-3,"d":"0.002"},{"v":2,"d":"2.000"},{"v":0.03,"d":"0.030"},null,"2,14","2,0","2,17",{"v":0.04,"d":"0.040"},{"v":0.01,"d":"0.010"},{"v":0.03,"d":"0.030"},{"v":0.01,"d":"0.010"},{"v":0.01,"d":"0.010"},{"v":0.22,"d":"0.220"},{"v":0.06,"d":"0.060"},0.004,{"v":0.03,"d":"0.030"},{"v":0.03,"d":"0.030"},{"v":0.17,"d":"0.170"},{"v":0.03,"d":"0.030"},{"v":0.25,"d":"0.250"},{"v":0.5,"d":"0.500"},0.008,{"v":0.01,"d":"0.010"},{"v":0.03,"d":"0.030"},{"v":0.02,"d":"0.020"},{"v":0.0025,"d":"0.003"},{"v":0.1,"d":"0.100"},null,{"v":0.01,"d":"0.010"},{"v":0.0036,"d":"0.004"},{"v":1.04,"d":"1.040"},{"v":0.15,"d":"0.150"},{"v":3,"d":"3.000"},"0,0001",0.013,{"v":0.02,"d":"0.020"},0.004,"0,021",{"v":0.2,"d":"0.200"},"0,125",{"v":0.05,"d":"0.050"},0.05,null,{"v":0.05,"d":"0.050"},{"v":0.05,"d":"0.050"},{"v":0.3,"d":"0.300"},null,0.092,"0,01",{"v":0.03,"d":"0.030"},{"v":0.03,"d":"0.030"},0.015,{"v":0.0175,"d":"0.018"},{"v":0.01,"d":"0.010"},{"v":0.17,"d":"0.170"},"0,004",{"v":0.1,"d":"0.100"},null,null,{"v":0.5,"d":"0.500"},null,{"v":0.01,"d":"0.010"},null,{"v":0.03,"d":"0.030"},0.097,"0,0001",{"v":0.01,"d":"0.010"},"0,16","0,01",0.008,{"v":15,"d":"15.000"},{"v":1.58,"d":"1.580"},0.025,{"v":1E-4,"d":"0.000"},{"v":0.02,"d":"0.020"},{"v":0.02,"d":"0.020"},{"v":0.02,"d":"0.020"},{"v":0.02,"d":"0.020"},{"v":0.02,"d":"0.020"},{"v":0.02,"d":"0.020"},"0,2","0,2",{"v":0.01,"d":"0.010"},{"v":0.1,"d":"0.100"},{"v":2.8E-3,"d":"0.003"},null,{"v":0.03,"d":"0.030"},0.005,{"v":0.13,"d":"0.130"},{"v":0.05,"d":"0.050"},null,0.02,{"v":0.03,"d":"0.030"},{"v":0.04,"d":"0.040"},{"v":0.04,"d":"0.040"},0.025,0.008,{"v":0.05,"d":"0.050"},"0,02","0,00001",null,"0,0013",0.013,{"v":1E-4,"d":"0.000"},"0,03",{"v":0.3,"d":"0.300"},0.015,{"v":0.0025,"d":"0.003"},{"v":0.1,"d":"0.100"},{"v":0.01,"d":"0.010"},{"v":9,"d":"9.000"},0.05,0.133,{"v":0.01,"d":"0.010"},"0,0002","0,0024",{"v":2E-3,"d":"0.00"},"0,0002",{"v":1E-4,"d":"0.000"},{"v":0.15,"d":"0.150"},{"v":0.01,"d":"0.010"},"0,0002",{"v":0.05,"d":"0.050"},{"v":0.06,"d":"0.060"},{"v":0.01,"d":"0.010"},0.01,{"v":0.22,"d":"0.220"},{"v":0.0036,"d":"0.004"},{"v":2.8E-3,"d":"0.003"},{"v":0.3,"d":"0.300"},{"v":0.3,"d":"0.300"},{"v":0.3,"d":"0.300"},{"v":0.06,"d":"0.060"},{"v":0.01,"d":"0.010"},{"v":0.0004,"d":"0.000"},{"v":0.03,"d":"0.030"},null,{"v":0.01,"d":"0.010"},{"v":2,"d":"2.000"},"0,03",{"v":0.01,"d":"0.010"},{"v":1E-4,"d":"0.000"},"0,16",{"v":0.01,"d":"0.010"},{"v":0.01,"d":"0.010"},"0,01",0.063,"0,013",{"v":0.1,"d":"0.100"},null,{"v":0.007500000000000001,"d":"0.008"},{"v":2.8E-3,"d":"0.003"},null,{"v":64,"d":"64.000"},{"v":0.01,"d":"0.010"},null,{"v":0.01,"d":"0.010"},"0,0001",{"v":0.06,"d":"0.060"},{"v":0.25,"d":"0.250"},{"v":0.01,"d":"0.010"},0.015,{"v":0.02,"d":"0.020"},{"v":0.05,"d":"0.050"},{"v":0.07,"d":"0.070"},{"v":0.04,"d":"0.040"},"0,03","0,0012",0.02,{"v":0.0002,"d":"0.000"},"0,0002",null,0.015,"0,0002","2,25",{"v":0.04,"d":"0.040"},null,{"v":0.15,"d":"0.150"},"0,0001",null,null,{"v":0.04,"d":"0.040"},{"v":0.0175,"d":"0.018"},"0,005","0,005",{"v":2.8E-3,"d":"0.003"},{"v":2.8E-3,"d":"0.003"},"0,009","0,005",0.009,{"v":0.15,"d":"0.150"},{"v":0.08,"d":"0.080"},{"v":1E-3,"d":"0.001"},"0,0036",{"v":0.03,"d":"0.030"},"0,025",{"v":0.03,"d":"0.030"},0.015,0.015,"0,0013",{"v":0.01,"d":"0.010"},{"v":0.03,"d":"0.030"},{"v":0.03,"d":"0.030"},{"v":0.02,"d":"0.020"},{"v":0.03,"d":"0.030"},{"v":0.07,"d":"0.070"},{"v":0.02,"d":"0.020"},{"v":0.1,"d":"0.100"},{"v":0.01,"d":"0.010"},{"v":0.01,"d":"0.010"},"0,013",0.025,{"v":0.0006,"d":"0.001"},{"v":0.004,"d":"0.00"},{"v":0.004,"d":"0.00"},0.015,0.004,{"v":0.058,"d":"0.06"},0.014,{"v":0.1,"d":"0.100"},{"v":0.01,"d":"0.010"},0.23,{"v":0.1,"d":"0.100"},{"v":0.04,"d":"0.040"},"0,01",{"v":0.08,"d":"0.080"},{"v":0.01,"d":"0.010"},0.004,{"v":0.05,"d":"0.050"},null,0.003,{"v":0.08,"d":"0.080"},0.26,{"v":0.01,"d":"0.010"},{"v":0.1,"d":"0.100"},{"v":15,"d":"15.000"},{"v":0.03,"d":"0.030"},{"v":0.05,"d":"0.050"},null,{"v":0.03,"d":"0.030"},"0,2",{"v":0.05,"d":"0.050"},{"v":0.1,"d":"0.100"},0.04,{"v":0.05,"d":"0.050"},0.014,{"v":15,"d":"15.000"},{"v":0.01,"d":"0.010"},"0,06",null,{"v":0.01,"d":"0.010"},0.025,null,{"v":0.3,"d":"0.300"},{"v":0.03,"d":"0.030"},0.003,{"v":0.15,"d":"0.150"},{"v":0.02,"d":"0.020"},"0,013","0,2",{"v":0.02,"d":"0.020"},0.012,{"v":0.02,"d":"0.020"},{"v":0.00065,"d":"0.00"},{"v":0.01,"d":"0.010"},{"v":0.03,"d":"0.030"},0.003,{"v":0.0025,"d":"0.003"},{"v":0.01,"d":"0.010"},{"v":0.01,"d":"0.010"},{"v":0.01,"d":"0.010"},0.008,{"v":0.01,"d":"0.010"},null,{"v":0.1,"d":"0.100"},0.014,{"v":0.08,"d":"0.080"},null,"0,2",{"v":10,"d":"10.000"},null,{"v":0.22,"d":"0.220"},{"v":15,"d":"15.000"},{"v":15,"d":"15.000"},"0,009",{"v":0.01,"d":"0.010"},{"v":1.04,"d":"1.040"},{"v":0.5,"d":"0.500"}]
["Índice para Toxicidade do produto (>2,5)",null,{"v":1.7494703688911244,"d":"1.75"},{"v":2.799990182467421,"d":"2.80"},{"v":4.522878745280337,"d":"4.52"},{"v":4.522878745280337,"d":"4.52"},{"v":0.9407023173881188,"d":"0.94"},{"v":1.2407430300610562,"d":"1.24"},{"v":3.40135972093719,"d":"3.40"},{"v":3.40135972093719,"d":"3.40"},{"v":3.40135972093719,"d":"3.40"},{"v":1.8010299956639813,"d":"1.80"},{"v":3.4436974992327123,"d":"3.44"},null,null,{"v":3.9119543704721593,"d":"3.91"},{"$f":"IF(Q7>0,(((4-LOG10(Q7))+(-LOG(Q8)))/2),\"\")","v":{"v":4.107335082494616,"d":"4.11"}},{"v":3.8723637474483468,"d":"3.87"},{"v":1.7440583195105628,"d":"1.74"},{"$f":"IF(T7>0,(((4-LOG10(T7))+(-LOG(T8)))/2),\"\")","v":{"v":1.3106194123418133,"d":"1.31"}},{"v":3.0122840957453683,"d":"3.01"},{"v":2.659379381312206,"d":"2.66"},null,{"v":2.513436073200151,"d":"2.51"},{"$f":"IF(Y7>0,(((4-LOG10(Y7))+(-LOG(Y8)))/2),\"\")","v":{"v":1.6505149978319906,"d":"1.65"}},{"v":2.8723637474483468,"d":"2.87"},{"v":2.8723637474483468,"d":"2.87"},{"$f":"IF(AB7>0,(((4-LOG10(AB7))+(-LOG(AB8)))/2),\"\")","v":{"v":3.878480975656853,"d":"3.88"}},{"v":4.284318117920506,"d":"4.28"},{"$f":"IF(AD7>0,(((4-LOG10(AD7))+(-LOG(AD8)))/2),\"\")","v":{"v":0.9568200846626258,"d":"0.96"}},{"v":4.5,"d":"4.50"},null,{"v":1.3610808334989761,"d":"1.36"},{"v":2.210108201691595,"d":"2.21"},{"v":3.0824719491399417,"d":"3.08"},{"v":3.926935982160881,"d":"3.93"},{"$f":"IF(AK7>0,(((4-LOG10(AK7))+(-LOG(AK8)))/2),\"\")","v":{"v":2.093543321678572,"d":"2.09"}},{"v":2.56246936830415,"d":"2.56"},{"v":2.56246936830415,"d":"2.56"},null,{"v":1.7494703688911244,"d":"1.75"},{"$f":"IF(AP7>0,(((4-LOG10(AP7))+(-LOG(AP8)))/2),\"\")","v":{"v":1.292513326014591,"d":"1.29"}},{"v":2.513436073200151,"d":"2.51"},{"$f":"IF(AR7>0,(((4-LOG10(AR7))+(-LOG(AR8)))/2),\"\")","v":{"v":3.3268235127746806,"d":"3.33"}},{"v":4.522878745280337,"d":"4.52"},{"v":0.47969882994296337,"d":"0.48"},{"v":3.383501944803923,"d":"3.38"},{"$f":"IF(AV7>0,(((4-LOG10(AV7))+(-LOG(AV8)))/2),\"\")","v":{"v":3.0417730257250373,"d":"3.04"}},{"v":4.093543321678572,"d":"4.09"},{"$f":"IF(AX7>0,(((4-LOG10(AX7))+(-LOG(AX8)))/2),\"\")","v":{"v":3.240743030061056,"d":"3.24"}},{"v":3.629818655252878,"d":"3.63"},null,{"v":2.210108201691595,"d":"2.21"},{"v":1.5484550065040281,"d":"1.55"},{"v":2.1736351519653763,"d":"2.17"},{"$f":"IF(BD7>0,(((4-LOG10(BD7))+(-LOG(BD8)))/2),\"\")","v":{"v":1.8428030213890185,"d":"1.84"}},{"$f":"IF(BE7>0,(((4-LOG10(BE7))+(-LOG(BE8)))/2),\"\")","v":{"v":2.7044676964867502,"d":"2.70"}},{"$f":"IF(BF7>0,(((4-LOG10(BF7))+(-LOG(BF8)))/2),\"\")","v":{"v":1.4707869877714972,"d":"1.47"}},{"v":2.210108201691595,"d":"2.21"},{"$f":"IF(BH7>0,(((4-LOG10(BH7))+(-LOG(BH8)))/2),\"\")","v":{"v":1.2416133608492068,"d":"1.24"}},{"$f":"IF(BI7>0,(((4-LOG10(BI7))+(-LOG(BI8)))/2),\"\")","v":{"v":1.2416133608492068,"d":"1.24"}},null,{"$f":"IF(BK7>0,(((4-LOG10(BK7))+(-LOG(BK8)))/2),\"\")","v":{"v":3.210108201691595,"d":"3.21"}},{"v":2.799990182467421,"d":"2.80"},{"v":2.5228787452803374,"d":"2.52"},{"v":2.5228787452803374,"d":"2.52"},null,{"v":2.5228787452803374,"d":"2.52"},{"v":1.8315700895415952,"d":"1.83"},{"v":2.4914833303506096,"d":"2.49"},{"v":3.2967299097830223,"d":"3.30"},{"$f":"IF(BT7>0,(((4-LOG10(BT7))+(-LOG(BT8)))/2),\"\")","v":{"v":2.56246936830415,"d":"2.56"}},{"v":2.659379381312206,"d":"2.66"},{"v":1.8010299956639813,"d":"1.80"},{"v":1.6076913536835624,"d":"1.61"},{"v":3.40135972093719,"d":"3.40"},{"$f":"IF(BY7>0,(((4-LOG10(BY7))+(-LOG(BY8)))/2),\"\")","v":{"v":3.5352905371428536,"d":"3.54"}},{"v":4.522878745280337,"d":"4.52"},null,null,{"$f":"IF(CC7>0,(((4-LOG10(CC7))+(-LOG(CC8)))/2),\"\")","v":{"v":1.4062396395817685,"d":"1.41"}},{"v":2.513436073200151,"d":"2.51"},{"v":2.513436073200151,"d":"2.51"},{"v":1.448783147159332,"d":"1.45"},{"v":1.5,"d":"1.50"},{"$f":"IF(CH7>0,(((4-LOG10(CH7))+(-LOG(CH8)))/2),\"\")","v":{"v":3.2614393726401687,"d":"3.26"}},{"v":1.9863251961126216,"d":"1.99"},{"v":3.40135972093719,"d":"3.40"},{"v":3.495699914119041,"d":"3.50"},{"$f":"IF(CL7>0,(((4-LOG10(CL7))+(-LOG(CL8)))/2),\"\")","v":{"v":2.865010161677338,"d":"2.87"}},{"$f":"IF(CM7>0,(((4-LOG10(CM7))+(-LOG(CM8)))/2),\"\")","v":{"v":2.4119543704721593,"d":"2.41"}},{"v":3.210108201691595,"d":"3.21"},{"v":2.4498147274412183,"d":"2.45"},{"v":3.710108201691595,"d":"3.71"},{"v":3.710108201691595,"d":"3.71"},{"v":1.5,"d":"1.50"},{"$f":"IF(CS7>0,(((4-LOG10(CS7))+(-LOG(CS8)))/2),\"\")","v":{"v":2,"d":"2.00"}},{"$f":"IF(CT7>0,(((4-LOG10(CT7))+(-LOG(CT8)))/2),\"\")","v":""},{"$f":"IF(CU7>0,(((4-LOG10(CU7))+(-LOG(CU8)))/2),\"\")","v":{"v":3.878480975656853,"d":"3.88"}},{"v":5.34518491628705,"d":"5.35"},null,{"$f":"IF(CX7>0,(((4-LOG10(CX7))+(-LOG(CX8)))/2),\"\")","v":{"v":4.70446769648675,"d":"4.70"}},{"$f":"IF(CY7>0,(((4-LOG10(CY7))+(-LOG(CY8)))/2),\"\")","v":{"v":4.70446769648675,"d":"4.70"}},null,null,{"$f":"IF(DB7>0,(((4-LOG10(DB7))+(-LOG(DB8)))/2),\"\")","v":{"v":2.011138197355576,"d":"2.01"}},{"$f":"IF(DC7>0,(((4-LOG10(DC7))+(-LOG(DC8)))/2),\"\")","v":{"v":4.70446769648675,"d":"4.70"}},null,{"v":2.784318117920506,"d":"2.78"},null,{"v":2.396856977793784,"d":"2.40"},{"v":4.080575454631372,"d":"4.08"},{"v":3.013898580810468,"d":"3.01"},{"v":2.483288122256525,"d":"2.48"},{"v":2.483288122256525,"d":"2.48"},{"v":3.40135972093719,"d":"3.40"},null,null,{"$f":"IF(DO7>0,(((4-LOG10(DO7))+(-LOG(DO8)))/2),\"\")","v":{"v":2.884775539310863,"d":"2.88"}},{"v":5.34518491628705,"d":"5.35"},{"$f":"IF(DQ7>0,(((4-LOG10(DQ7))+(-LOG(DQ8)))/2),\"\")","v":{"v":3.878480975656853,"d":"3.88"}},{"$f":"IF(DR7>0,(((4-LOG10(DR7))+(-LOG(DR8)))/2),\"\")","v":{"v":3.240743030061056,"d":"3.24"}},{"v":1.6076913536835624,"d":"1.61"},{"$f":"IF(DT7>0,(((4-LOG10(DT7))+(-LOG(DT8)))/2),\"\")","v":{"v":4.1419983281826,"d":"4.14"}},{"v":1.9604093769761877,"d":"1.96"},{"$f":"IF(DV7>0,(((4-LOG10(DV7))+(-LOG(DV8)))/2),\"\")","v":{"v":1.8516674048692345,"d":"1.85"}},{"$f":"IF(DW7>0,(((4-LOG10(DW7))+(-LOG(DW8)))/2),\"\")","v":{"v":2.0226376045104684,"d":"2.02"}},{"$f":"IF(DX7>0,(((4-LOG10(DX7))+(-LOG(DX8)))/2),\"\")","v":{"v":1.7891980365650846,"d":"1.79"}},{"v":2.483288122256525,"d":"2.48"},{"v":2.865243527891042,"d":"2.87"},{"v":2.865243527891042,"d":"2.87"},{"v":2.926935982160881,"d":"2.93"},{"$f":"IF(EC7>0,(((4-LOG10(EC7))+(-LOG(EC8)))/2),\"\")","v":{"v":4.70446769648675,"d":"4.70"}},{"v":2.854982694318741,"d":"2.85"},{"v":3.210108201691595,"d":"3.21"},{"v":3.210108201691595,"d":"3.21"},{"$f":"IF(EG7>0,(((4-LOG10(EG7))+(-LOG(EG8)))/2),\"\")","v":{"v":1.8010299956639813,"d":"1.80"}},{"v":3.210108201691595,"d":"3.21"},{"$f":"IF(EI7>0,(((4-LOG10(EI7))+(-LOG(EI8)))/2),\"\")","v":{"v":4.06246936830415,"d":"4.06"}},{"$f":"IF(EJ7>0,(((4-LOG10(EJ7))+(-LOG(EJ8)))/2),\"\")","v":{"v":2.8675910884952316,"d":"2.87"}},{"v":2.1462149119510316,"d":"2.15"},{"v":2.659379381312206,"d":"2.66"},null,null,{"v":4.154901959985743,"d":"4.15"},null,{"v":4.4430283238465815,"d":"4.44"},{"v":3.40135972093719,"d":"3.40"},{"v":2.240743030061056,"d":"2.24"},{"v":2.8268235127746806,"d":"2.83"},{"v":1.6989700043360187,"d":"1.70"},{"v":2.0277586639249154,"d":"2.03"},{"v":0.7967299097830223,"d":"0.80"},{"v":3.765826334793921,"d":"3.77"},{"v":1.8315700895415952,"d":"1.83"},null,{"$f":"IF(FA7>0,(((4-LOG10(FA7))+(-LOG(FA8)))/2),\"\")","v":{"v":1.7614393726401687,"d":"1.76"}},{"v":2.4498147274412183,"d":"2.45"},{"$f":"IF(FC7>0,(((4-LOG10(FC7))+(-LOG(FC8)))/2),\"\")","v":{"v":2.5106815258077626,"d":"2.51"}},null,null,{"$f":"IF(FF7>0,(((4-LOG10(FF7))+(-LOG(FF8)))/2),\"\")","v":{"v":2.1705175786677824,"d":"2.17"}},{"v":1.448783147159332,"d":"1.45"},{"v":3.629818655252878,"d":"3.63"},{"$f":"IF(FI7>0,(((4-LOG10(FI7))+(-LOG(FI8)))/2),\"\")","v":{"v":2.2118293248971037,"d":"2.21"}},{"v":3.926935982160881,"d":"3.93"},{"v":3.926935982160881,"d":"3.93"},{"v":2.210108201691595,"d":"2.21"},{"$f":"IF(FM7>0,(((4-LOG10(FM7))+(-LOG(FM8)))/2),\"\")","v":{"v":2.5704308513527345,"d":"2.57"}},{"v":1.610924374808178,"d":"1.61"},{"v":2.3873453591370684,"d":"2.39"},{"v":1.6989700043360187,"d":"1.70"},{"$f":"IF(FQ7>0,(((4-LOG10(FQ7))+(-LOG(FQ8)))/2),\"\")","v":{"v":3.600329725273209,"d":"3.60"}},{"$f":"IF(FR7>0,(((4-LOG10(FR7))+(-LOG(FR8)))/2),\"\")","v":{"v":1.8588929334688322,"d":"1.86"}},null,{"v":1.3610808334989761,"d":"1.36"},{"$f":"IF(FU7>0,(((4-LOG10(FU7))+(-LOG(FU8)))/2),\"\")","v":{"v":3.989405350465031,"d":"3.99"}},null,{"$f":"IF(FW7>0,(((4-LOG10(FW7))+(-LOG(FW8)))/2),\"\")","v":{"v":1.2709834037517471,"d":"1.27"}},{"v":2.3873453591370684,"d":"2.39"},{"v":2.3873453591370684,"d":"2.39"},{"v":2.3873453591370684,"d":"2.39"},{"v":0.7967299097830223,"d":"0.80"},{"v":4.4430283238465815,"d":"4.44"},{"$f":"IF(GC7>0,(((4-LOG10(GC7))+(-LOG(GC8)))/2),\"\")","v":{"v":1.4976802733851249,"d":"1.50"}},{"v":1.6298186552528782,"d":"1.63"},{"v":1.6076913536835624,"d":"1.61"},{"v":3.8723637474483468,"d":"3.87"},{"v":3.926935982160881,"d":"3.93"},{"v":3.629818655252878,"d":"3.63"},{"$f":"IF(GI7>0,(((4-LOG10(GI7))+(-LOG(GI8)))/2),\"\")","v":{"v":2.884775539310863,"d":"2.88"}},{"v":1.448783147159332,"d":"1.45"},{"v":3,"d":"3.00"},{"v":3.2158991379665025,"d":"3.22"},{"v":2.784318117920506,"d":"2.78"},{"$f":"IF(GN7>0,(((4-LOG10(GN7))+(-LOG(GN8)))/2),\"\")","v":{"v":4.809894379144197,"d":"4.81"}},{"v":2.5228787452803374,"d":"2.52"},{"v":2.439713034397075,"d":"2.44"},{"v":1.448783147159332,"d":"1.45"},{"v":1.7440583195105628,"d":"1.74"},{"v":3,"d":"3.00"},{"$f":"IF(GT7>0,(((4-LOG10(GT7))+(-LOG(GT8)))/2),\"\")","v":{"v":1.5912173152201095,"d":"1.59"}},{"v":0.7967299097830223,"d":"0.80"},{"v":3.2158991379665025,"d":"3.22"},{"v":3.2158991379665025,"d":"3.22"},{"v":2.1736351519653763,"d":"2.17"},{"$f":"IF(GY7>0,(((4-LOG10(GY7))+(-LOG(GY8)))/2),\"\")","v":{"v":3.309894379144197,"d":"3.31"}},{"$f":"IF(GZ7>0,(((4-LOG10(GZ7))+(-LOG(GZ8)))/2),\"\")","v":{"v":2.485105264584072,"d":"2.49"}},{"v":3.926935982160881,"d":"3.93"},{"v":0.7967299097830223,"d":"0.80"},{"v":0.7967299097830223,"d":"0.80"},{"v":0.7967299097830223,"d":"0.80"},{"v":4.080575454631372,"d":"4.08"},{"$f":"IF(HF7>0,(((4-LOG10(HF7))+(-LOG(HF8)))/2),\"\")","v":{"v":3.2614393726401687,"d":"3.26"}},{"v":4.792513326014591,"d":"4.79"},{"$f":"IF(HH7>0,(((4-LOG10(HH7))+(-LOG(HH8)))/2),\"\")","v":{"v":3.5774509799928715,"d":"3.58"}},{"v":4.792513326014591,"d":"4.79"},{"v":1.3610808334989761,"d":"1.36"},{"v":3.210108201691595,"d":"3.21"},{"v":3.210108201691595,"d":"3.21"},{"v":2.396856977793784,"d":"2.40"},null,{"v":2.396856977793784,"d":"2.40"},{"$f":"IF(HP7>0,(((4-LOG10(HP7))+(-LOG(HP8)))/2),\"\")","v":{"v":1.2639510358153232,"d":"1.26"}},{"v":2.5595932038596043,"d":"2.56"},{"v":1.6298186552528782,"d":"1.63"},{"v":2.9793036574208873,"d":"2.98"},{"v":2.9793036574208873,"d":"2.98"},{"v":2.9430283238465815,"d":"2.94"},{"v":2.9430283238465815,"d":"2.94"},{"v":2.9430283238465815,"d":"2.94"},{"v":2.9430283238465815,"d":"2.94"},null,{"$f":"IF(HZ7>0,(((4-LOG10(HZ7))+(-LOG(HZ8)))/2),\"\")","v":{"v":2.257850080326607,"d":"2.26"}},null,{"v":2.9430283238465815,"d":"2.94"},null,null,{"v":2.664413578642458,"d":"2.66"},{"v":2.396856977793784,"d":"2.40"},{"v":2.396856977793784,"d":"2.40"},{"$f":"IF(IH7>0,(((4-LOG10(IH7))+(-LOG(IH8)))/2),\"\")","v":{"v":2.6883753548010496,"d":"2.69"}},{"v":2.664413578642458,"d":"2.66"},{"v":3.2158991379665025,"d":"3.22"},{"$f":"IF(IK7>0,(((4-LOG10(IK7))+(-LOG(IK8)))/2),\"\")","v":{"v":3.5774509799928715,"d":"3.58"}},{"v":2.664413578642458,"d":"2.66"},{"v":2.664413578642458,"d":"2.66"},{"v":1.7494703688911244,"d":"1.75"},{"v":1.5,"d":"1.50"},{"$f":"IF(IP7>0,(((4-LOG10(IP7))+(-LOG(IP8)))/2),\"\")","v":{"v":2.6220625721637543,"d":"2.62"}},{"$f":"IF(IQ7>0,(((4-LOG10(IQ7))+(-LOG(IQ8)))/2),\"\")","v":{"v":2.6220625721637543,"d":"2.62"}},{"v":3.9119543704721593,"d":"3.91"},{"v":2.455047444280301,"d":"2.46"},{"v":2.439713034397075,"d":"2.44"},{"v":2.513436073200151,"d":"2.51"},{"v":4.045757490560675,"d":"4.05"},{"v":3.2967299097830223,"d":"3.30"},{"v":2.882235776546225,"d":"2.88"},{"v":3.2158991379665025,"d":"3.22"},{"v":1.7440583195105628,"d":"1.74"},{"$f":"IF(JA7>0,(((4-LOG10(JA7))+(-LOG(JA8)))/2),\"\")","v":{"v":3.6399203482970215,"d":"3.64"}},{"$f":"IF(JB7>0,(((4-LOG10(JB7))+(-LOG(JB8)))/2),\"\")","v":{"v":1.2673085742757908,"d":"1.27"}},null,{"v":2.799990182467421,"d":"2.80"},{"$f":"IF(JE7>0,(((4-LOG10(JE7))+(-LOG(JE8)))/2),\"\")","v":{"v":2.2118293248971037,"d":"2.21"}},{"$f":"IF(JF7>0,(((4-LOG10(JF7))+(-LOG(JF8)))/2),\"\")","v":{"v":4.090228032229065,"d":"4.09"}},{"v":1.3010299956639813,"d":"1.30"},{"v":2.439713034397075,"d":"2.44"},{"$f":"IF(JI7>0,(((4-LOG10(JI7))+(-LOG(JI8)))/2),\"\")","v":{"v":1.8729435802119663,"d":"1.87"}},{"v":4.878480975656853,"d":"4.88"},{"$f":"IF(JK7>0,(((4-LOG10(JK7))+(-LOG(JK8)))/2),\"\")","v":{"v":2.586153855662777,"d":"2.59"}},null,{"$f":"IF(JM7>0,(((4-LOG10(JM7))+(-LOG(JM8)))/2),\"\")","v":{"v":3.6399203482970215,"d":"3.64"}},{"$f":"IF(JN7>0,(((4-LOG10(JN7))+(-LOG(JN8)))/2),\"\")","v":{"v":3.659379381312206,"d":"3.66"}},{"v":4.5,"d":"4.50"},{"v":4.045757490560675,"d":"4.05"},null,{"$f":"IF(JR7>0,(((4-LOG10(JR7))+(-LOG(JR8)))/2),\"\")","v":{"v":1.7474250108400469,"d":"1.75"}},{"$f":"IF(JS7>0,(((4-LOG10(JS7))+(-LOG(JS8)))/2),\"\")","v":{"v":2.7218487496163566,"d":"2.72"}},{"v":3.40135972093719,"d":"3.40"},{"$f":"IF(JU7>0,(((4-LOG10(JU7))+(-LOG(JU8)))/2),\"\")","v":{"v":2.586153855662777,"d":"2.59"}},{"$f":"IF(JV7>0,(((4-LOG10(JV7))+(-LOG(JV8)))/2),\"\")","v":{"v":1.6968093174446974,"d":"1.70"}},{"v":2.5228787452803374,"d":"2.52"},{"v":2.5228787452803374,"d":"2.52"},null,{"$f":"IF(JZ7>0,(((4-LOG10(JZ7))+(-LOG(JZ8)))/2),\"\")","v":{"v":4.090228032229065,"d":"4.09"}},{"v":1.4132611782735025,"d":"1.41"},{"v":4.284318117920506,"d":"4.28"},{"v":2.8268235127746806,"d":"2.83"},{"$f":"IF(KD7>0,(((4-LOG10(KD7))+(-LOG(KD8)))/2),\"\")","v":{"v":3.093543321678572,"d":"3.09"}},{"v":3.3606231995235856,"d":"3.36"},{"$f":"IF(KF7>0,(((4-LOG10(KF7))+(-LOG(KF8)))/2),\"\")","v":{"v":2.085026652029182,"d":"2.09"}},{"$f":"IF(KG7>0,(((4-LOG10(KG7))+(-LOG(KG8)))/2),\"\")","v":{"v":4.489405350465031,"d":"4.49"}},{"v":4.080575454631372,"d":"4.08"},{"$f":"IF(KI7>0,(((4-LOG10(KI7))+(-LOG(KI8)))/2),\"\")","v":{"v":3.080575454631372,"d":"3.08"}},{"v":1.809894379144197,"d":"1.81"},null,{"v":1.4132611782735025,"d":"1.41"},{"v":4.152259161754902,"d":"4.15"},{"v":2.9793036574208873,"d":"2.98"},{"v":2.2718169834354787,"d":"2.27"},{"v":2.1462149119510316,"d":"2.15"},{"v":3.3287886595888967,"d":"3.33"},{"$f":"IF(KR7>0,(((4-LOG10(KR7))+(-LOG(KR8)))/2),\"\")","v":{"v":1.8010299956639813,"d":"1.80"}},{"$f":"IF(KS7>0,(((4-LOG10(KS7))+(-LOG(KS8)))/2),\"\")","v":{"v":1.1505149978319906,"d":"1.15"}},{"v":2.92539044367231,"d":"2.93"},{"v":3.629818655252878,"d":"3.63"},{"v":3.495699914119041,"d":"3.50"},{"$f":"IF(KW7>0,(((4-LOG10(KW7))+(-LOG(KW8)))/2),\"\")","v":{"v":2.535035219957706,"d":"2.54"}},{"v":4.154901959985743,"d":"4.15"},{"v":2.7614393726401687,"d":"2.76"},{"v":3.9793036574208873,"d":"3.98"},{"v":2.842014827271541,"d":"2.84"},{"v":2.842014827271541,"d":"2.84"},{"$f":"IF(LC7>0,(((4-LOG10(LC7))+(-LOG(LC8)))/2),\"\")","v":{"v":2.7703037561203843,"d":"2.77"}},{"$f":"IF(LD7>0,(((4-LOG10(LD7))+(-LOG(LD8)))/2),\"\")","v":{"v":2.96479633912994,"d":"2.96"}},{"v":0.17281545451235725,"d":"0.17"},{"$f":"IF(LF7>0,(((4-LOG10(LF7))+(-LOG(LF8)))/2),\"\")","v":{"v":3.210108201691595,"d":"3.21"}},{"$f":"IF(LG7>0,(((4-LOG10(LG7))+(-LOG(LG8)))/2),\"\")","v":{"v":1.4707869877714972,"d":"1.47"}},{"$f":"IF(LH7>0,(((4-LOG10(LH7))+(-LOG(LH8)))/2),\"\")","v":{"v":2.1566818653688533,"d":"2.16"}},{"v":2.240743030061056,"d":"2.24"},{"v":1.4808886808156407,"d":"1.48"},{"v":2.439713034397075,"d":"2.44"},{"v":1.5484550065040281,"d":"1.55"},{"v":2.8163220394869906,"d":"2.82"},{"v":2.8163220394869906,"d":"2.82"},{"v":2.1462149119510316,"d":"2.15"},{"v":1.3010299956639813,"d":"1.30"},{"v":2.7342605414788723,"d":"2.73"},{"v":1.6076913536835624,"d":"1.61"},{"v":2.4498147274412183,"d":"2.45"},{"$f":"IF(LT7>0,(((4-LOG10(LT7))+(-LOG(LT8)))/2),\"\")","v":{"v":2.257850080326607,"d":"2.26"}},{"$f":"IF(LU7>0,(((4-LOG10(LU7))+(-LOG(LU8)))/2),\"\")","v":{"v":0.9568200846626258,"d":"0.96"}},{"$f":"IF(LV7>0,(((4-LOG10(LV7))+(-LOG(LV8)))/2),\"\")","v":{"v":3.867237332390463,"d":"3.87"}},{"$f":"IF(LW7>0,(((4-LOG10(LW7))+(-LOG(LW8)))/2),\"\")","v":{"v":3.809894379144197,"d":"3.81"}},{"$f":"IF(LX7>0,(((4-LOG10(LX7))+(-LOG(LX8)))/2),\"\")","v":{"v":2.1705175786677824,"d":"2.17"}},{"v":2.5192894529667758,"d":"2.52"},{"v":3.629818655252878,"d":"3.63"},{"v":3.210108201691595,"d":"3.21"},{"v":0.7967299097830223,"d":"0.80"},{"v":3.926935982160881,"d":"3.93"},{"v":2.439713034397075,"d":"2.44"},{"v":2.1462149119510316,"d":"2.15"},{"v":2.92539044367231,"d":"2.93"},{"v":3.710108201691595,"d":"3.71"},{"$f":"IF(MH7>0,(((4-LOG10(MH7))+(-LOG(MH8)))/2),\"\")","v":{"v":2.4119543704721593,"d":"2.41"}},{"v":1.448783147159332,"d":"1.45"},{"v":3,"d":"3.00"},{"$f":"IF(MK7>0,(((4-LOG10(MK7))+(-LOG(MK8)))/2),\"\")","v":{"v":5.18837535480105,"d":"5.19"}},{"v":1.809894379144197,"d":"1.81"},{"v":2.1736351519653763,"d":"2.17"},{"$f":"IF(MN7>0,(((4-LOG10(MN7))+(-LOG(MN8)))/2),\"\")","v":{"v":1.1505149978319906,"d":"1.15"}},{"v":2.455047444280301,"d":"2.46"},{"$f":"IF(MP7>0,(((4-LOG10(MP7))+(-LOG(MP8)))/2),\"\")","v":{"v":3.867237332390463,"d":"3.87"}},null,{"v":2.56246936830415,"d":"2.56"},{"v":2.5228787452803374,"d":"2.52"},{"$f":"IF(MT7>0,(((4-LOG10(MT7))+(-LOG(MT8)))/2),\"\")","v":{"v":1.7474250108400469,"d":"1.75"}},{"v":0.7967299097830223,"d":"0.80"},{"v":1.4715475743317636,"d":"1.47"},{"v":1.4132611782735025,"d":"1.41"},{"v":1.4715475743317636,"d":"1.47"},{"v":2.06246936830415,"d":"2.06"},{"v":2.5595932038596043,"d":"2.56"},{"v":2.5595932038596043,"d":"2.56"},{"v":3.3957793217807164,"d":"3.40"},{"v":1.6076913536835624,"d":"1.61"},{"$f":"IF(ND7>0,(((4-LOG10(ND7))+(-LOG(ND8)))/2),\"\")","v":{"v":1.4062396395817685,"d":"1.41"}},{"$f":"IF(NE7>0,(((4-LOG10(NE7))+(-LOG(NE8)))/2),\"\")","v":{"v":2.5563601827349887,"d":"2.56"}},{"$f":"IF(NF7>0,(((4-LOG10(NF7))+(-LOG(NF8)))/2),\"\")","v":{"v":1.5643887216201464,"d":"1.56"}},{"$f":"IF(NG7>0,(((4-LOG10(NG7))+(-LOG(NG8)))/2),\"\")","v":{"v":4.121301985603488,"d":"4.12"}},{"$f":"IF(NH7>0,(((4-LOG10(NH7))+(-LOG(NH8)))/2),\"\")","v":{"v":2.5106815258077626,"d":"2.51"}},{"$nulls":3},{"v":2.5595932038596043,"d":"2.56"},{"v":2.8054169578177337,"d":"2.81"},{"v":2.56246936830415,"d":"2.56"},{"v":2.664413578642458,"d":"2.66"},{"v":3.926935982160881,"d":"3.93"},{"v":1.3979400086720377,"d":"1.40"},{"v":1.3979400086720377,"d":"1.40"},{"v":1.3979400086720377,"d":"1.40"},{"v":1.3979400086720377,"d":"1.40"},{"$f":"IF(NU7>0,(((4-LOG10(NU7))+(-LOG(NU8)))/2),\"\")","v":{"v":2.5088643834802156,"d":"2.51"}},{"v":3.2967299097830223,"d":"3.30"},{"v":4.301029995663981,"d":"4.30"},{"v":2.439713034397075,"d":"2.44"},{"v":1.7614393726401687,"d":"1.76"},{"v":0.7967299097830223,"d":"0.80"},{"v":2.7158991379665025,"d":"2.72"},{"v":2.7158991379665025,"d":"2.72"},{"v":0.47969882994296337,"d":"0.48"},{"v":1.1505149978319906,"d":"1.15"},{"v":3,"d":"3.00"},{"v":1.3010299956639813,"d":"1.30"},null,{"v":3.12225313579244,"d":"3.12"},{"v":1.448783147159332,"d":"1.45"},{"v":1.448783147159332,"d":"1.45"},{"$f":"IF(OK7>0,(((4-LOG10(OK7))+(-LOG(OK8)))/2),\"\")","v":{"v":3.809894379144197,"d":"3.81"}},{"v":2.240743030061056,"d":"2.24"},{"v":2.9430283238465815,"d":"2.94"},null,{"v":4.093543321678572,"d":"4.09"},{"v":4.5,"d":"4.50"},{"$f":"IF(OQ7>0,(((4-LOG10(OQ7))+(-LOG(OQ8)))/2),\"\")","v":{"v":3.5352905371428536,"d":"3.54"}},{"$f":"IF(OR7>0,(((4-LOG10(OR7))+(-LOG(OR8)))/2),\"\")","v":{"v":1.2709834037517471,"d":"1.27"}},{"$f":"IF(OS7>0,(((4-LOG10(OS7))+(-LOG(OS8)))/2),\"\")","v":{"v":4.70446769648675,"d":"4.70"}},{"v":4.152259161754902,"d":"4.15"},{"v":2.1883753548010496,"d":"2.19"},null,{"v":1.7614393726401687,"d":"1.76"},{"$f":"IF(OX7>0,(((4-LOG10(OX7))+(-LOG(OX8)))/2),\"\")","v":{"v":2.8239087409443187,"d":"2.82"}},{"v":1.8315700895415952,"d":"1.83"},{"v":0.7967299097830223,"d":"0.80"},{"$f":"IF(PA7>0,(((4-LOG10(PA7))+(-LOG(PA8)))/2),\"\")","v":{"v":2.671472073571448,"d":"2.67"}},{"v":2.7342605414788723,"d":"2.73"},{"v":2.4914833303506096,"d":"2.49"},{"v":4.792513326014591,"d":"4.79"},{"v":4.792513326014591,"d":"4.79"},{"v":3.4436974992327123,"d":"3.44"},null,{"v":4.989405350465031,"d":"4.99"},{"v":2.664413578642458,"d":"2.66"},null,{"v":2.2718169834354787,"d":"2.27"},null,{"$f":"IF(PM7>0,(((4-LOG10(PM7))+(-LOG(PM8)))/2),\"\")","v":{"v":2.671472073571448,"d":"2.67"}},{"v":3.013898580810468,"d":"3.01"},{"v":1.1505149978319906,"d":"1.15"},{"v":4.4430283238465815,"d":"4.44"},null,null,{"v":0.9407023173881188,"d":"0.94"},{"v":2.8723637474483468,"d":"2.87"},{"v":3.9119543704721593,"d":"3.91"},{"v":4.989405350465031,"d":"4.99"},{"v":3.40135972093719,"d":"3.40"},{"v":3.710108201691595,"d":"3.71"},{"v":1.6076913536835624,"d":"1.61"},{"v":1.4132611782735025,"d":"1.41"},{"v":3.0122840957453683,"d":"3.01"},{"v":3.0122840957453683,"d":"3.01"},{"v":4.4430283238465815,"d":"4.44"},{"v":2.1736351519653763,"d":"2.17"},{"v":1.9604093769761877,"d":"1.96"},{"v":4.152259161754902,"d":"4.15"},{"v":2.6962724883926654,"d":"2.70"},{"v":1.3979400086720377,"d":"1.40"},{"v":3.6338031200885155,"d":"3.63"},{"v":3.12225313579244,"d":"3.12"},{"v":3.2158991379665025,"d":"3.22"},{"$f":"IF(QL7>0,(((4-LOG10(QL7))+(-LOG(QL8)))/2),\"\")","v":{"v":2.1807553715226815,"d":"2.18"}},{"v":3.2158991379665025,"d":"3.22"},{"v":4.152259161754902,"d":"4.15"},{"$f":"IF(QO7>0,(((4-LOG10(QO7))+(-LOG(QO8)))/2),\"\")","v":{"v":4.06246936830415,"d":"4.06"}},{"v":2.1736351519653763,"d":"2.17"},{"v":1.5484550065040281,"d":"1.55"},{"$f":"IF(QR7>0,(((4-LOG10(QR7))+(-LOG(QR8)))/2),\"\")","v":{"v":2.535035219957706,"d":"2.54"}},null,{"$f":"IF(QT7>0,(((4-LOG10(QT7))+(-LOG(QT8)))/2),\"\")","v":{"v":1.6505149978319906,"d":"1.65"}},{"$f":"IF(QU7>0,(((4-LOG10(QU7))+(-LOG(QU8)))/2),\"\")","v":{"v":2.865010161677338,"d":"2.87"}},{"v":4.080575454631372,"d":"4.08"},{"v":1.9604093769761877,"d":"1.96"},{"v":2.865243527891042,"d":"2.87"},{"v":4.301029995663981,"d":"4.30"},{"v":1.9604093769761877,"d":"1.96"},{"v":1.9604093769761877,"d":"1.96"},{"$f":"IF(RB7>0,(((4-LOG10(RB7))+(-LOG(RB8)))/2),\"\")","v":{"v":3.2703037561203847,"d":"3.27"}},{"v":3.0824719491399417,"d":"3.08"},{"v":1.5484550065040281,"d":"1.55"},{"$f":"IF(RE7>0,(((4-LOG10(RE7))+(-LOG(RE8)))/2),\"\")","v":{"v":3.878480975656853,"d":"3.88"}},{"$f":"IF(RF7>0,(((4-LOG10(RF7))+(-LOG(RF8)))/2),\"\")","v":{"v":2.8388903526330402,"d":"2.84"}},{"v":3.40135972093719,"d":"3.40"},{"$f":"IF(RH7>0,(((4-LOG10(RH7))+(-LOG(RH8)))/2),\"\")","v":{"v":4.5,"d":"4.50"}},{"$f":"IF(RI7>0,(((4-LOG10(RI7))+(-LOG(RI8)))/2),\"\")","v":{"v":2.9982697339452464,"d":"3.00"}},{"v":2.455047444280301,"d":"2.46"},{"v":2.455047444280301,"d":"2.46"},{"v":3.40135972093719,"d":"3.40"},{"v":2.1883753548010496,"d":"2.19"},{"v":2.006658910110247,"d":"2.01"},{"v":4.5,"d":"4.50"},{"v":1.2407430300610562,"d":"1.24"},{"v":1.2407430300610562,"d":"1.24"},{"v":2.6505149978319906,"d":"2.65"},{"$f":"IF(RS7>0,(((4-LOG10(RS7))+(-LOG(RS8)))/2),\"\")","v":{"v":2.610924374808178,"d":"2.61"}},{"$f":"IF(RT7>0,(((4-LOG10(RT7))+(-LOG(RT8)))/2),\"\")","v":{"v":2.890469833775569,"d":"2.89"}},null,{"$f":"IF(RV7>0,(((4-LOG10(RV7))+(-LOG(RV8)))/2),\"\")","v":{"v":2.610924374808178,"d":"2.61"}},{"$f":"IF(RW7>0,(((4-LOG10(RW7))+(-LOG(RW8)))/2),\"\")","v":{"v":2.1566818653688533,"d":"2.16"}},null,{"v":3.9119543704721593,"d":"3.91"},{"v":0.9407023173881188,"d":"0.94"},{"v":2.439713034397075,"d":"2.44"},null,{"v":0.9276360132216748,"d":"0.93"},{"v":0.9407023173881188,"d":"0.94"},{"v":0.9245131568916161,"d":"0.92"},{"v":2.4914833303506096,"d":"2.49"},{"v":4.093543321678572,"d":"4.09"},{"v":3.6338031200885155,"d":"3.63"},{"v":3,"d":"3.00"},{"v":4.4430283238465815,"d":"4.44"},{"v":1.2407430300610562,"d":"1.24"},{"v":1.448783147159332,"d":"1.45"},{"v":2.5595932038596043,"d":"2.56"},{"$f":"IF(SN7>0,(((4-LOG10(SN7))+(-LOG(SN8)))/2),\"\")","v":{"v":3.659379381312206,"d":"3.66"}},{"v":2.439713034397075,"d":"2.44"},{"$f":"IF(SP7>0,(((4-LOG10(SP7))+(-LOG(SP8)))/2),\"\")","v":{"v":2.485105264584072,"d":"2.49"}},{"$f":"IF(SQ7>0,(((4-LOG10(SQ7))+(-LOG(SQ8)))/2),\"\")","v":{"v":3.4447051448503756,"d":"3.44"}},{"v":1.3010299956639813,"d":"1.30"},{"v":1.1505149978319906,"d":"1.15"},{"v":2.799990182467421,"d":"2.80"},{"$f":"IF(SU7>0,(((4-LOG10(SU7))+(-LOG(SU8)))/2),\"\")","v":{"v":2.8388903526330402,"d":"2.84"}},{"v":2.439713034397075,"d":"2.44"},{"v":1.4808886808156407,"d":"1.48"},{"v":3.40135972093719,"d":"3.40"},{"v":2.865243527891042,"d":"2.87"},null,{"$f":"IF(TA7>0,(((4-LOG10(TA7))+(-LOG(TA8)))/2),\"\")","v":{"v":4.489405350465031,"d":"4.49"}},{"$f":"IF(TB7>0,(((4-LOG10(TB7))+(-LOG(TB8)))/2),\"\")","v":{"v":3.182258126592544,"d":"3.18"}},{"$f":"IF(TC7>0,(((4-LOG10(TC7))+(-LOG(TC8)))/2),\"\")","v":{"v":2.072058784981982,"d":"2.07"}},{"$f":"IF(TD7>0,(((4-LOG10(TD7))+(-LOG(TD8)))/2),\"\")","v":{"v":1.5912173152201095,"d":"1.59"}},{"v":2.06246936830415,"d":"2.06"},{"v":2.1251318422154695,"d":"2.13"},{"$f":"IF(TG7>0,(((4-LOG10(TG7))+(-LOG(TG8)))/2),\"\")","v":{"v":3.262164405837785,"d":"3.26"}},{"v":2.3873453591370684,"d":"2.39"},{"v":2.5595932038596043,"d":"2.56"},{"v":1.4132611782735025,"d":"1.41"},{"$f":"IF(TK7>0,(((4-LOG10(TK7))+(-LOG(TK8)))/2),\"\")","v":{"v":2.610924374808178,"d":"2.61"}},{"v":2.8054169578177337,"d":"2.81"},{"v":3.2158991379665025,"d":"3.22"},{"$f":"IF(TN7>0,(((4-LOG10(TN7))+(-LOG(TN8)))/2),\"\")","v":{"v":1.6505149978319906,"d":"1.65"}},null,{"v":3.2158991379665025,"d":"3.22"},{"v":1.9863251961126216,"d":"1.99"},{"$f":"IF(TR7>0,(((4-LOG10(TR7))+(-LOG(TR8)))/2),\"\")","v":{"v":1.7891980365650846,"d":"1.79"}},null,{"$f":"IF(TT7>0,(((4-LOG10(TT7))+(-LOG(TT8)))/2),\"\")","v":{"v":2.890469833775569,"d":"2.89"}},{"v":2.92539044367231,"d":"2.93"},{"$f":"IF(TV7>0,(((4-LOG10(TV7))+(-LOG(TV8)))/2),\"\")","v":{"v":1.7614393726401687,"d":"1.76"}},{"v":3.8723637474483468,"d":"3.87"},{"$f":"IF(TX7>0,(((4-LOG10(TX7))+(-LOG(TX8)))/2),\"\")","v":{"v":3.989405350465031,"d":"3.99"}},{"v":4.878480975656853,"d":"4.88"},{"$f":"IF(TZ7>0,(((4-LOG10(TZ7))+(-LOG(TZ8)))/2),\"\")","v":{"v":4.5774509799928715,"d":"4.58"}},{"$f":"IF(UA7>0,(((4-LOG10(UA7))+(-LOG(UA8)))/2),\"\")","v":{"v":1.8729435802119663,"d":"1.87"}},{"v":3.3957793217807164,"d":"3.40"},{"v":2.784318117920506,"d":"2.78"},null,null,{"v":1.1505149978319906,"d":"1.15"},null,{"v":3.3606231995235856,"d":"3.36"},null,{"$f":"IF(UJ7>0,(((4-LOG10(UJ7))+(-LOG(UJ8)))/2),\"\")","v":{"v":2.9982697339452464,"d":"3.00"}},{"$f":"IF(UK7>0,(((4-LOG10(UK7))+(-LOG(UK8)))/2),\"\")","v":{"v":1.4976802733851249,"d":"1.50"}},{"v":3.013898580810468,"d":"3.01"},{"v":3,"d":"3.00"},{"v":1.6989700043360187,"d":"1.70"},{"v":3.710108201691595,"d":"3.71"},{"v":2.799990182467421,"d":"2.80"},{"v":1.9397130343970748,"d":"1.94"},{"v":1.3610808334989761,"d":"1.36"},{"$f":"IF(US7>0,(((4-LOG10(US7))+(-LOG(US8)))/2),\"\")","v":{"v":2.5228787452803374,"d":"2.52"}},{"v":2.7614393726401687,"d":"2.76"},{"v":2.5228787452803374,"d":"2.52"},{"v":2.5228787452803374,"d":"2.52"},{"v":2.5228787452803374,"d":"2.52"},{"v":2.5228787452803374,"d":"2.52"},{"v":2.210108201691595,"d":"2.21"},{"v":2.5228787452803374,"d":"2.52"},{"v":2.513436073200151,"d":"2.51"},{"v":2.513436073200151,"d":"2.51"},{"v":2.9793036574208873,"d":"2.98"},{"v":2.784318117920506,"d":"2.78"},{"v":2.847152385544071,"d":"2.85"},{"$f":"IF(VF7>0,(((4-LOG10(VF7))+(-LOG(VF8)))/2),\"\")","v":""},{"$f":"IF(VG7>0,(((4-LOG10(VG7))+(-LOG(VG8)))/2),\"\")","v":{"v":3.309894379144197,"d":"3.31"}},{"$f":"IF(VH7>0,(((4-LOG10(VH7))+(-LOG(VH8)))/2),\"\")","v":{"v":2.56246936830415,"d":"2.56"}},{"$f":"IF(VI7>0,(((4-LOG10(VI7))+(-LOG(VI8)))/2),\"\")","v":{"v":2.085026652029182,"d":"2.09"}},{"v":2.5192894529667758,"d":"2.52"},null,{"$f":"IF(VL7>0,(((4-LOG10(VL7))+(-LOG(VL8)))/2),\"\")","v":{"v":2.483288122256525,"d":"2.48"}},{"$f":"IF(VM7>0,(((4-LOG10(VM7))+(-LOG(VM8)))/2),\"\")","v":{"v":3.4447051448503756,"d":"3.44"}},{"v":2.4914833303506096,"d":"2.49"},{"v":2.4914833303506096,"d":"2.49"},{"$f":"IF(VP7>0,(((4-LOG10(VP7))+(-LOG(VP8)))/2),\"\")","v":{"v":3.0417730257250373,"d":"3.04"}},{"v":2.799990182467421,"d":"2.80"},{"v":2.5192894529667758,"d":"2.52"},{"v":2.7342605414788723,"d":"2.73"},{"v":4.5,"d":"4.50"},null,{"v":3.7819186764796218,"d":"3.78"},{"$f":"IF(VW7>0,(((4-LOG10(VW7))+(-LOG(VW8)))/2),\"\")","v":{"v":3.262164405837785,"d":"3.26"}},{"v":3.9793036574208873,"d":"3.98"},{"v":2.659379381312206,"d":"2.66"},{"$f":"IF(VZ7>0,(((4-LOG10(VZ7))+(-LOG(VZ8)))/2),\"\")","v":{"v":1.2639510358153232,"d":"1.26"}},{"$f":"IF(WA7>0,(((4-LOG10(WA7))+(-LOG(WA8)))/2),\"\")","v":{"v":2.8239087409443187,"d":"2.82"}},{"v":3.40135972093719,"d":"3.40"},{"v":2.455047444280301,"d":"2.46"},{"v":3.3606231995235856,"d":"3.36"},{"v":0.47969882994296337,"d":"0.48"},{"$f":"IF(WF7>0,(((4-LOG10(WF7))+(-LOG(WF8)))/2),\"\")","v":{"v":1.6505149978319906,"d":"1.65"}},{"$f":"IF(WG7>0,(((4-LOG10(WG7))+(-LOG(WG8)))/2),\"\")","v":{"v":1.8588929334688322,"d":"1.86"}},{"v":4.4430283238465815,"d":"4.44"},{"v":4.152259161754902,"d":"4.15"},{"v":2.396856977793784,"d":"2.40"},{"$f":"IF(WK7>0,(((4-LOG10(WK7))+(-LOG(WK8)))/2),\"\")","v":{"v":2.6883753548010496,"d":"2.69"}},{"v":4.152259161754902,"d":"4.15"},{"v":3.9793036574208873,"d":"3.98"},{"$f":"IF(WN7>0,(((4-LOG10(WN7))+(-LOG(WN8)))/2),\"\")","v":{"v":2.1807553715226815,"d":"2.18"}},{"v":3.383501944803923,"d":"3.38"},{"v":4.152259161754902,"d":"4.15"},{"v":3.2158991379665025,"d":"3.22"},{"v":1.448783147159332,"d":"1.45"},{"v":3,"d":"3.00"},{"$f":"IF(WT7>0,(((4-LOG10(WT7))+(-LOG(WT8)))/2),\"\")","v":{"v":2.011138197355576,"d":"2.01"}},{"v":1.2407430300610562,"d":"1.24"},{"$f":"IF(WV7>0,(((4-LOG10(WV7))+(-LOG(WV8)))/2),\"\")","v":{"v":3.182258126592544,"d":"3.18"}},{"v":2.847152385544071,"d":"2.85"},{"v":1.4715475743317636,"d":"1.47"},{"v":1.4715475743317636,"d":"1.47"},{"v":1.4715475743317636,"d":"1.47"},{"v":1.8315700895415952,"d":"1.83"},{"$f":"IF(XB7>0,(((4-LOG10(XB7))+(-LOG(XB8)))/2),\"\")","v":{"v":4.107335082494616,"d":"4.11"}},{"$f":"IF(XC7>0,(((4-LOG10(XC7))+(-LOG(XC8)))/2),\"\")","v":{"v":4.1419983281826,"d":"4.14"}},{"v":4.045757490560675,"d":"4.05"},null,{"$f":"IF(XF7>0,(((4-LOG10(XF7))+(-LOG(XF8)))/2),\"\")","v":{"v":4.5774509799928715,"d":"4.58"}},{"v":0.9407023173881188,"d":"0.94"},{"v":2.659379381312206,"d":"2.66"},{"v":2.9793036574208873,"d":"2.98"},{"v":2.7614393726401687,"d":"2.76"},{"v":1.6989700043360187,"d":"1.70"},{"v":3.3606231995235856,"d":"3.36"},{"v":3.383501944803923,"d":"3.38"},{"v":3.710108201691595,"d":"3.71"},{"$f":"IF(XO7>0,(((4-LOG10(XO7))+(-LOG(XO8)))/2),\"\")","v":{"v":1.5643887216201464,"d":"1.56"}},{"v":2.006658910110247,"d":"2.01"},{"v":2.455047444280301,"d":"2.46"},null,{"v":2.854982694318741,"d":"2.85"},{"v":2.847152385544071,"d":"2.85"},null,{"v":0.17281545451235725,"d":"0.17"},{"v":2.240743030061056,"d":"2.24"},null,{"v":2,"d":"2.00"},{"v":3.013898580810468,"d":"3.01"},{"v":1.448783147159332,"d":"1.45"},{"v":1.3010299956639813,"d":"1.30"},{"v":2.9793036574208873,"d":"2.98"},{"$f":"IF(YD7>0,(((4-LOG10(YD7))+(-LOG(YD8)))/2),\"\")","v":{"v":4.70446769648675,"d":"4.70"}},{"v":2.210108201691595,"d":"2.21"},{"v":1.6298186552528782,"d":"1.63"},{"v":1.6076913536835624,"d":"1.61"},{"v":2.483288122256525,"d":"2.48"},{"v":2.659379381312206,"d":"2.66"},{"v":1.809894379144197,"d":"1.81"},{"$f":"IF(YK7>0,(((4-LOG10(YK7))+(-LOG(YK8)))/2),\"\")","v":{"v":2.483288122256525,"d":"2.48"}},{"v":4.152259161754902,"d":"4.15"},{"v":4.152259161754902,"d":"4.15"},null,{"$f":"IF(YO7>0,(((4-LOG10(YO7))+(-LOG(YO8)))/2),\"\")","v":{"v":4.70446769648675,"d":"4.70"}},{"v":4.152259161754902,"d":"4.15"},{"v":0.9163856529120035,"d":"0.92"},{"v":2.4914833303506096,"d":"2.49"},null,{"$f":"IF(YT7>0,(((4-LOG10(YT7))+(-LOG(YT8)))/2),\"\")","v":{"v":1.8516674048692345,"d":"1.85"}},{"v":3.013898580810468,"d":"3.01"},null,null,{"$f":"IF(YX7>0,(((4-LOG10(YX7))+(-LOG(YX8)))/2),\"\")","v":{"v":1.6968093174446974,"d":"1.70"}},{"v":4.878480975656853,"d":"4.88"},{"v":3.093543321678572,"d":"3.09"},{"v":3.093543321678572,"d":"3.09"},{"v":2.847152385544071,"d":"2.85"},{"v":2.847152385544071,"d":"2.85"},{"v":2.842014827271541,"d":"2.84"},{"v":3.093543321678572,"d":"3.09"},{"v":2.842014827271541,"d":"2.84"},{"v":3.2967299097830223,"d":"3.30"},{"v":2.0277586639249154,"d":"2.03"},{"$f":"IF(ZI7>0,(((4-LOG10(ZI7))+(-LOG(ZI8)))/2),\"\")","v":{"v":4.5,"d":"4.50"}},{"v":3.4436974992327123,"d":"3.44"},{"v":2.439713034397075,"d":"2.44"},{"v":2.6505149978319906,"d":"2.65"},{"$f":"IF(ZM7>0,(((4-LOG10(ZM7))+(-LOG(ZM8)))/2),\"\")","v":{"v":2.5088643834802156,"d":"2.51"}},{"$f":"IF(ZN7>0,(((4-LOG10(ZN7))+(-LOG(ZN8)))/2),\"\")","v":{"v":4.70446769648675,"d":"4.70"}},{"$f":"IF(ZO7>0,(((4-LOG10(ZO7))+(-LOG(ZO8)))/2),\"\")","v":{"v":4.70446769648675,"d":"4.70"}},{"v":3.7819186764796218,"d":"3.78"},{"v":2.240743030061056,"d":"2.24"},{"v":2.439713034397075,"d":"2.44"},{"v":2.439713034397075,"d":"2.44"},{"$f":"IF(ZT7>0,(((4-LOG10(ZT7))+(-LOG(ZT8)))/2),\"\")","v":{"v":2.610924374808178,"d":"2.61"}},{"v":2.439713034397075,"d":"2.44"},{"v":1.6076913536835624,"d":"1.61"},{"v":3.210108201691595,"d":"3.21"},{"$f":"IF(ZX7>0,(((4-LOG10(ZX7))+(-LOG(ZX8)))/2),\"\")","v":{"v":2.629818655252878,"d":"2.63"}},{"v":4.093543321678572,"d":"4.09"},{"v":2,"d":"2.00"},{"v":2.006658910110247,"d":"2.01"},{"$f":"IF(AAB7>0,(((4-LOG10(AAB7))+(-LOG(AAB8)))/2),\"\")","v":{"v":1.8428030213890185,"d":"1.84"}},{"$f":"IF(AAC7>0,(((4-LOG10(AAC7))+(-LOG(AAC8)))/2),\"\")","v":{"v":4.809894379144197,"d":"4.81"}},{"$f":"IF(AAD7>0,(((4-LOG10(AAD7))+(-LOG(AAD8)))/2),\"\")","v":{"v":3.0277586639249154,"d":"3.03"}},{"$f":"IF(AAE7>0,(((4-LOG10(AAE7))+(-LOG(AAE8)))/2),\"\")","v":{"v":3.0277586639249154,"d":"3.03"}},{"$f":"IF(AAF7>0,(((4-LOG10(AAF7))+(-LOG(AAF8)))/2),\"\")","v":{"v":2.7218487496163566,"d":"2.72"}},{"v":2.882235776546225,"d":"2.88"},{"$f":"IF(AAH7>0,(((4-LOG10(AAH7))+(-LOG(AAH8)))/2),\"\")","v":{"v":2.5563601827349887,"d":"2.56"}},{"v":3.765826334793921,"d":"3.77"},{"$f":"IF(AAJ7>0,(((4-LOG10(AAJ7))+(-LOG(AAJ8)))/2),\"\")","v":{"v":2.629818655252878,"d":"2.63"}},{"$f":"IF(AAK7>0,(((4-LOG10(AAK7))+(-LOG(AAK8)))/2),\"\")","v":{"v":2.0226376045104684,"d":"2.02"}},{"$f":"IF(AAL7>0,(((4-LOG10(AAL7))+(-LOG(AAL8)))/2),\"\")","v":{"v":1.3106194123418133,"d":"1.31"}},{"v":2.784318117920506,"d":"2.78"},{"v":2.4914833303506096,"d":"2.49"},{"v":2.926935982160881,"d":"2.93"},{"v":2.0277586639249154,"d":"2.03"},{"v":3.383501944803923,"d":"3.38"},{"v":2.5595932038596043,"d":"2.56"},{"v":1.3979400086720377,"d":"1.40"},null,{"$f":"IF(AAU7>0,(((4-LOG10(AAU7))+(-LOG(AAU8)))/2),\"\")","v":{"v":3.600329725273209,"d":"3.60"}},{"v":2.0277586639249154,"d":"2.03"},{"$f":"IF(AAW7>0,(((4-LOG10(AAW7))+(-LOG(AAW8)))/2),\"\")","v":{"v":1.292513326014591,"d":"1.29"}},{"v":2.240743030061056,"d":"2.24"},{"$f":"IF(AAY7>0,(((4-LOG10(AAY7))+(-LOG(AAY8)))/2),\"\")","v":{"v":2,"d":"2.00"}},{"v":0.7967299097830223,"d":"0.80"},{"v":4.045757490560675,"d":"4.05"},{"v":1.9863251961126216,"d":"1.99"},null,{"$f":"IF(ABD7>0,(((4-LOG10(ABD7))+(-LOG(ABD8)))/2),\"\")","v":{"v":2.7044676964867502,"d":"2.70"}},{"v":2.513436073200151,"d":"2.51"},{"$f":"IF(ABF7>0,(((4-LOG10(ABF7))+(-LOG(ABF8)))/2),\"\")","v":{"v":2.772577569995745,"d":"2.77"}},{"v":3.3287886595888967,"d":"3.33"},{"$f":"IF(ABH7>0,(((4-LOG10(ABH7))+(-LOG(ABH8)))/2),\"\")","v":{"v":1.2673085742757908,"d":"1.27"}},{"$f":"IF(ABI7>0,(((4-LOG10(ABI7))+(-LOG(ABI8)))/2),\"\")","v":{"v":2.772577569995745,"d":"2.77"}},{"v":3.765826334793921,"d":"3.77"},{"v":1.9397130343970748,"d":"1.94"},{"v":2.240743030061056,"d":"2.24"},{"v":1.610924374808178,"d":"1.61"},null,{"v":2.240743030061056,"d":"2.24"},{"$f":"IF(ABP7>0,(((4-LOG10(ABP7))+(-LOG(ABP8)))/2),\"\")","v":{"v":2.5228787452803374,"d":"2.52"}},null,{"v":1.4715475743317636,"d":"1.47"},{"$f":"IF(ABS7>0,(((4-LOG10(ABS7))+(-LOG(ABS8)))/2),\"\")","v":{"v":2.5704308513527345,"d":"2.57"}},{"v":5.34518491628705,"d":"5.35"},{"v":3.2967299097830223,"d":"3.30"},{"v":2.3873453591370684,"d":"2.39"},{"v":2.006658910110247,"d":"2.01"},{"v":2.513436073200151,"d":"2.51"},{"v":2.210108201691595,"d":"2.21"},{"$f":"IF(ABZ7>0,(((4-LOG10(ABZ7))+(-LOG(ABZ8)))/2),\"\")","v":{"v":2.96479633912994,"d":"2.96"}},{"v":2.210108201691595,"d":"2.21"},{"$f":"IF(ACB7>0,(((4-LOG10(ACB7))+(-LOG(ACB8)))/2),\"\")","v":{"v":4.121301985603488,"d":"4.12"}},{"v":2.4498147274412183,"d":"2.45"},{"v":3.0824719491399417,"d":"3.08"},{"$f":"IF(ACE7>0,(((4-LOG10(ACE7))+(-LOG(ACE8)))/2),\"\")","v":{"v":3.080575454631372,"d":"3.08"}},{"v":4.522878745280337,"d":"4.52"},{"v":4.4430283238465815,"d":"4.44"},{"v":2.240743030061056,"d":"2.24"},{"v":3.383501944803923,"d":"3.38"},{"$f":"IF(ACJ7>0,(((4-LOG10(ACJ7))+(-LOG(ACJ8)))/2),\"\")","v":{"v":2.8675910884952316,"d":"2.87"}},{"v":3.383501944803923,"d":"3.38"},null,{"v":1.5,"d":"1.50"},{"v":3.765826334793921,"d":"3.77"},{"$f":"IF(ACO7>0,(((4-LOG10(ACO7))+(-LOG(ACO8)))/2),\"\")","v":{"v":2.7703037561203843,"d":"2.77"}},null,{"v":2.513436073200151,"d":"2.51"},{"$f":"IF(ACR7>0,(((4-LOG10(ACR7))+(-LOG(ACR8)))/2),\"\")","v":{"v":2.093543321678572,"d":"2.09"}},null,{"v":1.2407430300610562,"d":"1.24"},{"v":0.7967299097830223,"d":"0.80"},{"v":0.7967299097830223,"d":"0.80"},{"v":2.842014827271541,"d":"2.84"},{"v":2.240743030061056,"d":"2.24"},{"$f":"IF(ACY7>0,(((4-LOG10(ACY7))+(-LOG(ACY8)))/2),\"\")","v":{"v":2.072058784981982,"d":"2.07"}},{"$f":"IF(ACZ7>0,(((4-LOG10(ACZ7))+(-LOG(ACZ8)))/2),\"\")","v":{"v":2.548455006504028,"d":"2.55"}}]
["14.8 - Koc",null,242,{"v":1073,"d":"1,073"},{"v":6631,"d":"6,631"},{"v":6631,"d":"6,631"},21,{"v":39.5,"d":"40"},72,72,72,200,156,null,null,{"v":10000,"d":"10,000"},744,{"v":9315,"d":"9,315"},{"v":56.2,"d":"56"},null,620,866,null,589,{"v":73.88,"d":"74"},335,335,null,{"v":288735,"d":"288,735"},null,{"v":1000,"d":"1,000"},85,301,364,{"v":30714,"d":"30,714"},{"v":156250,"d":"156,250"},{"v":89.6,"d":"90"},316,316,30,242,null,589,{"v":1000,"d":"1,000"},{"v":6631,"d":"6,631"},{"v":11.6,"d":"12"},{"v":9629,"d":"9,629"},null,{"v":26062,"d":"26,062"},{"v":5363,"d":"5,363"},220,965,364,{"v":78.9,"d":"79"},{"v":41182,"d":"41,182"},{"$nulls":3},364,null,null,{"v":20800,"d":"20,800"},null,{"v":1073,"d":"1,073"},174,174,130,174,700,{"v":2252,"d":"2,252"},{"v":12000,"d":"12,000"},null,866,200,80,72,{"v":4483,"d":"4,483"},{"v":6631,"d":"6,631"},null,null,{"v":73.8,"d":"74"},589,589,225,86,10,750,{"v":25.2,"d":"25"},{"v":2197,"d":"2,197"},null,{"v":4998,"d":"4,998"},225,241,{"v":9100,"d":"9,100"},{"v":9100,"d":"9,100"},86,{"v":245.2,"d":"245"},null,null,{"v":64300,"d":"64,300"},null,{"v":236610,"d":"236,610"},{"v":236610,"d":"236,610"},169,null,null,{"v":236610,"d":"236,610"},{"v":37480,"d":"37,480"},{"v":21175,"d":"21,175"},null,{"v":2184750,"d":"2,184,750"},{"v":35660,"d":"35,660"},43,772,772,{"v":25.2,"d":"25"},32,null,872,{"v":64300,"d":"64,300"},{"v":17.8,"d":"18"},{"v":5363,"d":"5,363"},80,null,112,{"v":9500,"d":"9,500"},null,13,772,200,200,{"v":1.4,"d":"1"},{"v":236610,"d":"236,610"},300,225,225,{"v":1.6,"d":"2"},225,null,{"v":99.4,"d":"99"},228,866,null,null,{"v":157643,"d":"157,643"},null,{"v":8151,"d":"8,151"},72,205,388,{"v":22.7,"d":"23"},220,{"v":2632,"d":"2,632"},{"v":2967,"d":"2,967"},700,{"v":63300,"d":"63,300"},null,241,null,null,{"v":1440,"d":"1,440"},239,225,220,null,{"v":156250,"d":"156,250"},{"v":156250,"d":"156,250"},364,null,409,106,{"v":22.7,"d":"23"},null,300,30,301,{"v":12000,"d":"12,000"},{"v":20800,"d":"20,800"},null,106,106,106,{"v":2632,"d":"2,632"},{"v":8151,"d":"8,151"},123,90,80,{"v":9315,"d":"9,315"},{"v":156250,"d":"156,250"},220,872,225,125,998,{"v":21175,"d":"21,175"},500,174,769,225,{"v":56.2,"d":"56"},125,{"v":1000,"d":"1,000"},{"v":2632,"d":"2,632"},998,998,{"v":41182,"d":"41,182"},{"v":2016,"d":"2,016"},{"v":173900,"d":"173,900"},{"v":156250,"d":"156,250"},{"v":2632,"d":"2,632"},{"v":2632,"d":"2,632"},{"v":2632,"d":"2,632"},{"v":35660,"d":"35,660"},10,{"v":10240000,"d":"10,240,000"},{"v":3627,"d":"3,627"},{"v":10240000,"d":"10,240,000"},301,225,225,{"v":2184750,"d":"2,184,750"},{"v":43546,"d":"43,546"},{"v":2184750,"d":"2,184,750"},null,{"v":1000000,"d":"1,000,000"},90,{"v":3760,"d":"3,760"},{"v":3760,"d":"3,760"},{"v":4620,"d":"4,620"},{"v":4620,"d":"4,620"},{"v":4620,"d":"4,620"},{"v":4620,"d":"4,620"},{"$nulls":3},{"v":4620,"d":"4,620"},30,26,{"v":1067,"d":"1,067"},{"v":2184750,"d":"2,184,750"},{"v":2184750,"d":"2,184,750"},{"v":2185000,"d":"2,185,000"},{"v":1067,"d":"1,067"},998,{"v":3627,"d":"3,627"},{"v":1067,"d":"1,067"},{"v":1067,"d":"1,067"},242,86,{"v":4236500,"d":"4,236,500"},{"v":4236500,"d":"4,236,500"},{"v":10000,"d":"10,000"},{"v":226.1,"d":"226"},769,589,{"v":17757,"d":"17,757"},{"v":12000,"d":"12,000"},{"v":1152,"d":"1,152"},998,{"v":56.2,"d":"56"},{"v":31037,"d":"31,037"},null,{"v":1950,"d":"1,950"},{"v":1073,"d":"1,073"},null,{"v":3847,"d":"3,847"},{"v":78.4,"d":"78"},769,null,{"v":251717,"d":"251,717"},{"v":22836,"d":"22,836"},null,{"v":31037,"d":"31,037"},{"v":30900,"d":"30,900"},{"v":1000,"d":"1,000"},{"v":17757,"d":"17,757"},null,134,{"v":1000,"d":"1,000"},72,{"v":22836,"d":"22,836"},{"v":40.8,"d":"41"},174,174,50,{"v":3847,"d":"3,847"},600,{"v":288735,"d":"288,735"},388,{"v":2000,"d":"2,000"},{"v":11354,"d":"11,354"},null,null,{"v":35660,"d":"35,660"},null,{"v":59677,"d":"59,677"},{"v":100000,"d":"100,000"},600,727,{"v":3760,"d":"3,760"},{"v":46.2,"d":"46"},228,{"v":2287,"d":"2,287"},{"v":1.6,"d":"2"},{"v":105.2,"d":"105"},{"v":3394,"d":"3,394"},220,{"v":2197,"d":"2,197"},{"v":145600,"d":"145,600"},{"v":157643,"d":"157,643"},28,30,889,889,null,null,{"v":98.4,"d":"98"},{"$nulls":3},205,728,769,{"v":78.9,"d":"79"},304,304,228,{"v":78.4,"d":"78"},145,80,241,{"$nulls":3},{"v":3534,"d":"3,534"},239,{"v":2556,"d":"2,556"},220,225,{"v":2632,"d":"2,632"},{"v":156250,"d":"156,250"},769,228,{"v":3394,"d":"3,394"},{"v":9100,"d":"9,100"},{"v":4998,"d":"4,998"},225,{"v":9598,"d":"9,598"},{"v":59677,"d":"59,677"},{"v":59677,"d":"59,677"},{"v":41182,"d":"41,182"},{"v":105.2,"d":"105"},{"v":226.1,"d":"226"},null,400,316,174,134,{"v":2632,"d":"2,632"},{"v":28700,"d":"28,700"},600,{"v":28700,"d":"28,700"},{"v":7566,"d":"7,566"},{"v":1000000,"d":"1,000,000"},{"v":1000000,"d":"1,000,000"},{"v":1100,"d":"1,100"},80,{"v":73.8,"d":"74"},{"v":1417,"d":"1,417"},109,null,null,{"v":37480,"d":"37,480"},null,20,{"v":1000000,"d":"1,000,000"},{"v":17491,"d":"17,491"},316,{"v":1067,"d":"1,067"},{"v":156250,"d":"156,250"},54,54,54,54,null,{"v":12000,"d":"12,000"},{"v":3104,"d":"3,104"},769,45,{"v":2632,"d":"2,632"},{"v":4753,"d":"4,753"},{"v":4753,"d":"4,753"},{"v":11.6,"d":"12"},137,125,{"v":17.96,"d":"18"},52,{"v":13120,"d":"13,120"},225,225,{"v":3534,"d":"3,534"},205,{"v":4620,"d":"4,620"},null,{"v":26062,"d":"26,062"},{"v":1000,"d":"1,000"},{"v":4483,"d":"4,483"},null,{"v":236610,"d":"236,610"},727,402,{"v":1440,"d":"1,440"},45,null,700,{"v":2632,"d":"2,632"},null,145,{"v":2252,"d":"2,252"},{"v":10240000,"d":"10,240,000"},{"v":10240000,"d":"10,240,000"},156,null,{"v":157450,"d":"157,450"},{"v":1067,"d":"1,067"},null,{"v":46.2,"d":"46"},{"v":352.5,"d":"353"},null,43,137,{"v":8151,"d":"8,151"},32,{"v":1950,"d":"1,950"},21,335,{"v":10000,"d":"10,000"},{"v":157450,"d":"157,450"},{"v":25.2,"d":"25"},{"v":9100,"d":"9,100"},80,600,620,620,{"v":8151,"d":"8,151"},{"v":41182,"d":"41,182"},112,727,{"v":4753,"d":"4,753"},54,217,{"v":13120,"d":"13,120"},998,null,998,727,null,{"v":41182,"d":"41,182"},{"v":78.9,"d":"79"},{"v":145600,"d":"145,600"},26,{"v":73.88,"d":"74"},null,{"v":35660,"d":"35,660"},112,200,{"v":3104,"d":"3,104"},112,112,{"v":30714,"d":"30,714"},{"v":30714,"d":"30,714"},{"v":78.9,"d":"79"},{"v":17.8,"d":"18"},null,{"v":25.2,"d":"25"},400,{"v":903012,"d":"903,012"},{"v":226.1,"d":"226"},{"v":226.1,"d":"226"},{"v":25.2,"d":"25"},402,{"v":37.92,"d":"38"},{"v":1000,"d":"1,000"},{"v":39.5,"d":"40"},{"v":39.5,"d":"40"},517,null,null,{"v":3500000,"d":"3,500,000"},{"$nulls":3},{"v":10000,"d":"10,000"},21,769,null,30,30,30,{"v":2252,"d":"2,252"},{"v":26062,"d":"26,062"},217,{"v":9598,"d":"9,598"},{"v":8151,"d":"8,151"},{"v":39.5,"d":"40"},225,{"v":1000000,"d":"1,000,000"},{"v":30900,"d":"30,900"},769,{"v":173900,"d":"173,900"},null,{"v":17.96,"d":"18"},137,{"v":1073,"d":"1,073"},null,769,728,72,200,{"v":352.5,"d":"353"},null,{"v":3200,"d":"3,200"},{"v":165.4,"d":"165"},{"v":1000,"d":"1,000"},{"v":7566,"d":"7,566"},30,477,106,{"v":1000000,"d":"1,000,000"},600,null,{"v":17491,"d":"17,491"},998,{"v":73.2,"d":"73"},{"v":100000,"d":"100,000"},998,750,13,965,null,{"v":3394,"d":"3,394"},null,{"v":9315,"d":"9,315"},{"v":12000,"d":"12,000"},{"v":251717,"d":"251,717"},null,null,{"v":1100,"d":"1,100"},{"v":21175,"d":"21,175"},null,223,137,75,{"v":11354,"d":"11,354"},{"v":43546,"d":"43,546"},{"v":903012,"d":"903,012"},123,43,{"v":9598,"d":"9,598"},{"v":22.7,"d":"23"},{"v":9100,"d":"9,100"},{"v":1073,"d":"1,073"},{"v":15800,"d":"15,800"},301,374,28,174,174,174,174,364,174,589,589,{"v":3760,"d":"3,760"},{"v":21175,"d":"21,175"},378,null,{"v":2016,"d":"2,016"},null,null,{"v":2556,"d":"2,556"},400,149,null,{"v":2252,"d":"2,252"},{"v":2252,"d":"2,252"},null,{"v":1073,"d":"1,073"},{"v":2556,"d":"2,556"},145,{"v":1000,"d":"1,000"},50,{"v":1816,"d":"1,816"},477,30,866,null,null,72,{"v":226.1,"d":"226"},{"v":11354,"d":"11,354"},{"v":11.6,"d":"12"},{"v":73.2,"d":"73"},300,{"v":8151,"d":"8,151"},727,{"v":2184750,"d":"2,184,750"},{"v":2185000,"d":"2,185,000"},727,30,null,{"v":9629,"d":"9,629"},727,998,225,{"v":9598,"d":"9,598"},null,{"v":39.5,"d":"40"},{"v":3200,"d":"3,200"},378,{"v":28700,"d":"28,700"},{"v":28700,"d":"28,700"},{"v":28700,"d":"28,700"},700,744,null,{"v":17757,"d":"17,757"},20,null,21,866,{"v":3760,"d":"3,760"},28,{"v":22.7,"d":"23"},{"v":11354,"d":"11,354"},{"v":9629,"d":"9,629"},{"v":9100,"d":"9,100"},109,{"v":37.92,"d":"38"},{"v":226.1,"d":"226"},75,300,378,130,{"v":98.4,"d":"98"},205,null,66,43,225,{"v":17.96,"d":"18"},{"v":3760,"d":"3,760"},{"v":236610,"d":"236,610"},364,90,80,772,866,{"v":59677,"d":"59,677"},149,727,727,null,{"v":236610,"d":"236,610"},727,30,{"v":2252,"d":"2,252"},null,{"v":9500,"d":"9,500"},43,{"v":3500000,"d":"3,500,000"},85,{"v":40.8,"d":"41"},{"v":251717,"d":"251,717"},{"v":2000,"d":"2,000"},{"v":2000,"d":"2,000"},378,378,889,{"v":2000,"d":"2,000"},889,{"v":12000,"d":"12,000"},220,400,156,769,517,null,{"v":236610,"d":"236,610"},{"v":236610,"d":"236,610"},{"v":1816,"d":"1,816"},205,769,769,null,769,80,225,{"v":3983,"d":"3,983"},{"v":26062,"d":"26,062"},66,{"v":37.92,"d":"38"},null,500,null,null,{"v":1000,"d":"1,000"},{"v":1152,"d":"1,152"},{"v":1417,"d":"1,417"},{"v":2967,"d":"2,967"},{"v":3983,"d":"3,983"},null,null,{"v":21175,"d":"21,175"},{"v":2252,"d":"2,252"},{"v":1.4,"d":"1"},220,{"v":9629,"d":"9,629"},{"v":1000000,"d":"1,000,000"},54,{"v":63300,"d":"63,300"},null,220,null,205,{"v":245.2,"d":"245"},{"v":2632,"d":"2,632"},{"v":17757,"d":"17,757"},750,169,null,589,{"v":1373,"d":"1,373"},{"v":2287,"d":"2,287"},null,{"v":1373,"d":"1,373"},{"v":2967,"d":"2,967"},{"v":15800,"d":"15,800"},205,409,null,205,374,null,{"v":28700,"d":"28,700"},null,{"v":64300,"d":"64,300"},{"v":12000,"d":"12,000"},106,{"v":37.92,"d":"38"},589,364,null,364,null,241,{"v":30714,"d":"30,714"},null,{"v":4.52287874528034,"d":"5"},{"v":8151,"d":"8,151"},205,{"v":9629,"d":"9,629"},{"v":99.4,"d":"99"},{"v":9629,"d":"9,629"},null,86,{"v":2967,"d":"2,967"},null,223,589,{"v":89.6,"d":"90"},52,{"v":39.5,"d":"40"},{"v":2632,"d":"2,632"},{"v":2632,"d":"2,632"},889,205,{"v":165.4,"d":"165"},{"v":1224,"d":"1,224"}]
["14.9 - t1/2 (DT50)",null,{"v":10,"d":"10.0"},{"v":354,"d":"354.0"},{"v":30,"d":"30.0"},{"v":30,"d":"30.0"},{"v":26,"d":"26.0"},{"v":10,"d":"10.0"},{"v":7,"d":"7.0"},{"v":7,"d":"7.0"},{"v":7,"d":"7.0"},1.6,{"v":14,"d":"14.0"},null,{"v":59,"d":"59.0"},{"v":4,"d":"4.0"},39.2,{"v":32,"d":"32.0"},{"v":50,"d":"50.0"},11.6,{"v":48,"d":"48.0"},{"v":1,"d":"1.0"},8.8,{"v":78,"d":"78.0"},{"v":12.07,"d":"12.1"},{"v":14,"d":"14.0"},{"v":14,"d":"14.0"},{"v":908,"d":"908.0"},{"v":23,"d":"23.0"},0.1,{"v":150,"d":"150.0"},{"v":24,"d":"24.0"},{"v":597,"d":"597.0"},{"v":142,"d":"142.0"},{"v":141,"d":"141.0"},{"v":60,"d":"60.0"},1.8,{"v":37,"d":"37.0"},{"v":37,"d":"37.0"},{"v":21,"d":"21.0"},{"v":10,"d":"10.0"},{"v":35,"d":"35.0"},{"v":78,"d":"78.0"},0.2,{"v":30,"d":"30.0"},200.2,{"v":4.89,"d":"4.9"},4.3,{"v":92,"d":"92.0"},55.4,{"v":11,"d":"11.0"},24.4,{"v":142,"d":"142.0"},6.5,16.3,{"v":10,"d":"10.0"},1.5,13.1,{"v":142,"d":"142.0"},3.2,3.2,{"v":90,"d":"90.0"},{"v":350,"d":"350.0"},{"v":354,"d":"354.0"},{"v":75,"d":"75.0"},{"v":75,"d":"75.0"},{"v":60,"d":"60.0"},{"v":75,"d":"75.0"},3.7,{"v":214,"d":"214.0"},{"v":10000,"d":"10,000.0"},{"v":8,"d":"8.0"},{"v":1,"d":"1.0"},1.6,{"v":400,"d":"400.0"},{"v":7,"d":"7.0"},113.2,{"v":30,"d":"30.0"},null,null,{"v":64,"d":"64.0"},{"v":78,"d":"78.0"},{"v":78,"d":"78.0"},{"v":191,"d":"191.0"},{"v":13,"d":"13.0"},{"v":0.52,"d":"0.5"},{"v":250,"d":"250.0"},{"v":7,"d":"7.0"},{"v":8,"d":"8.0"},{"v":268,"d":"268.0"},33.2,{"v":40,"d":"40.0"},34.4,0.5,0.5,{"v":13,"d":"13.0"},13.8,null,{"v":908,"d":"908.0"},{"v":13,"d":"13.0"},0.1,{"v":26,"d":"26.0"},{"v":26,"d":"26.0"},{"v":450,"d":"450.0"},null,{"v":13,"d":"13.0"},{"v":26,"d":"26.0"},80.5,{"v":10,"d":"10.0"},{"v":59,"d":"59.0"},{"v":2345,"d":"2,345.0"},{"v":34,"d":"34.0"},{"v":541,"d":"541.0"},{"v":200,"d":"200.0"},{"v":200,"d":"200.0"},{"v":7,"d":"7.0"},{"v":60,"d":"60.0"},null,{"v":190,"d":"190.0"},{"v":13,"d":"13.0"},{"v":7,"d":"7.0"},55.4,{"v":400,"d":"400.0"},{"v":38,"d":"38.0"},19.6,0.1,{"v":0.88,"d":"0.9"},{"v":23,"d":"23.0"},{"v":200,"d":"200.0"},0.8,0.8,{"v":0.67,"d":"0.7"},{"v":26,"d":"26.0"},{"v":16,"d":"16.0"},{"v":40,"d":"40.0"},{"v":40,"d":"40.0"},3.1,{"v":40,"d":"40.0"},{"v":21,"d":"21.0"},0.5,{"v":86,"d":"86.0"},{"v":1,"d":"1.0"},null,null,{"v":42,"d":"42.0"},null,{"v":50,"d":"50.0"},{"v":7,"d":"7.0"},{"v":1358,"d":"1,358.0"},8.5,{"v":0.55,"d":"0.6"},0.5,9.2,{"v":22,"d":"22.0"},3.7,{"v":4,"d":"4.0"},{"v":5,"d":"5.0"},34.4,{"v":10,"d":"10.0"},{"v":1161,"d":"1,161.0"},{"v":15,"d":"15.0"},{"v":13,"d":"13.0"},{"v":191,"d":"191.0"},{"v":11,"d":"11.0"},1.7,{"v":60,"d":"60.0"},{"v":60,"d":"60.0"},{"v":142,"d":"142.0"},{"v":37,"d":"37.0"},{"v":93,"d":"93.0"},{"v":40,"d":"40.0"},{"v":0.55,"d":"0.6"},0.8,22.6,{"v":11,"d":"11.0"},{"v":597,"d":"597.0"},1.4,{"v":90,"d":"90.0"},39.3,{"v":40,"d":"40.0"},{"v":40,"d":"40.0"},{"v":40,"d":"40.0"},9.2,{"v":50,"d":"50.0"},{"v":545,"d":"545.0"},{"v":49,"d":"49.0"},{"v":400,"d":"400.0"},{"v":32,"d":"32.0"},{"v":60,"d":"60.0"},{"v":11,"d":"11.0"},{"v":190,"d":"190.0"},{"v":191,"d":"191.0"},{"v":11,"d":"11.0"},0.1,{"v":10,"d":"10.0"},{"v":8,"d":"8.0"},{"v":75,"d":"75.0"},{"v":63,"d":"63.0"},{"v":191,"d":"191.0"},{"v":50,"d":"50.0"},{"v":11,"d":"11.0"},0.1,9.2,0.1,0.1,16.3,{"v":7,"d":"7.0"},{"v":9,"d":"9.0"},{"v":60,"d":"60.0"},9.2,9.2,9.2,{"v":34,"d":"34.0"},{"v":0.52,"d":"0.5"},{"v":13,"d":"13.0"},10.5,{"v":13,"d":"13.0"},{"v":597,"d":"597.0"},{"v":40,"d":"40.0"},{"v":40,"d":"40.0"},{"v":2345,"d":"2,345.0"},0.5,{"v":2345,"d":"2,345.0"},{"v":9.62,"d":"9.6"},{"v":3000,"d":"3,000.0"},{"v":49,"d":"49.0"},{"v":130,"d":"130.0"},{"v":130,"d":"130.0"},{"v":3,"d":"3.0"},{"v":3,"d":"3.0"},{"v":3,"d":"3.0"},{"v":3,"d":"3.0"},2.5,72.7,2.5,{"v":3,"d":"3.0"},{"v":21,"d":"21.0"},{"v":82,"d":"82.0"},75.5,{"v":2345,"d":"2,345.0"},{"v":2345,"d":"2,345.0"},{"v":2345,"d":"2,345.0"},75.5,0.1,10.5,75.5,75.5,{"v":10,"d":"10.0"},{"v":13,"d":"13.0"},4.7,4.7,{"v":4,"d":"4.0"},{"v":15,"d":"15.0"},{"v":63,"d":"63.0"},{"v":78,"d":"78.0"},{"v":11,"d":"11.0"},{"v":10000,"d":"10,000.0"},{"v":61,"d":"61.0"},0.1,{"v":50,"d":"50.0"},{"v":7,"d":"7.0"},6.5,{"v":30,"d":"30.0"},{"v":354,"d":"354.0"},1.7,41.1,25.4,{"v":63,"d":"63.0"},50.9,66.6,16.1,null,{"v":7,"d":"7.0"},4.1,{"v":150,"d":"150.0"},{"v":11,"d":"11.0"},null,{"v":18,"d":"18.0"},{"v":20,"d":"20.0"},{"v":7,"d":"7.0"},16.1,2.2,{"v":75,"d":"75.0"},{"v":75,"d":"75.0"},{"v":450,"d":"450.0"},41.1,7.4,{"v":23,"d":"23.0"},8.5,2.7,0.4,99.6,135.1,{"v":34,"d":"34.0"},{"v":35,"d":"35.0"},26.8,{"v":13,"d":"13.0"},7.4,{"v":142,"d":"142.0"},{"v":130,"d":"130.0"},41.2,{"v":86,"d":"86.0"},{"v":0.34,"d":"0.3"},3.1,39.8,{"v":1,"d":"1.0"},{"v":11,"d":"11.0"},{"v":8,"d":"8.0"},{"v":164,"d":"164.0"},{"v":42,"d":"42.0"},{"v":45,"d":"45.0"},2.5,21.9,21.9,{"v":271,"d":"271.0"},{"v":309,"d":"309.0"},57.1,{"v":350,"d":"350.0"},13.1,{"v":400,"d":"400.0"},{"v":1358,"d":"1,358.0"},{"v":183,"d":"183.0"},{"v":62,"d":"62.0"},6.5,4.7,4.7,{"v":86,"d":"86.0"},25.4,0.9,{"v":400,"d":"400.0"},34.4,72.7,0.1,null,3.2,{"v":13,"d":"13.0"},0.5,{"v":11,"d":"11.0"},{"v":40,"d":"40.0"},9.2,{"v":60,"d":"60.0"},{"v":63,"d":"63.0"},{"v":86,"d":"86.0"},{"v":1,"d":"1.0"},0.5,33.2,{"v":191,"d":"191.0"},{"v":72,"d":"72.0"},26.8,26.8,16.3,39.8,{"v":15,"d":"15.0"},null,{"v":41,"d":"41.0"},{"v":37,"d":"37.0"},{"v":75,"d":"75.0"},{"v":18,"d":"18.0"},9.2,{"v":12,"d":"12.0"},7.4,{"v":12,"d":"12.0"},{"v":35,"d":"35.0"},{"v":3000,"d":"3,000.0"},{"v":3000,"d":"3,000.0"},{"v":39,"d":"39.0"},{"v":400,"d":"400.0"},{"v":64,"d":"64.0"},1.3,26.7,0.5,{"v":10,"d":"10.0"},80.5,{"v":1161,"d":"1,161.0"},null,{"v":3000,"d":"3,000.0"},182.3,{"v":37,"d":"37.0"},75.5,{"v":60,"d":"60.0"},{"v":105,"d":"105.0"},{"v":105,"d":"105.0"},{"v":105,"d":"105.0"},{"v":105,"d":"105.0"},{"v":30,"d":"30.0"},{"v":10000,"d":"10,000.0"},{"v":26,"d":"26.0"},{"v":63,"d":"63.0"},2.7,9.2,76.3,76.3,200.2,{"v":120,"d":"120.0"},{"v":11,"d":"11.0"},{"v":60,"d":"60.0"},{"v":90,"d":"90.0"},{"v":15,"d":"15.0"},{"v":191,"d":"191.0"},{"v":191,"d":"191.0"},3.2,{"v":1358,"d":"1,358.0"},{"v":3,"d":"3.0"},null,{"v":92,"d":"92.0"},{"v":150,"d":"150.0"},113.2,39.3,{"v":26,"d":"26.0"},{"v":142,"d":"142.0"},{"v":146,"d":"146.0"},{"v":15,"d":"15.0"},2.7,{"v":50,"d":"50.0"},3.7,9.2,37.1,0.9,{"v":214,"d":"214.0"},{"v":13,"d":"13.0"},{"v":13,"d":"13.0"},{"v":14,"d":"14.0"},0.1,{"v":25,"d":"25.0"},75.5,null,41.2,12.5,37.1,{"v":541,"d":"541.0"},{"v":120,"d":"120.0"},{"v":50,"d":"50.0"},{"v":60,"d":"60.0"},{"v":30,"d":"30.0"},{"v":26,"d":"26.0"},{"v":14,"d":"14.0"},{"v":4,"d":"4.0"},{"v":25,"d":"25.0"},{"v":7,"d":"7.0"},0.5,{"v":400,"d":"400.0"},7.4,{"v":48,"d":"48.0"},{"v":48,"d":"48.0"},{"v":50,"d":"50.0"},16.3,19.6,{"v":142,"d":"142.0"},76.3,{"v":105,"d":"105.0"},{"v":0.17,"d":"0.2"},{"v":15,"d":"15.0"},0.1,49.1,0.1,{"v":142,"d":"142.0"},{"v":21,"d":"21.0"},16.3,6.5,{"v":164,"d":"164.0"},{"v":82,"d":"82.0"},{"v":12.07,"d":"12.1"},{"v":268,"d":"268.0"},{"v":34,"d":"34.0"},19.6,0.8,{"v":26,"d":"26.0"},19.6,19.6,{"v":141,"d":"141.0"},{"v":141,"d":"141.0"},6.5,{"v":7,"d":"7.0"},142.2,{"v":7,"d":"7.0"},{"v":10,"d":"10.0"},1.3,{"v":15,"d":"15.0"},{"v":15,"d":"15.0"},{"v":7,"d":"7.0"},{"v":146,"d":"146.0"},11.5,{"v":150,"d":"150.0"},{"v":10,"d":"10.0"},{"v":10,"d":"10.0"},{"v":560,"d":"560.0"},{"v":400,"d":"400.0"},{"v":2416,"d":"2,416.0"},null,82.4,{"v":400,"d":"400.0"},null,{"v":4,"d":"4.0"},{"v":26,"d":"26.0"},{"v":63,"d":"63.0"},null,{"v":26,"d":"26.0"},{"v":26,"d":"26.0"},{"v":26,"d":"26.0"},{"v":214,"d":"214.0"},{"v":92,"d":"92.0"},{"v":0.17,"d":"0.2"},{"v":72,"d":"72.0"},{"v":50,"d":"50.0"},{"v":10,"d":"10.0"},{"v":191,"d":"191.0"},{"v":3000,"d":"3,000.0"},4.1,{"v":63,"d":"63.0"},{"v":9,"d":"9.0"},{"v":56,"d":"56.0"},{"v":60,"d":"60.0"},{"v":120,"d":"120.0"},{"v":354,"d":"354.0"},142.2,{"v":63,"d":"63.0"},{"v":183,"d":"183.0"},{"v":7,"d":"7.0"},0.8,12.5,135.1,{"v":502,"d":"502.0"},121.2,0.1,{"v":35,"d":"35.0"},{"v":11,"d":"11.0"},0.2,{"v":40,"d":"40.0"},{"v":3000,"d":"3,000.0"},7.4,82.4,182.3,0.1,21.7,{"v":13,"d":"13.0"},0.1,{"v":250,"d":"250.0"},{"v":23,"d":"23.0"},24.4,{"v":2416,"d":"2,416.0"},{"v":1,"d":"1.0"},{"v":5,"d":"5.0"},{"v":32,"d":"32.0"},1.4,66.6,{"v":55,"d":"55.0"},50.9,{"v":39,"d":"39.0"},{"v":10,"d":"10.0"},{"v":60,"d":"60.0"},{"v":22,"d":"22.0"},{"v":120,"d":"120.0"},1.2,0.4,0.5,1.3,{"v":545,"d":"545.0"},{"v":541,"d":"541.0"},{"v":72,"d":"72.0"},{"v":0.55,"d":"0.6"},0.5,{"v":354,"d":"354.0"},{"v":181,"d":"181.0"},{"v":597,"d":"597.0"},{"v":237,"d":"237.0"},{"v":45,"d":"45.0"},{"v":75,"d":"75.0"},{"v":75,"d":"75.0"},{"v":75,"d":"75.0"},{"v":75,"d":"75.0"},{"v":142,"d":"142.0"},{"v":75,"d":"75.0"},{"v":78,"d":"78.0"},{"v":78,"d":"78.0"},{"v":130,"d":"130.0"},{"v":10,"d":"10.0"},{"v":7,"d":"7.0"},null,{"v":7,"d":"7.0"},{"v":8,"d":"8.0"},99.6,0.5,{"v":41,"d":"41.0"},0.4,{"v":56,"d":"56.0"},{"v":214,"d":"214.0"},{"v":214,"d":"214.0"},4.3,{"v":354,"d":"354.0"},0.5,0.9,{"v":150,"d":"150.0"},{"v":450,"d":"450.0"},{"v":2,"d":"2.0"},0.2,2.5,{"v":1,"d":"1.0"},{"v":9.62,"d":"9.6"},{"v":50,"d":"50.0"},{"v":7,"d":"7.0"},{"v":15,"d":"15.0"},0.4,200.2,21.7,22.6,{"v":50,"d":"50.0"},{"v":142,"d":"142.0"},{"v":2345,"d":"2,345.0"},{"v":2345,"d":"2,345.0"},{"v":142,"d":"142.0"},2.5,49.1,{"v":4.89,"d":"4.9"},{"v":142,"d":"142.0"},0.1,{"v":191,"d":"191.0"},{"v":72,"d":"72.0"},{"v":13,"d":"13.0"},{"v":10,"d":"10.0"},{"v":502,"d":"502.0"},{"v":7,"d":"7.0"},{"v":12,"d":"12.0"},{"v":12,"d":"12.0"},{"v":12,"d":"12.0"},3.7,39.2,{"v":38,"d":"38.0"},{"v":11,"d":"11.0"},null,{"v":55,"d":"55.0"},{"v":26,"d":"26.0"},{"v":1,"d":"1.0"},{"v":130,"d":"130.0"},{"v":45,"d":"45.0"},{"v":0.55,"d":"0.6"},0.4,{"v":4.89,"d":"4.9"},0.5,26.7,11.5,{"v":15,"d":"15.0"},1.2,{"v":16,"d":"16.0"},{"v":7,"d":"7.0"},{"v":60,"d":"60.0"},57.1,{"v":1358,"d":"1,358.0"},null,{"v":30,"d":"30.0"},{"v":541,"d":"541.0"},{"v":191,"d":"191.0"},{"v":60,"d":"60.0"},{"v":130,"d":"130.0"},{"v":26,"d":"26.0"},{"v":142,"d":"142.0"},{"v":49,"d":"49.0"},{"v":400,"d":"400.0"},{"v":200,"d":"200.0"},{"v":1,"d":"1.0"},26.8,0.4,{"v":142,"d":"142.0"},{"v":142,"d":"142.0"},{"v":60,"d":"60.0"},{"v":26,"d":"26.0"},{"v":142,"d":"142.0"},{"v":26,"d":"26.0"},{"v":214,"d":"214.0"},null,0.1,{"v":541,"d":"541.0"},null,{"v":24,"d":"24.0"},2.2,66.6,2.7,2.7,{"v":7,"d":"7.0"},{"v":7,"d":"7.0"},21.9,2.7,{"v":20,"d":"20.0"},{"v":10000,"d":"10,000.0"},0.5,{"v":10,"d":"10.0"},{"v":14,"d":"14.0"},{"v":63,"d":"63.0"},{"v":560,"d":"560.0"},{"v":30,"d":"30.0"},{"v":26,"d":"26.0"},{"v":26,"d":"26.0"},{"v":2,"d":"2.0"},{"v":1358,"d":"1,358.0"},{"v":63,"d":"63.0"},{"v":63,"d":"63.0"},{"v":400,"d":"400.0"},{"v":63,"d":"63.0"},{"v":400,"d":"400.0"},{"v":40,"d":"40.0"},{"v":500,"d":"500.0"},{"v":92,"d":"92.0"},{"v":30,"d":"30.0"},11.5,{"v":10,"d":"10.0"},{"v":8,"d":"8.0"},{"v":72,"d":"72.0"},{"v":72,"d":"72.0"},{"v":20,"d":"20.0"},{"v":61,"d":"61.0"},1.3,{"v":22,"d":"22.0"},{"v":500,"d":"500.0"},{"v":0.88,"d":"0.9"},11.6,{"v":10,"d":"10.0"},{"v":214,"d":"214.0"},{"v":0.67,"d":"0.7"},0.5,{"v":4.89,"d":"4.9"},{"v":3000,"d":"3,000.0"},{"v":105,"d":"105.0"},{"v":4,"d":"4.0"},0.8,0.5,{"v":35,"d":"35.0"},{"v":1358,"d":"1,358.0"},13.8,9.2,{"v":11,"d":"11.0"},{"v":250,"d":"250.0"},{"v":450,"d":"450.0"},1.5,{"v":78,"d":"78.0"},{"v":13,"d":"13.0"},{"v":0.34,"d":"0.3"},6.5,{"v":13,"d":"13.0"},{"v":22,"d":"22.0"},{"v":181,"d":"181.0"},{"v":1358,"d":"1,358.0"},{"v":93,"d":"93.0"},null,{"v":1358,"d":"1,358.0"},{"v":237,"d":"237.0"},null,{"v":12,"d":"12.0"},{"v":37,"d":"37.0"},{"v":13,"d":"13.0"},{"v":10000,"d":"10,000.0"},{"v":40,"d":"40.0"},11.5,{"v":78,"d":"78.0"},{"v":142,"d":"142.0"},{"v":309,"d":"309.0"},{"v":142,"d":"142.0"},0.5,34.4,{"v":141,"d":"141.0"},{"v":35,"d":"35.0"},{"v":30,"d":"30.0"},{"v":50,"d":"50.0"},{"v":1358,"d":"1,358.0"},{"v":4.89,"d":"4.9"},0.5,{"v":4.89,"d":"4.9"},null,{"v":13,"d":"13.0"},{"v":22,"d":"22.0"},{"v":271,"d":"271.0"},{"v":22,"d":"22.0"},{"v":78,"d":"78.0"},1.8,{"v":90,"d":"90.0"},{"v":10,"d":"10.0"},9.2,9.2,21.9,{"v":1358,"d":"1,358.0"},121.2,5.5]
["Índice de vulnerabilidade GUS (IUPAC) (>2)",null,1.62,2.47,0.26,0.26,3.79,{"v":2.4,"d":"2.40"},1.81,1.81,1.81,2.18,1.58,null,3.15,{"v":0,"d":"0.00"},-0.92,0.05,3.82,3.42,2.03,{"v":0,"d":"0.00"},null,2.65,3.13,1.08,1.08,0.91,{"v":-2,"d":"-2.00"},null,2.18,3.92,4.22,{"v":3.1,"d":"3.10"},-1.05,-2.12,0.55,0.52,0.52,4.89,1.62,3.34,2.65,{"v":0,"d":"0.00"},0.26,6.76,0.01,null,-0.82,1.21,1.73,1.35,{"v":3.1,"d":"3.10"},1.71,-0.75,4.77,null,1.03,{"v":3.1,"d":"3.10"},2.58,2.58,-0.62,{"v":2.3,"d":"2.30"},2.47,{"v":3.3,"d":"3.30"},{"v":3.3,"d":"3.30"},{"v":2.2,"d":"2.20"},{"v":3.3,"d":"3.30"},0.58,1.51,-0.32,0.47,{"v":0,"d":"0.00"},2.18,5.46,1.81,0.27,0.26,null,null,1.18,2.65,2.65,3.76,{"v":2.3,"d":"2.30"},0.13,3.34,{"v":2.2,"d":"2.20"},3.98,1.06,2.29,2.53,2.63,"-0.04","-0.03",{"v":2.3,"d":"2.30"},1.99,null,0.91,{"v":-0.9,"d":"-0.90"},{"v":-4,"d":"-4.00"},-2.66,-2.66,3.89,null,1.21,-2.66,-1.09,-0.27,3.15,-2.29,-0.85,"6.17",2.66,2.66,{"v":2.2,"d":"2.20"},3.44,null,2.23,{"v":-0.9,"d":"-0.90"},2.32,1.21,5.46,2.62,2.69,-0.02,{"v":1.1,"d":"1.10"},4.14,2.66,{"v":0,"d":"0.00"},{"v":0,"d":"0.00"},-0.56,-2.66,2.02,2.53,2.53,1.87,2.53,0.89,2.01,3.18,{"v":0,"d":"0.00"},null,null,-3.14,null,0.15,1.81,{"v":5.4,"d":"5.40"},1.31,-0.69,{"v":-0.5,"d":"-0.50"},0.86,-0.05,0.58,-0.48,1.33,2.63,0.57,2.56,0.99,2.48,3.76,1.73,1.47,-2.12,-2.12,{"v":3.1,"d":"3.10"},1.06,2.09,3.16,-0.69,-0.08,2.72,2.52,4.22,-0.01,-0.62,{"v":1.5,"d":"1.50"},3.16,3.16,3.16,0.86,0.15,3.74,3.46,5.36,0.05,-2.12,1.73,2.23,3.76,1.98,{"v":-1,"d":"-1.00"},-0.27,1.25,{"v":3.3,"d":"3.30"},2.85,3.76,3.82,1.98,{"v":-1,"d":"-1.00"},0.86,{"v":-1,"d":"-1.00"},{"v":-1,"d":"-1.00"},-0.75,0.59,-1.17,-2.12,0.86,0.86,0.86,-0.85,0.13,-3.35,0.68,-3.35,4.22,2.53,2.53,-2.29,0.19,-2.29,1.94,-6.95,3.46,{"v":0.9,"d":"0.90"},{"v":0.9,"d":"0.90"},0.16,0.16,0.16,0.16,2.18,2.26,2.18,0.16,4.89,4.85,1.83,-2.29,-2.29,{"v":-7.6,"d":"-7.60"},1.83,{"v":-1,"d":"-1.00"},0.68,1.83,1.83,1.62,{"v":2.3,"d":"2.30"},-2.95,-2.95,{"v":0,"d":"0.00"},1.94,2.85,2.65,{"v":-0.3,"d":"-0.30"},-0.32,1.81,{"v":-1,"d":"-1.00"},3.82,-0.42,1.81,-0.71,2.47,1.47,1.09,2.95,2.85,2.17,-2.55,0.27,null,-0.42,-0.16,2.18,{"v":-0.3,"d":"-0.30"},null,2.33,1.47,1.81,0.27,1.35,{"v":3.3,"d":"3.30"},{"v":3.3,"d":"3.30"},6.29,1.09,1.06,{"v":-2,"d":"-2.00"},1.31,0.48,0.02,1.98,0.26,-0.85,{"v":0.5,"d":"0.50"},-1.11,-1.62,1.06,2.45,{"v":0.9,"d":"0.90"},{"v":2.5,"d":"2.50"},3.18,{"v":-0.3,"d":"-0.30"},1.87,3.38,{"v":0,"d":"0.00"},1.73,3.98,-1.35,-3.14,4.22,{"v":1,"d":"1.00"},1.41,1.41,{"v":3.2,"d":"3.20"},3.23,3.53,{"v":2.3,"d":"2.30"},1.03,2.29,5.29,2.57,{"v":2,"d":"2.00"},1.71,1.02,1.02,3.18,2.95,{"v":-0.1,"d":"-0.10"},5.46,2.63,2.26,null,null,0.48,2.48,-0.18,1.73,2.53,0.86,-2.12,2.85,3.18,{"v":0,"d":"0.00"},-0.02,2.29,3.76,0.02,{"v":-1.1,"d":"-1.10"},-1.11,-0.75,3.38,1.94,null,0.59,0.52,{"v":3.3,"d":"3.30"},2.33,0.86,-0.49,1.06,-0.49,0.26,-6.95,-6.95,1.03,5.46,1.18,1.64,2.25,null,0.57,-1.09,2.56,null,-6.95,-0.32,0.52,1.83,-2.12,4.58,4.58,4.58,4.58,0.03,-0.32,0.72,2.85,1.01,0.86,0.61,0.61,6.76,3.87,1.98,5.42,{"v":3.9,"d":"3.90"},-0.13,3.76,3.76,0.48,{"v":5.4,"d":"5.40"},0.16,null,-0.82,2.18,0.27,{"v":1.5,"d":"1.50"},-2.66,2.45,3.02,0.99,1.01,{"v":1.3,"d":"1.30"},0.58,0.86,1.99,{"v":-0.1,"d":"-0.10"},1.51,-3.35,-3.35,1.58,{"v":-4,"d":"-4.00"},-1.67,1.83,null,{"v":2.5,"d":"2.50"},1.59,1.99,"6.21",3.87,0.15,3.44,-0.71,3.79,1.08,{"v":0,"d":"0.00"},-1.67,{"v":2.2,"d":"2.20"},-0.02,5.46,1.06,2.03,2.03,0.15,-0.75,2.69,2.45,0.61,4.58,{"v":0,"d":"0.00"},-0.13,{"v":-1,"d":"-1.00"},1.22,{"v":-1,"d":"-1.00"},2.45,0.89,-0.75,1.71,-1.35,4.85,3.13,1.06,-0.85,2.69,{"v":0,"d":"0.00"},0.72,2.69,2.69,-0.56,-1.05,1.71,2.32,2.03,{"v":2.2,"d":"2.20"},1.18,-1.65,1.94,1.94,{"v":2.2,"d":"2.20"},3.02,2.57,2.18,{"v":2.4,"d":"2.40"},{"v":2.4,"d":"2.40"},{"v":3.3,"d":"3.30"},1.72,2.57,null,0.49,2.29,null,{"v":0,"d":"0.00"},3.79,2.85,null,3.25,3.25,3.25,1.51,-0.82,{"v":0,"d":"0.00"},0.02,0.15,{"v":2.4,"d":"2.40"},3.76,-6.95,-0.16,2.85,-1.17,-0.86,5.42,3.87,2.47,2.03,2.85,2.57,1.81,{"v":0,"d":"0.00"},1.59,0.26,1.97,0.38,{"v":-1,"d":"-1.00"},0.26,2.97,-0.11,3.16,-6.95,1.06,0.49,-0.32,{"v":-1,"d":"-1.00"},1.56,-1.62,{"v":-1,"d":"-1.00"},3.34,4.14,1.35,2.57,{"v":0,"d":"0.00"},1.33,0.05,-0.01,-2.55,{"v":-1.2,"d":"-1.20"},2.17,1.03,-0.27,null,2.22,3.87,1.49,0.02,0.19,-1.65,3.74,"6.23",0.02,-0.69,"-0.07",2.47,0.13,4.22,{"v":2.7,"d":"2.70"},4.22,{"v":3.3,"d":"3.30"},{"v":3.3,"d":"3.30"},{"v":3.3,"d":"3.30"},{"v":3.3,"d":"3.30"},{"v":3.1,"d":"3.10"},{"v":3.3,"d":"3.30"},2.65,2.65,{"v":0.9,"d":"0.90"},-0.27,4.12,null,0.59,0.47,1.98,-0.18,0.59,-0.51,-0.86,1.51,1.51,null,2.47,-0.18,{"v":-0.1,"d":"-0.10"},2.18,6.29,-0.29,-0.11,{"v":1,"d":"1.00"},{"v":0,"d":"0.00"},1.94,{"v":1.3,"d":"1.30"},1.81,1.94,0.02,6.76,1.56,2.72,0.15,2.45,-2.29,{"v":-7.6,"d":"-7.60"},2.45,{"v":1,"d":"1.00"},1.22,0.01,2.45,{"v":-1,"d":"-1.00"},3.76,0.02,1.21,{"v":2.4,"d":"2.40"},1.97,4.12,-0.49,-0.49,-0.49,0.58,-0.92,2.62,{"v":-0.3,"d":"-0.30"},null,{"v":-1.2,"d":"-1.20"},3.79,{"v":0,"d":"0.00"},{"v":0.9,"d":"0.90"},4.22,-0.69,0.02,0.01,-0.02,2.25,2.57,1.94,1.49,2.02,4.12,{"v":2.2,"d":"2.20"},3.53,5.29,null,3.22,"6.24",3.76,5.42,{"v":0.9,"d":"0.90"},-2.66,{"v":3.1,"d":"3.10"},3.46,5.46,2.66,{"v":0,"d":"0.00"},-1.11,-0.51,2.45,2.45,null,-2.66,2.45,3.25,1.51,null,-0.02,"6.16",null,3.92,1.35,-2.55,0.48,0.48,4.12,4.12,1.41,0.48,1.37,-0.32,{"v":-0.5,"d":"-0.50"},1.18,1.58,2.85,{"v":3.3,"d":"3.30"},0.03,-2.66,-2.66,-0.29,5.29,2.85,2.85,1.72,2.85,5.46,2.53,1.94,-0.82,3.22,2.57,4.77,1.25,2.19,2.19,1.47,1.81,1.64,-0.05,1.94,{"v":1.1,"d":"1.10"},3.42,-0.27,1.51,-0.56,{"v":-0.5,"d":"-0.50"},0.01,-6.95,4.58,-0.48,-0.08,{"v":-0.5,"d":"-0.50"},3.34,5.29,1.99,0.86,{"v":-0.3,"d":"-0.30"},3.34,3.89,null,2.65,0.96,{"v":-0.3,"d":"-0.30"},1.81,0.96,-0.05,0.13,5.29,2.09,null,5.29,{"v":2.7,"d":"2.70"},null,-0.49,1.06,{"v":-0.9,"d":"-0.90"},-0.32,3.16,2.57,2.65,{"v":3.1,"d":"3.10"},3.23,{"v":3.1,"d":"3.10"},null,2.63,-1.05,{"v":0.5,"d":"0.50"},0.26,0.15,5.29,0.01,2.01,0.01,null,{"v":2.3,"d":"2.30"},-0.05,{"v":3.2,"d":"3.20"},2.22,2.65,0.55,{"v":3.9,"d":"3.90"},{"v":2.4,"d":"2.40"},0.86,0.86,1.41,5.29,0.38,0.71]
["Potencial de contaminação (1, 2 ou 3)",null,1,3,3,3,2,1,2,2,2,1,3,null,3,1,3,2,3,3,3,1,3,3,2,2,2,3,2,3,3,1,2,3,2,2,1,2,2,1,1,3,3,1,3,2,1,3,3,1,2,1,3,1,1,3,3,3,3,3,3,1,3,3,3,3,1,3,1,3,3,3,1,1,3,2,3,3,null,null,2,3,3,2,2,1,2,3,2,3,2,3,2,1,1,2,2,null,3,2,3,2,2,1,null,3,2,1,1,3,2,2,3,3,3,3,1,null,3,2,3,1,3,3,2,1,3,3,3,1,1,1,2,2,3,3,3,3,3,1,3,1,null,null,2,null,3,2,3,2,1,1,1,2,1,1,3,2,3,3,1,2,2,2,3,2,2,3,3,2,3,1,3,2,1,2,1,1,3,3,3,3,1,3,3,2,3,2,2,2,3,2,2,1,1,2,3,2,2,3,2,1,1,1,1,1,2,1,2,1,1,1,2,1,1,2,1,2,3,3,2,1,2,3,2,2,3,3,1,1,1,1,3,3,3,1,1,1,2,2,2,2,2,1,2,2,2,1,2,1,1,1,2,2,3,2,3,3,1,3,1,3,1,3,3,3,2,2,3,2,1,null,1,1,3,2,null,2,2,2,1,1,3,3,1,3,1,2,2,1,1,3,3,2,3,1,1,1,3,3,3,3,1,3,2,1,2,2,2,2,3,2,2,2,3,3,1,3,3,3,3,2,2,1,1,1,3,2,1,3,2,3,3,3,1,2,1,2,3,1,2,2,3,1,1,2,2,2,2,1,1,2,2,3,1,2,3,2,1,1,1,1,1,2,2,3,3,2,1,2,3,3,1,3,null,2,2,2,2,2,2,2,2,2,3,3,3,2,1,1,2,2,2,2,2,3,1,2,2,2,1,3,1,null,3,3,3,3,2,3,3,1,1,3,1,1,3,1,3,1,1,3,3,2,2,null,3,1,3,3,2,3,1,1,2,2,1,2,3,1,3,1,3,3,3,1,2,3,2,2,1,2,1,3,1,3,3,1,1,2,1,2,3,2,2,1,3,2,2,2,2,1,3,3,3,3,1,2,2,3,3,2,3,1,1,3,3,3,null,3,3,null,1,2,2,null,2,2,2,3,3,1,2,3,1,2,2,1,2,1,3,3,2,3,3,2,2,2,1,1,3,3,3,1,1,2,1,3,2,1,3,2,1,2,1,1,2,3,1,3,1,3,3,1,2,3,3,3,1,3,1,2,1,1,1,1,3,3,2,1,1,3,2,2,3,3,3,3,3,3,3,3,3,3,3,1,2,null,2,3,3,1,1,1,3,3,3,3,3,1,1,3,1,1,1,2,1,3,3,2,2,1,2,2,2,3,3,2,2,3,2,3,1,3,1,2,2,3,1,3,2,1,1,1,1,3,3,2,null,3,2,1,3,3,1,1,1,1,2,2,2,1,2,2,1,1,3,null,2,3,2,3,3,2,3,2,3,3,1,1,1,3,3,3,2,3,2,3,null,1,3,null,1,1,2,1,1,2,2,2,1,2,3,1,3,3,2,3,3,2,2,1,3,2,2,3,2,3,3,3,3,2,2,3,2,3,3,2,3,1,2,3,3,3,1,3,1,1,1,2,2,1,3,1,3,3,2,1,2,2,1,3,3,2,1,3,2,2,2,3,2,null,3,3,null,1,3,2,3,3,2,3,3,3,3,3,2,2,3,3,3,3,1,1,1,null,2,2,3,1,3,1,1,1,1,1,2,3,3,1]
["EIQ Ingrediente ativo",null,"2,4-D dimethylamine","Epoxiconazol ","Abamectim","Abamectim","Nicossulfurom  ","Metsulfurom-metílico ","Acefato","Acefato","Acefato","Acetamiprido ","Acetocloro","Acibenzolar-S-metílico ","Acifluorfem-sódico ","Lactofem ","Acrinatrina","Piraclostrobina","Tiametoxam","Tiencarbazona","Linurom ","Carfentrazona-etílica","Afidopiropeno ","Azoxistrobina ","MCPA ","Alacloro","Alacloro","Benzovindiflupir","Cipermetrina","Fosetil","Indaziflam","Sulfometuron metílico","Clorantraniliprole ","Ciproconazol","Metaflumizone ","Cipermetrina","Ametoctradina","Ametrina","Ametrina","Amicarbazona","2,4-D dimethylamine","Aminopiralide","Azoxistrobina ","Amitraz ","Abamectim","Imazamoxi ","Tiram ","Propinebe ","Teflubenzurom ","Buprofezina","Fluazinam","Picoxistrobina","Ciproconazol","Metalaxil-M ","Lufenuron ","Tepraloxidim ","Tricopir-butolítico","Fluroxipir","Ciproconazol","Asulam ","Asulam ","Clorfuazurom","Fluquinconazol","Epoxiconazol ","Atrazina","Atrazina","Simazina","Atrazina","Iprodiona","Propiconazol ","Hidróxido de cobre","Profoxidim ","Carfentrazona-etílica","Acetamiprido ","Tebutiurom","Acefato","Indoxacarb","Abamectim","Azadiractina ","Azadiractina ","Azimsulfurom ","Azoxistrobina ","Azoxistrobina ","Imidacloprido ","Bentazona","Dazomete ","Triadimenol  ","Metomil","Flubendiamida","mefentrifluconazol","Benalaxil ","Carbendazim","Ciantraniliprole","Benfuracarb","Benfuracarb","Bentazona","Bentiavalicarbe isopropílico ","Benzoato de emamectina","Benzovindiflupir","Beta-ciflutrina ","Bicarbonato de potássio","Bifentrina","Bifentrina","Triciclazol","Acibenzolar-S-metílico ","Bispirabaque","Bifentrina","Bistrifluron","Piriproxifem ","Acifluorfem-sódico ","Dibrometo de diquate ","Fenpropatrina","Sulfentrazona  ","Boscalid","Boscalid","Metomil","Bromacila","Brometo de metila","Bromuconazol","Beta-ciflutrina ","Metam-sódico ","Buprofezina","Tebutiurom","Cadusafós ","Mesotriona","Sulfato de cobre","Tiacloprido","Picloram","Boscalid","Captana","Captana","Tiodicarbe","Bifentrina","Carbaryl ","Carbendazim","Carbendazim","Flonicamida","Carbendazim","Carbossulfano ","Carboxina ","Fomesafem","Carfentrazona-etílica","Cartape","Cartape","Flufenoxurom","Casugamicina","Clorpirifós","Acefato","Flutriafol ","Fenamidona","Cletodim","Tiofanato-metílico","Clorotalonil","Triflumurom","Iprodiona","Tolfenpirade","Pimetrozina","Ciantraniliprole","Ciazofamida ","Ciclaniliprole","Ciclossulfamurom","Fostiazato","Imidacloprido ","Fluazinam","Cimoxanil","Cipermetrina","Cipermetrina","Ciproconazol","ciprodinil","Ciromazina  ","Clorimurom-etílico","Cletodim","Clodinafope-Propargil ","Clomazona","Cloransulam-metílico","Clorantraniliprole ","Clorfenapir","Clorfuazurom","Cloridrato de propamocarbe ","Clorimurom-etílico","Clorimurom-etílico","Clorimurom-etílico","Clorotalonil","Clorpirifós","Clotianidina","Diclosulam ","Tebutiurom","Piraclostrobina","Cipermetrina","Fluazinam","Bromuconazol","Imidacloprido ","Imazapir","Mancozebe","Piriproxifem ","Terbufós ","Atrazina","Tebucozanol","Imidacloprido ","Tiametoxam","Imazapir","Oxicloreto de cobre","Clorotalonil","Mancozebe","Mancozebe","Lufenuron ","Profenofós","Cyflumetofen ","Cipermetrina","Clorotalonil","Clorotalonil","Clorotalonil","Fenpropatrina","Dazomete ","Deltametrina","Ditianona","Deltametrina","Clorantraniliprole ","Carbendazim","Carbendazim","Dibrometo de diquate ","Diafenturiom","Dibrometo de diquate ","Dicamba","Dicloreto de Paraquate","Diclosulam ","Difenoconazol","Difenoconazol","Diflubenzurom ","Diflubenzurom ","Diflubenzurom ","Diflubenzurom ","Dimetoato ","Dimetomorfe","Dimetoato ","Diflubenzurom ","Amicarbazona","Dinofeturam","Diurom ","Dibrometo de diquate ","Dibrometo de diquate ","Diquate","Diurom ","Mancozebe","Ditianona","Diurom ","Diurom ","2,4-D dimethylamine","Bentazona","Dodina ","Dodina ","Lactofem ","Metolacloro","Tebucozanol","Azoxistrobina ","Etofenproxi","Hidróxido de cobre","Tetraconazol","Mancozebe","Tiametoxam","Espirodiclofeno","Trifloxisulfuron","Enxofre","Epoxiconazol ","Cimoxanil","Famoxadona","Foransulfurom","Tebucozanol","Pirimetanil","Esfenvalerato","Espinetoram ","Espinosade ","Espirodiclofeno","Espiromesifeno","Indaziflam","Etofenproxi","Etoxazol","Etoxissulfurom","Etridiazol","Acefato","Espinetoram ","Sulfoxaflor","Atrazina","Atrazina","Quincloraque ","Famoxadona","Glufosinato de amônio","Cipermetrina","Fenamidona","Fenitrotiona","Fenoxaprop-P-ethyl ","Fenpirazamina","Fenpiroximato ","Fenpropatrina","Fenpropimorfe","Gama-Cialotrina ","Permetrina","Glufosinato de amônio","Fipronil ","Difenoconazol","Flazassulfurom","Fomesafem","Trifloxistrobina","Flonicamida","Florpirauxifen-benzil","Fluazifope-p-butil ","Fluazinam","Flubendiamida","Fludioxonil","Flufenoxurom","Flumetsulam","Flumicloraque-pentílico ","Flumioxazina","Flumioxazina","Fluopicolide","Fluopiram","Flupiradifurona ","Fluquinconazol","Fluroxipir","Flutolanil","Flutriafol ","Fluxapiroxade  ","Tebucozanol","Metalaxil-M ","Folpete","Folpete","Fomesafem","Foransulfurom","Isoxaflutol ","Tebutiurom","Ciantraniliprole","Dimetomorfe","Fosetil","Fosfeto de alúminio","Fosmete","Fostiazato","Protioconazol ","Fluazinam","Carbendazim","Clorotalonil","Cipermetrina","Tebucozanol","Fomesafem","Fluazifope-p-butil ","Tiodicarbe","Benalaxil ","Imidacloprido ","Novalurom ","Gama-cialotrina ","Gama-Cialotrina ","Lufenuron ","Florpirauxifen-benzil","Metolacloro","Fosfeto de alúminio","Prometrina ","Ametrina","Atrazina","Etoxissulfurom","Clorotalonil","glifosato","Glufosinato de amônio","glifosato","Oxyfluorfem ","Dicloreto de Paraquate","Dicloreto de Paraquate","Pirimifós-metílico","Tebutiurom","Azimsulfurom ","Halauxifen-metíl","Halossulfurom-metílico ","Haloxifope-P-metílico","Ciazofamida ","Bistrifluron","Ciclaniliprole","Saflufenacil","Dicloreto de Paraquate","Pendimetalina","Ametrina","Diurom ","Cipermetrina","Hexazinona","Hexazinona","Hexazinona","Hexazinona","Hexitiazox","Hidróxido de cobre","Hidróxido de Fentina","Tebucozanol","Iodossulfurom-metílico-sódico","Clorotalonil","Imazalil ","Imazalil ","Imazamoxi ","Imazapique  ","Imazapir","Imazaquim","Imazetapir","Imibenconazol ","Imidacloprido ","Imidacloprido ","Fosmete","Flutriafol ","Diflubenzurom ","Impirfluxam","Teflubenzurom ","Indaziflam","Indoxacarb","Cloridrato de propamocarbe ","Bifentrina","Fipronil ","Metoxifenozida ","Ciclossulfamurom","Iodossulfurom-metílico-sódico","Ipconazol","Iprodiona","Clorotalonil","Isofetamida","Isoxaflutol ","Propiconazol ","Deltametrina","Deltametrina","Acetocloro","Bicarbonato de potássio","Lambda-Cialotrina ","Diurom ","Casugamicina","Flazassulfurom","Orthosulfamuron","Isofetamida","Sulfentrazona  ","Imazapique  ","Clorpirifós","Bromacila","Enxofre","Nicossulfurom  ","Alacloro","Lactofem ","Lambda-Cialotrina ","Metomil","Tiodicarbe","Tebutiurom","Glufosinato de amônio","Linurom ","Linurom ","Clorpirifós","Lufenuron ","Mesotriona","Fipronil ","Imazalil ","Hexazinona","Malation","Imibenconazol ","Mancozebe","mandipropamida","Mancozebe","Fipronil ","Carbossulfano ","Lufenuron ","Metalaxil-M ","Fludioxonil","Dinofeturam","MCPA ","mefentrifluconazol","Fenpropatrina","Mesotriona","Captana","Hidróxido de Fentina","Mesotriona","Mesotriona","Metaflumizone ","Metaflumizone ","Metalaxil-M ","Metam-sódico ","Metconazol ","Metomil","Metidationa ","Metiram","Metolacloro","Metolacloro","Metomil","Metoxifenozida ","Metribuzim ","Indaziflam","Metsulfurom-metílico ","Metsulfurom-metílico ","Miclobutanil ","Tebufenozida","pidiflumetofen","Sulfluramida ","Pencicurom ","Flutolanil","MSMA ","Lactofem ","Nicossulfurom  ","Tebucozanol","Espinosade ","Nicossulfurom  ","Nicossulfurom  ","Nicossulfurom  ","Propiconazol ","Teflubenzurom ","Malation","Novalurom ","Clorpirifós","Metsulfurom-metílico ","Imidacloprido ","Dicloreto de Paraquate","Espiromesifeno","Tebucozanol","Cyflumetofen ","Propargito ","Imazaquim","Imazapique  ","Epoxiconazol ","Metconazol ","Tebucozanol","Fluxapiroxade  ","Acefato","Captana","Orthosulfamuron","Fenpiroximato ","Oxadiazona ","Oxatiapiprolina","Oxicloreto de cobre","Oxyfluorfem ","Cloransulam-metílico ","Quizalofope-P-tefurílico","Clorimurom-etílico","Dicloreto de Paraquate","Glufosinato de amônio","Pencicurom ","Pendimetalina","Mancozebe","Penoxsulam","Permetrina","Mancozebe","Triadimenol  ","Picloram","Picoxistrobina","pidiflumetofen","Fluazifope-p-butil ","Pimetrozina","Piraclostrobina","Clorfenapir","Esfenvalerato","Piridabem ","Pirimetanil","Pirimifós-metílico","Piriproxifem ","Piritiobaque-sódico","Piroxassulfona","Imazapique  ","Setoxidim ","Fenoxaprop-P-ethyl ","Diafenturiom","Metiram","Clotianidina","Sulfentrazona  ","Novalurom ","Cletodim","Benfuracarb","Epoxiconazol ","Trifluralina","Clorantraniliprole ","Triticonazol ","Flumetsulam","Atrazina","Atrazina","Atrazina","Atrazina","Ciproconazol","Atrazina","Azoxistrobina ","Azoxistrobina ","Difenoconazol","Piriproxifem ","Procimidona","Benzoato de emamectina","Profenofós","Profoxidim ","Fenpirazamina","Protioconazol ","Prometrina ","Propanil","Propargito ","Propiconazol ","Propiconazol ","Propinebe ","Epoxiconazol ","Protioconazol ","Isoxaflutol ","Indaziflam","Quincloraque ","Quizalofop-P-ethyl ","Quizalofope-P-tefurílico","Flumicloraque-pentílico ","Carfentrazona-etílica","Dicamba","Ipconazol","Acefato","Metolacloro","Fenoxaprop-P-ethyl ","Imazamoxi ","Penoxsulam","Clomazona","Clorpirifós","Fipronil ","Dibrometo de diquate ","Diquate","Fipronil ","Flumicloraque-pentílico ","mandipropamida","Tiram ","Fipronil ","Mancozebe","Imidacloprido ","Novalurom ","Bispirabaque","Metsulfurom-metílico ","Oxadiazona ","Procimidona","glifosato","glifosato","glifosato","Iprodiona","Acrinatrina","Cadusafós ","Etofenproxi","Saflufenacil","Piridabem ","Nicossulfurom  ","Carfentrazona-etílica","Difenoconazol","Flumetsulam","Cletodim","Fenoxaprop-P-ethyl ","Tiram ","Tiodicarbe","Halossulfurom-metílico ","Metribuzim ","Metolacloro","Setoxidim ","Carbaryl ","Procimidona","Simazina","Flupiradifurona ","Flutriafol","Etoxazol","Tembotriona","Sulfentrazona  ","Imidacloprido ","Imazaquim","Difenoconazol","Bifentrina","Ciproconazol","Diclosulam ","Tebutiurom","Boscalid","Carfentrazona-etílica","Gama-Cialotrina ","Propanil","Fipronil ","Fipronil ","Piritiobaque-sódico","Bifentrina","Fipronil ","Nicossulfurom  ","Propiconazol ","Impirfluxam","Sulfato de cobre","Sulfentrazona  ","Sulfluramida ","Sulfometuron metílico","Sulfoxaflor","Esfenvalerato","Fenitrotiona","Fenitrotiona","Procimidona","Procimidona","Flumioxazina","Fenitrotiona","Flumioxazina","Hidróxido de cobre","Tiofanato-metílico","Metidationa ","Acetocloro","Tebucozanol","Miclobutanil ","Hexitiazox","Bifentrina","Bifentrina","Quizalofop-P-ethyl ","Flutriafol","Tebucozanol","Tebucozanol","Tebufenozida","Tebucozanol","Tebutiurom","Carbendazim","Tiabendazol","Teflubenzurom ","Tembotriona","Metribuzim ","Tepraloxidim ","Terbufós ","Terbutilazina","Terbutilazina","Etridiazol","Tetraconazol","Halauxifen-metíl","Triflumurom","Tiabendazol","Tiacloprido","Tiencarbazona","Piriproxifem ","Propiconazol ","Tiodicarbe","Tiofanato-metílico","Tiram ","Dicloreto de Paraquate","Hexazinona","Tolfenpirade","Clodinafope-Propargil ","Tiofanato-metílico","Aminopiralide","Flutriafol","Bentiavalicarbe isopropílico ","Clorotalonil","Etofenproxi","Triadimenol  ","Triciclazol","Tricopir-butolítico","Azoxistrobina ","Triflumizol","Trifloxistrobina","Trifloxisulfuron","Triflumizol","Triflumurom","Trifluralina","Flutriafol","Ciromazina  ","Trinexapaque-etílico","Flutriafol","Triticonazol ","Trinexapaque-etílico","glifosato","ciprodinil","Beta-ciflutrina ","Hidróxido de cobre","Clorimurom-etílico","Metribuzim ","Azoxistrobina ","Ciproconazol","Fluopiram","Ciproconazol","Haloxifope-P-metílico","Ciantraniliprole","Metaflumizone ","Fenpropimorfe","Abamectim","Clorpirifós","Flutriafol","Tiram ","Carboxina ","Tiram ","MSMA ","Bentazona","Triflumurom","Fluopicolide","Piroxassulfona","Azoxistrobina ","Ametoctradina","Imazetapir","Metsulfurom-metílico ","Clorotalonil","Clorotalonil","Flumioxazina","Flutriafol","Oxatiapiprolina","Zoxamida"]
["EIQ (<25; 25 - 40; >40)",null,{"v":20.67,"d":"20.7"},{"v":24,"d":"24.0"},{"v":34.68,"d":"34.7"},{"v":34.68,"d":"34.7"},19.5,{"v":16.67,"d":"16.7"},{"v":24.88,"d":"24.9"},{"v":24.88,"d":"24.9"},{"v":24.88,"d":"24.9"},{"v":28.73,"d":"28.7"},{"v":19.86,"d":"19.9"},{"v":20.74,"d":"20.7"},{"v":23.57,"d":"23.6"},{"v":26.67,"d":"26.7"},{"v":31.33,"d":"31.3"},{"v":27.01,"d":"27.0"},33.3,{"v":18.67,"d":"18.7"},{"v":19.32,"d":"19.3"},{"v":27.33,"d":"27.3"},{"v":11.17,"d":"11.2"},{"v":26.92,"d":"26.9"},{"v":36.67,"d":"36.7"},{"v":17.86,"d":"17.9"},{"v":17.86,"d":"17.9"},{"v":19.33,"d":"19.3"},36.4,{"v":12,"d":"12.0"},null,{"v":19.87,"d":"19.9"},{"v":18.34,"d":"18.3"},{"v":38,"d":"38.0"},{"v":32.89,"d":"32.9"},{"v":36.35,"d":"36.4"},{"v":16.67,"d":"16.7"},{"v":24.18,"d":"24.2"},{"v":24.18,"d":"24.2"},null,{"v":20.67,"d":"20.7"},{"v":22.67,"d":"22.7"},26.9,{"v":25.17,"d":"25.2"},34.7,{"v":19.52,"d":"19.5"},{"v":29.28,"d":"29.3"},16.9,{"v":23.93,"d":"23.9"},{"v":34.97,"d":"35.0"},23.3,{"v":13.73,"d":"13.7"},{"v":38,"d":"38.0"},{"v":19.07,"d":"19.1"},{"v":16.29,"d":"16.3"},21.9,{"v":11,"d":"11.0"},{"v":36.67,"d":"36.7"},{"v":38,"d":"38.0"},{"v":18.67,"d":"18.7"},{"v":18.67,"d":"18.7"},{"v":30.31,"d":"30.3"},null,{"v":24,"d":"24.0"},{"v":22.85,"d":"22.9"},{"v":22.85,"d":"22.9"},{"v":21.52,"d":"21.5"},22.9,{"v":24.25,"d":"24.3"},{"v":31.63,"d":"31.6"},33.2,null,27.3,{"v":28.73,"d":"28.7"},23.4,24.9,{"v":31.19,"d":"31.2"},34.7,12.1,12.1,{"v":14.67,"d":"14.7"},{"v":26.92,"d":"26.9"},{"v":26.92,"d":"26.9"},36.7,{"v":18.67,"d":"18.7"},{"v":13.17,"d":"13.2"},24.8,{"v":22,"d":"22.0"},{"v":19.36,"d":"19.4"},{"v":25.33,"d":"25.3"},{"v":16,"d":"16.0"},50.5,{"v":14.67,"d":"14.7"},null,null,{"v":18.67,"d":"18.7"},{"v":41.67,"d":"41.7"},{"v":26.28,"d":"26.3"},{"v":19.33,"d":"19.3"},31.6,{"v":8,"d":"8.0"},{"v":44.35,"d":"44.4"},{"v":44.35,"d":"44.4"},null,{"v":20.74,"d":"20.7"},{"v":11.47,"d":"11.5"},{"v":44.35,"d":"44.4"},{"v":32.84,"d":"32.8"},{"v":14.67,"d":"14.7"},{"v":23.57,"d":"23.6"},39.2,{"v":25.33,"d":"25.3"},{"v":11.73,"d":"11.7"},26.4,26.4,{"v":22,"d":"22.0"},{"v":12.63,"d":"12.6"},{"v":53.57,"d":"53.6"},{"v":24.31,"d":"24.3"},{"v":31.57,"d":"31.6"},{"v":26.59,"d":"26.6"},{"v":34.97,"d":"35.0"},23.4,82.5,18.7,61.9,{"v":31.33,"d":"31.3"},{"v":18,"d":"18.0"},{"v":26.44,"d":"26.4"},15.8,{"v":15.77,"d":"15.8"},23.3,{"v":44.35,"d":"44.4"},{"v":22.73,"d":"22.7"},50.5,50.5,{"v":8.67,"d":"8.7"},50.5,{"v":47.33,"d":"47.3"},{"v":18.71,"d":"18.7"},24.5,27.3,{"v":47.17,"d":"47.2"},{"v":47.17,"d":"47.2"},{"v":27.87,"d":"27.9"},{"v":26.67,"d":"26.7"},26.9,24.9,25.7,{"v":18.29,"d":"18.3"},{"v":17,"d":"17.0"},23.8,37.4,34.5,24.3,{"v":27.33,"d":"27.3"},{"v":19.57,"d":"19.6"},14.7,{"v":15.33,"d":"15.3"},{"v":67.33,"d":"67.3"},null,{"v":17.04,"d":"17.0"},36.7,23.3,{"v":35.48,"d":"35.5"},{"v":36.35,"d":"36.4"},36.4,{"v":38,"d":"38.0"},{"v":26.77,"d":"26.8"},{"v":18.29,"d":"18.3"},19.2,{"v":17,"d":"17.0"},{"v":25.33,"d":"25.3"},{"v":19.63,"d":"19.6"},{"v":15.33,"d":"15.3"},18.3,37.5,{"v":30.31,"d":"30.3"},{"v":23.89,"d":"23.9"},19.2,19.2,19.2,37.4,{"v":26.85,"d":"26.9"},{"v":32.06,"d":"32.1"},{"v":9.73,"d":"9.7"},23.4,{"v":27,"d":"27.0"},36.4,23.3,{"v":24.31,"d":"24.3"},36.7,22.3,25.7,14.7,{"v":66,"d":"66.0"},22.9,40.3,36.7,33.3,22.3,29.8,37.4,25.7,25.7,16.3,{"v":59.53,"d":"59.5"},{"v":9.17,"d":"9.2"},36.4,37.4,37.4,37.4,25.3,{"v":13.17,"d":"13.2"},{"v":28.38,"d":"28.4"},{"v":21.37,"d":"21.4"},28.4,18.3,50.5,50.5,39.2,31.9,39.2,{"v":26.33,"d":"26.3"},{"v":24.73,"d":"24.7"},9.7,41.5,41.5,25.3,25.3,25.3,25.3,{"v":33.49,"d":"33.5"},{"v":24.01,"d":"24.0"},{"v":33.49,"d":"33.5"},25.3,null,{"v":22.26,"d":"22.3"},26.5,39.2,39.2,{"v":44,"d":"44.0"},26.5,25.7,{"v":21.37,"d":"21.4"},26.5,26.5,{"v":20.67,"d":"20.7"},18.7,{"v":23.45,"d":"23.5"},{"v":23.45,"d":"23.5"},{"v":26.67,"d":"26.7"},{"v":22,"d":"22.0"},40.3,26.9,{"v":27.67,"d":"27.7"},33.2,{"v":29,"d":"29.0"},25.7,33.3,{"v":17.18,"d":"17.2"},{"v":15.33,"d":"15.3"},{"v":32.66,"d":"32.7"},{"v":24,"d":"24.0"},{"v":35.48,"d":"35.5"},{"v":10.36,"d":"10.4"},{"v":15.33,"d":"15.3"},40.3,{"v":12.67,"d":"12.7"},{"v":39.57,"d":"39.6"},{"v":27.78,"d":"27.8"},{"v":14.38,"d":"14.4"},{"v":17.18,"d":"17.2"},{"v":27.93,"d":"27.9"},null,{"v":27.67,"d":"27.7"},{"v":13.42,"d":"13.4"},{"v":12.67,"d":"12.7"},{"v":34.86,"d":"34.9"},24.9,{"v":27.78,"d":"27.8"},{"v":18.83,"d":"18.8"},22.9,22.9,{"v":32.07,"d":"32.1"},{"v":10.36,"d":"10.4"},20.2,36.4,{"v":18.29,"d":"18.3"},null,43.7,{"v":10,"d":"10.0"},{"v":19.33,"d":"19.3"},25.3,null,{"v":44.05,"d":"44.1"},{"v":29.33,"d":"29.3"},20.2,88.3,41.5,{"v":18.53,"d":"18.5"},24.5,{"v":29.78,"d":"29.8"},{"v":8.67,"d":"8.7"},null,{"v":28.71,"d":"28.7"},23.3,{"v":19.36,"d":"19.4"},{"v":23.87,"d":"23.9"},{"v":27.87,"d":"27.9"},15.6,{"v":25.13,"d":"25.1"},{"v":23.97,"d":"24.0"},{"v":23.97,"d":"24.0"},{"v":26,"d":"26.0"},{"v":17.83,"d":"17.8"},{"v":28.67,"d":"28.7"},null,{"v":36.67,"d":"36.7"},{"v":23.07,"d":"23.1"},25.7,{"v":21.33,"d":"21.3"},40.3,19.1,{"v":31.73,"d":"31.7"},{"v":31.73,"d":"31.7"},{"v":24.46,"d":"24.5"},{"v":15.33,"d":"15.3"},{"v":24,"d":"24.0"},23.4,14.7,{"v":24.01,"d":"24.0"},{"v":12,"d":"12.0"},null,{"v":32.82,"d":"32.8"},{"v":17.04,"d":"17.0"},13.5,23.3,50.5,37.4,36.4,40.3,24.5,{"v":28.71,"d":"28.7"},23.3,{"v":16,"d":"16.0"},36.7,{"v":14.33,"d":"14.3"},{"v":44.05,"d":"44.1"},44.1,16.3,null,{"v":22,"d":"22.0"},null,{"v":15.37,"d":"15.4"},24.2,22.9,{"v":12.67,"d":"12.7"},37.4,{"v":15.33,"d":"15.3"},20.2,{"v":15.33,"d":"15.3"},33.8,{"v":24.73,"d":"24.7"},24.7,null,23.4,{"v":14.67,"d":"14.7"},null,20.2,{"v":30.33,"d":"30.3"},{"v":15.33,"d":"15.3"},{"v":32.84,"d":"32.8"},{"v":67.33,"d":"67.3"},{"v":22.29,"d":"22.3"},24.7,{"v":30.17,"d":"30.2"},24.2,26.5,{"v":36.35,"d":"36.4"},{"v":18,"d":"18.0"},{"v":18,"d":"18.0"},{"v":18,"d":"18.0"},{"v":18,"d":"18.0"},{"v":33,"d":"33.0"},33.2,null,40.3,{"v":15.33,"d":"15.3"},37.4,{"v":24.57,"d":"24.6"},{"v":24.57,"d":"24.6"},{"v":19.52,"d":"19.5"},21.2,22.3,{"v":15.33,"d":"15.3"},{"v":19.57,"d":"19.6"},null,36.7,36.7,{"v":32.82,"d":"32.8"},25.7,25.3,null,23.9,null,{"v":31.19,"d":"31.2"},{"v":23.89,"d":"23.9"},{"v":44.35,"d":"44.4"},88.3,32.1,null,{"v":15.33,"d":"15.3"},31.1,24.3,37.4,{"v":17.83,"d":"17.8"},{"v":24,"d":"24.0"},31.6,28.4,28.4,19.9,{"v":8,"d":"8.0"},44.2,26.5,{"v":26.67,"d":"26.7"},{"v":18.53,"d":"18.5"},null,{"v":17.83,"d":"17.8"},11.7,21.2,26.9,{"v":12.63,"d":"12.6"},{"v":32.66,"d":"32.7"},{"v":19.52,"d":"19.5"},17.9,26.7,44.2,{"v":22,"d":"22.0"},23.3,23.4,20.2,19.3,{"v":19.32,"d":"19.3"},26.9,16.3,18.7,88.3,24.6,{"v":18,"d":"18.0"},{"v":23.83,"d":"23.8"},null,25.7,{"v":27.14,"d":"27.1"},25.7,88.3,{"v":47.33,"d":"47.3"},{"v":16.29,"d":"16.3"},19.1,{"v":23.87,"d":"23.9"},{"v":22.26,"d":"22.3"},{"v":36.67,"d":"36.7"},{"v":25.33,"d":"25.3"},25.3,18.7,15.8,null,18.7,{"v":18.67,"d":"18.7"},{"v":32.89,"d":"32.9"},32.9,19.1,{"v":26.59,"d":"26.6"},{"v":24,"d":"24.0"},{"v":22,"d":"22.0"},{"v":32.67,"d":"32.7"},{"v":40.61,"d":"40.6"},{"v":22,"d":"22.0"},{"v":22,"d":"22.0"},{"v":22,"d":"22.0"},32.1,28.4,null,16.7,16.7,{"v":24.01,"d":"24.0"},{"v":16.44,"d":"16.4"},{"v":16,"d":"16.0"},null,{"v":20.04,"d":"20.0"},{"v":23.07,"d":"23.1"},{"v":18,"d":"18.0"},26.7,{"v":19.52,"d":"19.5"},40.3,{"v":14.38,"d":"14.4"},19.5,19.5,19.5,31.6,23.9,{"v":23.83,"d":"23.8"},{"v":14.33,"d":"14.3"},26.9,16.7,36.7,24.7,{"v":27.93,"d":"27.9"},40.3,{"v":9.17,"d":"9.2"},{"v":68.67,"d":"68.7"},15.3,21.2,{"v":24,"d":"24.0"},{"v":24,"d":"24.0"},40.3,{"v":21.33,"d":"21.3"},24.9,15.8,null,{"v":19.33,"d":"19.3"},{"v":44.67,"d":"44.7"},{"v":19.33,"d":"19.3"},29.8,33.8,{"v":15.33,"d":"15.3"},{"v":23.33,"d":"23.3"},19.2,24.7,20.2,{"v":20.04,"d":"20.0"},30.2,25.7,{"v":18.72,"d":"18.7"},{"v":29.33,"d":"29.3"},25.7,24.8,{"v":18,"d":"18.0"},{"v":13.73,"d":"13.7"},{"v":16,"d":"16.0"},28.7,{"v":19.57,"d":"19.6"},{"v":27.01,"d":"27.0"},37.5,{"v":39.57,"d":"39.6"},{"v":31.29,"d":"31.3"},{"v":12.67,"d":"12.7"},null,{"v":14.67,"d":"14.7"},21.7,{"v":12.33,"d":"12.3"},21.2,{"v":20.89,"d":"20.9"},{"v":43.67,"d":"43.7"},31.9,{"v":40.61,"d":"40.6"},{"v":32.06,"d":"32.1"},11.7,14.3,{"v":17,"d":"17.0"},null,{"v":24,"d":"24.0"},18.8,18.3,{"v":11.73,"d":"11.7"},{"v":15.61,"d":"15.6"},22.9,22.9,22.9,22.9,{"v":38,"d":"38.0"},22.9,26.9,26.9,41.5,14.7,22.2,{"v":26.28,"d":"26.3"},{"v":59.53,"d":"59.5"},null,{"v":10,"d":"10.0"},13.5,{"v":15.37,"d":"15.4"},{"v":17.86,"d":"17.9"},{"v":68.67,"d":"68.7"},31.6,31.6,16.9,{"v":24,"d":"24.0"},13.5,{"v":24,"d":"24.0"},null,{"v":32.07,"d":"32.1"},{"v":22.14,"d":"22.1"},{"v":23.33,"d":"23.3"},{"v":25.13,"d":"25.1"},27.3,{"v":26.33,"d":"26.3"},31.1,24.9,{"v":22,"d":"22.0"},43.7,19.5,{"v":18.72,"d":"18.7"},{"v":19.63,"d":"19.6"},26.9,88.3,39.2,{"v":44,"d":"44.0"},88.3,25.1,{"v":27.14,"d":"27.1"},29.3,88.3,25.7,36.7,14.3,{"v":11.47,"d":"11.5"},16.7,{"v":44.67,"d":"44.7"},22.2,15.3,15.3,15.3,24.3,{"v":31.33,"d":"31.3"},82.5,27.7,{"v":22.29,"d":"22.3"},{"v":31.29,"d":"31.3"},19.5,27.3,41.5,15.6,{"v":17,"d":"17.0"},43.7,29.3,23.3,20.2,28.4,{"v":22,"d":"22.0"},{"v":20.89,"d":"20.9"},{"v":22.73,"d":"22.7"},22.2,{"v":21.52,"d":"21.5"},{"v":28.67,"d":"28.7"},25.7,{"v":13.42,"d":"13.4"},{"v":45.78,"d":"45.8"},11.7,36.7,15.3,41.5,{"v":44.35,"d":"44.4"},{"v":38,"d":"38.0"},9.7,23.4,26.4,27.3,44.1,{"v":17.86,"d":"17.9"},88.3,88.3,21.7,{"v":44.35,"d":"44.4"},88.3,19.5,31.6,null,61.9,11.7,null,{"v":19.87,"d":"19.9"},{"v":18.83,"d":"18.8"},39.6,null,null,22.2,22.2,{"v":24,"d":"24.0"},null,{"v":24,"d":"24.0"},33.2,23.8,{"v":32.67,"d":"32.7"},19.9,40.3,{"v":24.01,"d":"24.0"},{"v":33,"d":"33.0"},{"v":44.35,"d":"44.4"},{"v":44.35,"d":"44.4"},{"v":22.14,"d":"22.1"},25.7,40.3,40.3,{"v":16.44,"d":"16.4"},40.3,23.4,50.5,{"v":31.04,"d":"31.0"},23.9,{"v":45.78,"d":"45.8"},28.4,21.9,{"v":66,"d":"66.0"},23.5,23.5,{"v":34.86,"d":"34.9"},{"v":29,"d":"29.0"},null,34.5,{"v":31.04,"d":"31.0"},{"v":31.33,"d":"31.3"},{"v":18.67,"d":"18.7"},14.7,31.6,{"v":23.33,"d":"23.3"},23.8,29.3,24.7,{"v":18,"d":"18.0"},{"v":27.33,"d":"27.3"},{"v":25.33,"d":"25.3"},23.8,{"v":22.67,"d":"22.7"},25.7,{"v":41.67,"d":"41.7"},37.4,27.7,{"v":24.82,"d":"24.8"},null,{"v":11,"d":"11.0"},26.9,{"v":20.42,"d":"20.4"},{"v":29.78,"d":"29.8"},{"v":15.33,"d":"15.3"},{"v":20.42,"d":"20.4"},34.5,{"v":18.83,"d":"18.8"},25.7,{"v":18.29,"d":"18.3"},{"v":19.03,"d":"19.0"},25.7,{"v":11.73,"d":"11.7"},{"v":19.03,"d":"19.0"},15.3,{"v":26.77,"d":"26.8"},31.6,33.2,19.2,28.4,26.9,{"v":38,"d":"38.0"},{"v":17.83,"d":"17.8"},{"v":38,"d":"38.0"},{"v":30.33,"d":"30.3"},14.7,32.9,null,34.7,26.9,25.7,29.3,{"v":18.71,"d":"18.7"},29.3,{"v":18,"d":"18.0"},18.7,34.5,{"v":26,"d":"26.0"},{"v":12.33,"d":"12.3"},26.9,{"v":16.67,"d":"16.7"},{"v":19.57,"d":"19.6"},16.7,37.4,37.4,{"v":24,"d":"24.0"},{"v":25.67,"d":"25.7"},{"v":19.33,"d":"19.3"},{"v":22.37,"d":"22.4"}]
["EIQ Impacto trabalhador rural (<20; 20 - 40; >40)",null,{"v":24,"d":"24.0"},{"v":18,"d":"18.0"},13.8,13.8,{"v":8,"d":"8.0"},{"v":8,"d":"8.0"},{"v":15,"d":"15.0"},{"v":15,"d":"15.0"},{"v":15,"d":"15.0"},6.9,{"v":10.65,"d":"10.7"},6.9,{"v":16,"d":"16.0"},{"v":24,"d":"24.0"},{"v":16,"d":"16.0"},8.1,{"v":10.35,"d":"10.4"},{"v":16,"d":"16.0"},{"v":10.65,"d":"10.7"},{"v":8,"d":"8.0"},{"v":9,"d":"9.0"},8.1,{"v":32,"d":"32.0"},{"v":10.65,"d":"10.7"},{"v":10.65,"d":"10.7"},{"v":6,"d":"6.0"},13.8,{"v":6,"d":"6.0"},null,{"v":8,"d":"8.0"},6.9,20.3,{"v":13.11,"d":"13.1"},13.8,{"v":6,"d":"6.0"},21.3,21.3,null,{"v":24,"d":"24.0"},{"v":8,"d":"8.0"},8.1,{"v":27,"d":"27.0"},13.8,{"v":8,"d":"8.0"},{"v":20.25,"d":"20.3"},{"v":9,"d":"9.0"},6.9,{"v":12,"d":"12.0"},{"v":8,"d":"8.0"},{"v":6,"d":"6.0"},20.3,8.1,6.9,{"v":12,"d":"12.0"},{"v":6,"d":"6.0"},{"v":8,"d":"8.0"},20.3,{"v":16,"d":"16.0"},{"v":16,"d":"16.0"},{"v":13.11,"d":"13.1"},null,{"v":18,"d":"18.0"},{"v":8,"d":"8.0"},{"v":8,"d":"8.0"},{"v":10.65,"d":"10.7"},{"v":8,"d":"8.0"},16.2,{"v":12,"d":"12.0"},24.3,null,{"v":8,"d":"8.0"},6.9,13.3,{"v":15,"d":"15.0"},6.9,13.8,{"v":6,"d":"6.0"},{"v":6,"d":"6.0"},{"v":8,"d":"8.0"},8.1,8.1,6.9,{"v":16,"d":"16.0"},{"v":9,"d":"9.0"},16.2,{"v":6,"d":"6.0"},{"v":10.35,"d":"10.4"},{"v":10,"d":"10.0"},{"v":9,"d":"9.0"},{"v":25,"d":"25.0"},{"v":6,"d":"6.0"},null,null,{"v":16,"d":"16.0"},{"v":32,"d":"32.0"},{"v":9,"d":"9.0"},{"v":6,"d":"6.0"},6.9,{"v":6,"d":"6.0"},13.8,13.8,null,6.9,6.9,13.8,{"v":13.11,"d":"13.1"},{"v":6,"d":"6.0"},{"v":16,"d":"16.0"},{"v":36,"d":"36.0"},{"v":6,"d":"6.0"},{"v":6,"d":"6.0"},12.2,12.2,{"v":6,"d":"6.0"},6.9,{"v":74,"d":"74.0"},8.1,6.9,{"v":24.15,"d":"24.2"},{"v":12,"d":"12.0"},13.3,{"v":60,"d":"60.0"},{"v":16,"d":"16.0"},24.3,{"v":16,"d":"16.0"},{"v":8,"d":"8.0"},{"v":12.15,"d":"12.2"},{"v":12,"d":"12.0"},{"v":12,"d":"12.0"},{"v":18,"d":"18.0"},13.8,{"v":15,"d":"15.0"},{"v":25,"d":"25.0"},{"v":25,"d":"25.0"},{"v":6,"d":"6.0"},{"v":25,"d":"25.0"},6.9,8.1,{"v":32,"d":"32.0"},{"v":8,"d":"8.0"},{"v":39.33,"d":"39.3"},{"v":39.33,"d":"39.3"},{"v":13.11,"d":"13.1"},{"v":8,"d":"8.0"},{"v":6,"d":"6.0"},{"v":15,"d":"15.0"},{"v":12,"d":"12.0"},6.9,{"v":12,"d":"12.0"},16.2,{"v":20,"d":"20.0"},13.1,16.2,{"v":6,"d":"6.0"},{"v":12,"d":"12.0"},{"v":6,"d":"6.0"},{"v":6,"d":"6.0"},{"v":10,"d":"10.0"},null,{"v":10.35,"d":"10.4"},6.9,{"v":8,"d":"8.0"},{"v":21.87,"d":"21.9"},13.8,13.8,20.3,{"v":12.15,"d":"12.2"},6.9,{"v":8,"d":"8.0"},{"v":12,"d":"12.0"},{"v":16,"d":"16.0"},{"v":10.65,"d":"10.7"},{"v":8,"d":"8.0"},6.9,{"v":6,"d":"6.0"},{"v":13.11,"d":"13.1"},{"v":12.15,"d":"12.2"},{"v":8,"d":"8.0"},{"v":8,"d":"8.0"},{"v":8,"d":"8.0"},{"v":20,"d":"20.0"},{"v":6,"d":"6.0"},{"v":10.35,"d":"10.4"},{"v":6,"d":"6.0"},13.3,8.1,13.8,{"v":8,"d":"8.0"},8.1,6.9,{"v":8,"d":"8.0"},20.3,{"v":6,"d":"6.0"},{"v":40,"d":"40.0"},{"v":8,"d":"8.0"},{"v":20,"d":"20.0"},6.9,10.4,{"v":8,"d":"8.0"},8.1,{"v":20,"d":"20.0"},20.3,20.3,6.9,8.1,{"v":9,"d":"9.0"},13.8,{"v":20,"d":"20.0"},{"v":20,"d":"20.0"},{"v":20,"d":"20.0"},{"v":6,"d":"6.0"},{"v":9,"d":"9.0"},{"v":18,"d":"18.0"},{"v":9,"d":"9.0"},{"v":18,"d":"18.0"},6.9,{"v":25,"d":"25.0"},{"v":25,"d":"25.0"},{"v":36,"d":"36.0"},{"v":6,"d":"6.0"},{"v":36,"d":"36.0"},{"v":12,"d":"12.0"},{"v":31.95,"d":"32.0"},{"v":6,"d":"6.0"},{"v":15,"d":"15.0"},{"v":15,"d":"15.0"},{"v":8,"d":"8.0"},{"v":8,"d":"8.0"},{"v":8,"d":"8.0"},{"v":8,"d":"8.0"},{"v":10.35,"d":"10.4"},8.1,{"v":10.35,"d":"10.4"},{"v":8,"d":"8.0"},null,6.9,{"v":20,"d":"20.0"},{"v":36,"d":"36.0"},{"v":36,"d":"36.0"},{"v":48,"d":"48.0"},{"v":20,"d":"20.0"},20.3,{"v":9,"d":"9.0"},{"v":20,"d":"20.0"},{"v":20,"d":"20.0"},{"v":24,"d":"24.0"},{"v":16,"d":"16.0"},{"v":8,"d":"8.0"},{"v":8,"d":"8.0"},{"v":24,"d":"24.0"},{"v":12,"d":"12.0"},{"v":20,"d":"20.0"},8.1,{"v":12,"d":"12.0"},24.3,{"v":12,"d":"12.0"},20.3,10.4,6.9,{"v":8,"d":"8.0"},{"v":21.87,"d":"21.9"},{"v":18,"d":"18.0"},{"v":21.87,"d":"21.9"},{"v":9,"d":"9.0"},{"v":8,"d":"8.0"},{"v":20,"d":"20.0"},{"v":9,"d":"9.0"},6.9,6.9,{"v":6,"d":"6.0"},6.9,6.9,null,{"v":12,"d":"12.0"},6.9,{"v":6,"d":"6.0"},24.3,{"v":15,"d":"15.0"},6.9,{"v":15,"d":"15.0"},{"v":8,"d":"8.0"},{"v":8,"d":"8.0"},{"v":8,"d":"8.0"},{"v":9,"d":"9.0"},{"v":12,"d":"12.0"},13.8,6.9,null,{"v":12,"d":"12.0"},{"v":6,"d":"6.0"},{"v":6,"d":"6.0"},{"v":6,"d":"6.0"},null,{"v":13.11,"d":"13.1"},{"v":12,"d":"12.0"},{"v":12,"d":"12.0"},{"v":60,"d":"60.0"},{"v":15,"d":"15.0"},{"v":8,"d":"8.0"},{"v":32,"d":"32.0"},{"v":12.15,"d":"12.2"},{"v":6,"d":"6.0"},null,{"v":10.65,"d":"10.7"},{"v":8,"d":"8.0"},{"v":10.35,"d":"10.4"},8.1,{"v":13.11,"d":"13.1"},7.1,17.6,{"v":16,"d":"16.0"},{"v":16,"d":"16.0"},{"v":14,"d":"14.0"},{"v":6,"d":"6.0"},{"v":10,"d":"10.0"},null,{"v":8,"d":"8.0"},8.1,{"v":12,"d":"12.0"},{"v":8,"d":"8.0"},{"v":20,"d":"20.0"},8.1,{"v":12.15,"d":"12.2"},{"v":12.15,"d":"12.2"},{"v":31.95,"d":"32.0"},{"v":8,"d":"8.0"},{"v":24,"d":"24.0"},13.3,{"v":6,"d":"6.0"},8.1,{"v":6,"d":"6.0"},null,6.9,{"v":10.35,"d":"10.4"},{"v":9,"d":"9.0"},{"v":8,"d":"8.0"},{"v":25,"d":"25.0"},{"v":20,"d":"20.0"},13.8,{"v":20,"d":"20.0"},{"v":32,"d":"32.0"},{"v":10.65,"d":"10.7"},{"v":18,"d":"18.0"},{"v":9,"d":"9.0"},6.9,{"v":6,"d":"6.0"},{"v":13.11,"d":"13.1"},13.1,6.9,null,{"v":12,"d":"12.0"},null,7.1,21.3,{"v":8,"d":"8.0"},{"v":6,"d":"6.0"},{"v":20,"d":"20.0"},{"v":8,"d":"8.0"},{"v":12,"d":"12.0"},{"v":8,"d":"8.0"},{"v":12,"d":"12.0"},{"v":31.95,"d":"32.0"},{"v":32,"d":"32.0"},null,13.3,{"v":8,"d":"8.0"},null,{"v":12,"d":"12.0"},{"v":12,"d":"12.0"},{"v":6,"d":"6.0"},{"v":13.11,"d":"13.1"},{"v":10,"d":"10.0"},{"v":13.33,"d":"13.3"},{"v":32,"d":"32.0"},{"v":12,"d":"12.0"},21.3,{"v":20,"d":"20.0"},13.8,{"v":8,"d":"8.0"},{"v":8,"d":"8.0"},{"v":8,"d":"8.0"},{"v":8,"d":"8.0"},{"v":15,"d":"15.0"},24.3,null,{"v":20,"d":"20.0"},{"v":8,"d":"8.0"},{"v":20,"d":"20.0"},{"v":15,"d":"15.0"},{"v":15,"d":"15.0"},{"v":8,"d":"8.0"},{"v":8,"d":"8.0"},{"v":8,"d":"8.0"},{"v":6,"d":"6.0"},{"v":15.62,"d":"15.6"},null,6.9,6.9,6.9,{"v":12,"d":"12.0"},{"v":8,"d":"8.0"},null,6.9,null,6.9,{"v":12.15,"d":"12.2"},13.8,{"v":60,"d":"60.0"},{"v":10,"d":"10.0"},null,{"v":8,"d":"8.0"},8.1,16.2,{"v":20,"d":"20.0"},{"v":6,"d":"6.0"},{"v":24,"d":"24.0"},{"v":12,"d":"12.0"},{"v":18,"d":"18.0"},{"v":18,"d":"18.0"},10.7,{"v":6,"d":"6.0"},20.7,{"v":20,"d":"20.0"},{"v":8,"d":"8.0"},{"v":8,"d":"8.0"},null,{"v":6,"d":"6.0"},{"v":6,"d":"6.0"},{"v":8,"d":"8.0"},{"v":6,"d":"6.0"},6.9,{"v":21.87,"d":"21.9"},{"v":8,"d":"8.0"},10.7,{"v":24,"d":"24.0"},20.7,{"v":6,"d":"6.0"},{"v":18,"d":"18.0"},13.3,{"v":12,"d":"12.0"},10.7,{"v":10.65,"d":"10.7"},{"v":6,"d":"6.0"},6.9,{"v":16,"d":"16.0"},{"v":60,"d":"60.0"},{"v":15,"d":"15.0"},{"v":8,"d":"8.0"},{"v":9,"d":"9.0"},null,20.3,{"v":21.87,"d":"21.9"},20.3,{"v":60,"d":"60.0"},6.9,6.9,8.1,8.1,6.9,{"v":32,"d":"32.0"},{"v":10,"d":"10.0"},{"v":6,"d":"6.0"},{"v":16,"d":"16.0"},{"v":12,"d":"12.0"},null,{"v":16,"d":"16.0"},{"v":16,"d":"16.0"},{"v":13.11,"d":"13.1"},13.1,8.1,{"v":24.15,"d":"24.2"},{"v":12,"d":"12.0"},{"v":6,"d":"6.0"},{"v":30,"d":"30.0"},29.7,{"v":12,"d":"12.0"},{"v":12,"d":"12.0"},{"v":6,"d":"6.0"},{"v":10,"d":"10.0"},{"v":8,"d":"8.0"},null,{"v":8,"d":"8.0"},{"v":8,"d":"8.0"},8.1,6.9,{"v":6,"d":"6.0"},null,8.1,8.1,{"v":8,"d":"8.0"},{"v":24,"d":"24.0"},{"v":8,"d":"8.0"},{"v":20,"d":"20.0"},{"v":6,"d":"6.0"},{"v":8,"d":"8.0"},{"v":8,"d":"8.0"},{"v":8,"d":"8.0"},{"v":12,"d":"12.0"},6.9,{"v":9,"d":"9.0"},{"v":6,"d":"6.0"},{"v":6,"d":"6.0"},{"v":8,"d":"8.0"},6.9,{"v":32,"d":"32.0"},6.9,{"v":20,"d":"20.0"},{"v":9,"d":"9.0"},{"v":20,"d":"20.0"},{"v":6,"d":"6.0"},{"v":8,"d":"8.0"},{"v":18,"d":"18.0"},{"v":12,"d":"12.0"},{"v":20,"d":"20.0"},{"v":8,"d":"8.0"},{"v":15,"d":"15.0"},{"v":12,"d":"12.0"},null,{"v":6,"d":"6.0"},{"v":28,"d":"28.0"},{"v":6,"d":"6.0"},8.1,{"v":12,"d":"12.0"},{"v":8,"d":"8.0"},{"v":8,"d":"8.0"},{"v":8,"d":"8.0"},{"v":32,"d":"32.0"},{"v":12,"d":"12.0"},8.1,{"v":12,"d":"12.0"},20.3,{"v":12,"d":"12.0"},{"v":12,"d":"12.0"},20.3,16.2,{"v":8,"d":"8.0"},{"v":6,"d":"6.0"},{"v":6,"d":"6.0"},10.7,{"v":12,"d":"12.0"},8.1,{"v":6,"d":"6.0"},6.9,6.9,{"v":9,"d":"9.0"},null,{"v":6,"d":"6.0"},{"v":12,"d":"12.0"},{"v":12,"d":"12.0"},{"v":8,"d":"8.0"},7.1,{"v":12,"d":"12.0"},{"v":6,"d":"6.0"},29.7,{"v":10.35,"d":"10.4"},{"v":6,"d":"6.0"},{"v":6,"d":"6.0"},{"v":12,"d":"12.0"},null,{"v":18,"d":"18.0"},{"v":9,"d":"9.0"},6.9,{"v":6,"d":"6.0"},7.1,{"v":8,"d":"8.0"},{"v":8,"d":"8.0"},{"v":8,"d":"8.0"},{"v":8,"d":"8.0"},20.3,{"v":8,"d":"8.0"},8.1,8.1,{"v":15,"d":"15.0"},{"v":6,"d":"6.0"},{"v":15,"d":"15.0"},{"v":9,"d":"9.0"},8.1,null,{"v":6,"d":"6.0"},{"v":9,"d":"9.0"},7.1,{"v":10.65,"d":"10.7"},{"v":20,"d":"20.0"},{"v":12,"d":"12.0"},{"v":12,"d":"12.0"},{"v":9,"d":"9.0"},{"v":18,"d":"18.0"},{"v":9,"d":"9.0"},{"v":24,"d":"24.0"},null,{"v":8,"d":"8.0"},{"v":10.65,"d":"10.7"},{"v":8,"d":"8.0"},17.6,{"v":8,"d":"8.0"},{"v":12,"d":"12.0"},8.1,{"v":15,"d":"15.0"},{"v":12,"d":"12.0"},{"v":12,"d":"12.0"},{"v":8,"d":"8.0"},{"v":12,"d":"12.0"},{"v":10.65,"d":"10.7"},{"v":6,"d":"6.0"},{"v":60,"d":"60.0"},{"v":36,"d":"36.0"},{"v":48,"d":"48.0"},{"v":60,"d":"60.0"},17.6,{"v":21.87,"d":"21.9"},20.3,{"v":60,"d":"60.0"},20.3,6.9,{"v":6,"d":"6.0"},6.9,{"v":8,"d":"8.0"},{"v":28,"d":"28.0"},{"v":15,"d":"15.0"},{"v":8,"d":"8.0"},{"v":8,"d":"8.0"},{"v":8,"d":"8.0"},16.2,{"v":16,"d":"16.0"},{"v":60,"d":"60.0"},{"v":12,"d":"12.0"},{"v":13.33,"d":"13.3"},6.9,{"v":8,"d":"8.0"},{"v":8,"d":"8.0"},{"v":15,"d":"15.0"},7.1,{"v":12,"d":"12.0"},{"v":12,"d":"12.0"},20.3,{"v":18,"d":"18.0"},{"v":12,"d":"12.0"},{"v":8,"d":"8.0"},{"v":12,"d":"12.0"},7.1,{"v":15,"d":"15.0"},{"v":15,"d":"15.0"},{"v":10.65,"d":"10.7"},{"v":10,"d":"10.0"},{"v":12,"d":"12.0"},6.9,{"v":18.67,"d":"18.7"},{"v":6,"d":"6.0"},6.9,{"v":6,"d":"6.0"},{"v":15,"d":"15.0"},13.8,20.3,{"v":6,"d":"6.0"},13.3,12.2,{"v":8,"d":"8.0"},13.1,{"v":10.65,"d":"10.7"},{"v":60,"d":"60.0"},{"v":60,"d":"60.0"},{"v":12,"d":"12.0"},13.8,{"v":60,"d":"60.0"},{"v":8,"d":"8.0"},{"v":12,"d":"12.0"},null,24.3,{"v":6,"d":"6.0"},null,{"v":8,"d":"8.0"},{"v":15,"d":"15.0"},6.9,null,null,{"v":15,"d":"15.0"},{"v":15,"d":"15.0"},{"v":16,"d":"16.0"},null,{"v":16,"d":"16.0"},24.3,16.2,{"v":30,"d":"30.0"},10.7,{"v":20,"d":"20.0"},8.1,{"v":15,"d":"15.0"},13.8,13.8,{"v":10.65,"d":"10.7"},{"v":12,"d":"12.0"},{"v":20,"d":"20.0"},{"v":20,"d":"20.0"},6.9,{"v":20,"d":"20.0"},{"v":13.33,"d":"13.3"},{"v":25,"d":"25.0"},8.1,6.9,{"v":18.67,"d":"18.7"},{"v":8,"d":"8.0"},{"v":12,"d":"12.0"},{"v":40,"d":"40.0"},{"v":12,"d":"12.0"},{"v":12,"d":"12.0"},24.3,{"v":12,"d":"12.0"},null,13.1,8.1,{"v":16,"d":"16.0"},{"v":16,"d":"16.0"},{"v":6,"d":"6.0"},{"v":12,"d":"12.0"},{"v":18,"d":"18.0"},16.2,20.3,{"v":32,"d":"32.0"},{"v":8,"d":"8.0"},{"v":6,"d":"6.0"},{"v":16,"d":"16.0"},16.2,{"v":8,"d":"8.0"},{"v":12,"d":"12.0"},{"v":32,"d":"32.0"},{"v":20,"d":"20.0"},{"v":12,"d":"12.0"},16.2,null,{"v":6,"d":"6.0"},8.1,11.4,{"v":12.15,"d":"12.2"},{"v":8,"d":"8.0"},11.4,13.1,{"v":9,"d":"9.0"},{"v":12,"d":"12.0"},6.9,7.1,{"v":12,"d":"12.0"},{"v":6,"d":"6.0"},7.1,{"v":8,"d":"8.0"},{"v":12.15,"d":"12.2"},6.9,24.3,{"v":8,"d":"8.0"},{"v":8,"d":"8.0"},8.1,20.3,{"v":6,"d":"6.0"},20.3,{"v":12,"d":"12.0"},{"v":6,"d":"6.0"},13.1,null,13.8,{"v":6,"d":"6.0"},{"v":12,"d":"12.0"},20.3,8.1,20.3,{"v":8,"d":"8.0"},{"v":16,"d":"16.0"},13.1,{"v":14,"d":"14.0"},{"v":12,"d":"12.0"},8.1,{"v":6,"d":"6.0"},{"v":15.62,"d":"15.6"},{"v":8,"d":"8.0"},{"v":20,"d":"20.0"},{"v":20,"d":"20.0"},{"v":16,"d":"16.0"},{"v":12,"d":"12.0"},{"v":6,"d":"6.0"},8.1]
["EIQ Impacto consumidor (<10; 10 - 20; >20)",null,{"v":7,"d":"7.0"},{"v":14,"d":"14.0"},3.9,3.9,{"v":8,"d":"8.0"},{"v":8,"d":"8.0"},12.5,12.5,12.5,{"v":7.35,"d":"7.4"},{"v":5.33,"d":"5.3"},{"v":5.35,"d":"5.4"},8.8,{"v":11,"d":"11.0"},{"v":15,"d":"15.0"},{"v":4.05,"d":"4.1"},{"v":12.03,"d":"12.0"},{"v":7,"d":"7.0"},{"v":6.83,"d":"6.8"},{"v":5,"d":"5.0"},2.5,{"v":6.05,"d":"6.1"},{"v":9,"d":"9.0"},{"v":5.33,"d":"5.3"},{"v":5.33,"d":"5.3"},{"v":10,"d":"10.0"},5.9,{"v":4,"d":"4.0"},null,{"v":6,"d":"6.0"},{"v":6.45,"d":"6.5"},25.9,{"v":5.99,"d":"6.0"},5.9,{"v":2,"d":"2.0"},{"v":10.65,"d":"10.7"},{"v":10.65,"d":"10.7"},null,{"v":7,"d":"7.0"},{"v":1,"d":"1.0"},6.1,2.5,3.9,{"v":8,"d":"8.0"},{"v":8.63,"d":"8.6"},2.5,{"v":8.35,"d":"8.4"},{"v":19,"d":"19.0"},{"v":4,"d":"4.0"},{"v":6,"d":"6.0"},25.9,{"v":12.15,"d":"12.2"},{"v":8.35,"d":"8.4"},9.5,{"v":7,"d":"7.0"},{"v":8,"d":"8.0"},25.9,{"v":7,"d":"7.0"},{"v":7,"d":"7.0"},{"v":4.99,"d":"5.0"},null,{"v":14,"d":"14.0"},{"v":7,"d":"7.0"},{"v":7,"d":"7.0"},{"v":14.48,"d":"14.5"},{"v":7,"d":"7.0"},9.1,{"v":19,"d":"19.0"},{"v":9.05,"d":"9.1"},null,{"v":5,"d":"5.0"},{"v":7.35,"d":"7.4"},9.7,12.5,{"v":2.45,"d":"2.5"},3.9,5.5,5.5,{"v":5,"d":"5.0"},{"v":6.05,"d":"6.1"},{"v":6.05,"d":"6.1"},10.4,{"v":9,"d":"9.0"},4.5,21.3,{"v":11,"d":"11.0"},{"v":3.18,"d":"3.2"},{"v":18,"d":"18.0"},{"v":10,"d":"10.0"},40.5,{"v":9,"d":"9.0"},null,null,{"v":9,"d":"9.0"},{"v":39,"d":"39.0"},{"v":4,"d":"4.0"},{"v":10,"d":"10.0"},2.5,{"v":2,"d":"2.0"},7.9,7.9,null,{"v":5.35,"d":"5.4"},{"v":4.55,"d":"4.6"},7.9,{"v":2.81,"d":"2.8"},{"v":2,"d":"2.0"},8.8,{"v":7,"d":"7.0"},{"v":2,"d":"2.0"},{"v":8,"d":"8.0"},21.2,21.2,{"v":11,"d":"11.0"},{"v":7.45,"d":"7.5"},10.4,{"v":10.45,"d":"10.5"},{"v":2.45,"d":"2.5"},{"v":8.08,"d":"8.1"},{"v":19,"d":"19.0"},9.7,7.5,{"v":7,"d":"7.0"},{"v":13.15,"d":"13.2"},{"v":15,"d":"15.0"},{"v":9,"d":"9.0"},{"v":21.23,"d":"21.2"},{"v":5,"d":"5.0"},{"v":5,"d":"5.0"},{"v":6,"d":"6.0"},7.9,5.5,40.5,40.5,{"v":8,"d":"8.0"},40.5,{"v":8.35,"d":"8.4"},{"v":7.15,"d":"7.2"},8.8,{"v":5,"d":"5.0"},{"v":13.97,"d":"14.0"},{"v":13.97,"d":"14.0"},{"v":4.99,"d":"5.0"},{"v":6,"d":"6.0"},{"v":2,"d":"2.0"},12.5,{"v":21,"d":"21.0"},{"v":7.35,"d":"7.4"},{"v":8,"d":"8.0"},15.3,{"v":11,"d":"11.0"},3.8,9.1,{"v":2,"d":"2.0"},{"v":19,"d":"19.0"},{"v":9,"d":"9.0"},{"v":4,"d":"4.0"},{"v":18,"d":"18.0"},null,{"v":11.53,"d":"11.5"},10.4,{"v":4,"d":"4.0"},{"v":21.26,"d":"21.3"},5.9,5.9,25.9,{"v":14.73,"d":"14.7"},{"v":13.35,"d":"13.4"},{"v":7,"d":"7.0"},{"v":8,"d":"8.0"},{"v":5,"d":"5.0"},{"v":6.83,"d":"6.8"},{"v":5,"d":"5.0"},6.5,{"v":4,"d":"4.0"},{"v":4.99,"d":"5.0"},{"v":12.23,"d":"12.2"},{"v":7,"d":"7.0"},{"v":7,"d":"7.0"},{"v":7,"d":"7.0"},{"v":11,"d":"11.0"},{"v":2,"d":"2.0"},{"v":8.18,"d":"8.2"},{"v":5,"d":"5.0"},9.7,4.1,5.9,{"v":4,"d":"4.0"},{"v":10.45,"d":"10.5"},10.4,{"v":5,"d":"5.0"},8.1,{"v":2,"d":"2.0"},{"v":6,"d":"6.0"},{"v":7,"d":"7.0"},{"v":31,"d":"31.0"},10.4,{"v":12,"d":"12.0"},{"v":5,"d":"5.0"},{"v":5.05,"d":"5.1"},{"v":11,"d":"11.0"},8.1,8.1,8.4,{"v":3.05,"d":"3.1"},2.5,5.9,{"v":11,"d":"11.0"},{"v":11,"d":"11.0"},{"v":11,"d":"11.0"},{"v":2,"d":"2.0"},4.5,{"v":2,"d":"2.0"},{"v":4,"d":"4.0"},{"v":2,"d":"2.0"},6.5,40.5,40.5,{"v":7,"d":"7.0"},{"v":2.45,"d":"2.5"},{"v":7,"d":"7.0"},{"v":8,"d":"8.0"},{"v":6.33,"d":"6.3"},{"v":5,"d":"5.0"},23.5,23.5,{"v":3,"d":"3.0"},{"v":3,"d":"3.0"},{"v":3,"d":"3.0"},{"v":3,"d":"3.0"},{"v":11.53,"d":"11.5"},{"v":12.15,"d":"12.2"},{"v":11.53,"d":"11.5"},{"v":3,"d":"3.0"},null,{"v":7.45,"d":"7.5"},8.5,{"v":7,"d":"7.0"},{"v":7,"d":"7.0"},{"v":9,"d":"9.0"},8.5,8.1,{"v":4,"d":"4.0"},8.5,8.5,{"v":7,"d":"7.0"},{"v":9,"d":"9.0"},{"v":3,"d":"3.0"},{"v":3,"d":"3.0"},{"v":11,"d":"11.0"},{"v":9,"d":"9.0"},{"v":31,"d":"31.0"},6.1,{"v":3,"d":"3.0"},9.1,{"v":21,"d":"21.0"},8.1,{"v":12,"d":"12.0"},{"v":2.45,"d":"2.5"},{"v":5,"d":"5.0"},{"v":8.29,"d":"8.3"},{"v":14,"d":"14.0"},{"v":21.26,"d":"21.3"},2.5,{"v":7,"d":"7.0"},{"v":31,"d":"31.0"},{"v":6,"d":"6.0"},{"v":3.45,"d":"3.5"},{"v":2.45,"d":"2.5"},{"v":2,"d":"2.0"},{"v":2.45,"d":"2.5"},{"v":2.45,"d":"2.5"},null,{"v":3,"d":"3.0"},{"v":2.45,"d":"2.5"},{"v":5,"d":"5.0"},{"v":9.15,"d":"9.2"},12.5,{"v":2.45,"d":"2.5"},12.5,{"v":7,"d":"7.0"},{"v":7,"d":"7.0"},{"v":9,"d":"9.0"},2.5,{"v":6,"d":"6.0"},5.9,{"v":7.35,"d":"7.4"},null,{"v":4,"d":"4.0"},{"v":4,"d":"4.0"},{"v":3,"d":"3.0"},{"v":2,"d":"2.0"},null,{"v":4.99,"d":"5.0"},{"v":5,"d":"5.0"},{"v":6,"d":"6.0"},{"v":11,"d":"11.0"},23.5,{"v":7,"d":"7.0"},8.8,{"v":10.23,"d":"10.2"},{"v":8,"d":"8.0"},null,{"v":3.33,"d":"3.3"},{"v":4,"d":"4.0"},{"v":3.18,"d":"3.2"},{"v":3.05,"d":"3.1"},{"v":4.99,"d":"5.0"},7.5,11.6,6.1,6.1,{"v":15,"d":"15.0"},{"v":8,"d":"8.0"},{"v":18,"d":"18.0"},null,{"v":8,"d":"8.0"},{"v":15.15,"d":"15.2"},{"v":21,"d":"21.0"},{"v":15,"d":"15.0"},{"v":31,"d":"31.0"},12.2,{"v":6.08,"d":"6.1"},{"v":6.08,"d":"6.1"},{"v":8.83,"d":"8.8"},{"v":7,"d":"7.0"},{"v":9,"d":"9.0"},9.7,{"v":9,"d":"9.0"},{"v":12.15,"d":"12.2"},{"v":4,"d":"4.0"},null,{"v":2.45,"d":"2.5"},{"v":11.53,"d":"11.5"},5.5,{"v":4,"d":"4.0"},40.5,{"v":11,"d":"11.0"},5.9,{"v":31,"d":"31.0"},8.8,{"v":3.33,"d":"3.3"},{"v":6,"d":"6.0"},{"v":10,"d":"10.0"},10.4,{"v":3,"d":"3.0"},{"v":4.99,"d":"5.0"},{"v":5,"d":"5.0"},8.4,null,{"v":9,"d":"9.0"},null,{"v":5.55,"d":"5.6"},10.7,{"v":7,"d":"7.0"},{"v":5,"d":"5.0"},{"v":11,"d":"11.0"},{"v":3,"d":"3.0"},{"v":6,"d":"6.0"},{"v":3,"d":"3.0"},{"v":7,"d":"7.0"},{"v":6.33,"d":"6.3"},6.3,null,9.7,{"v":5,"d":"5.0"},null,{"v":6,"d":"6.0"},{"v":8,"d":"8.0"},{"v":4,"d":"4.0"},{"v":2.81,"d":"2.8"},{"v":18,"d":"18.0"},{"v":8.33,"d":"8.3"},6.3,5.5,10.7,8.5,5.9,{"v":7,"d":"7.0"},{"v":7,"d":"7.0"},{"v":7,"d":"7.0"},{"v":7,"d":"7.0"},{"v":7,"d":"7.0"},9.1,null,{"v":31,"d":"31.0"},{"v":7,"d":"7.0"},{"v":11,"d":"11.0"},23.5,23.5,{"v":8,"d":"8.0"},{"v":9,"d":"9.0"},{"v":5,"d":"5.0"},{"v":8,"d":"8.0"},{"v":10.61,"d":"10.6"},null,10.4,10.4,{"v":2.45,"d":"2.5"},{"v":21,"d":"21.0"},{"v":3,"d":"3.0"},null,8.4,null,{"v":2.45,"d":"2.5"},{"v":12.23,"d":"12.2"},7.9,{"v":11,"d":"11.0"},{"v":8,"d":"8.0"},null,{"v":7,"d":"7.0"},{"v":13.15,"d":"13.2"},9.1,{"v":11,"d":"11.0"},{"v":8,"d":"8.0"},{"v":9,"d":"9.0"},{"v":19,"d":"19.0"},{"v":2,"d":"2.0"},{"v":2,"d":"2.0"},5.3,{"v":2,"d":"2.0"},3.5,8.5,{"v":6,"d":"6.0"},{"v":7,"d":"7.0"},null,{"v":8,"d":"8.0"},{"v":8,"d":"8.0"},{"v":9,"d":"9.0"},{"v":2,"d":"2.0"},{"v":7.45,"d":"7.5"},{"v":8.29,"d":"8.3"},{"v":8,"d":"8.0"},5.3,{"v":11,"d":"11.0"},3.5,{"v":11,"d":"11.0"},{"v":6,"d":"6.0"},9.7,{"v":6,"d":"6.0"},6.8,{"v":6.83,"d":"6.8"},{"v":2,"d":"2.0"},8.4,{"v":7,"d":"7.0"},{"v":11,"d":"11.0"},23.5,{"v":7,"d":"7.0"},4.5,null,8.1,{"v":19.61,"d":"19.6"},8.1,{"v":11,"d":"11.0"},{"v":8.35,"d":"8.4"},{"v":8.35,"d":"8.4"},12.2,{"v":3.05,"d":"3.1"},{"v":7.45,"d":"7.5"},{"v":9,"d":"9.0"},{"v":18,"d":"18.0"},{"v":2,"d":"2.0"},{"v":7,"d":"7.0"},{"v":5,"d":"5.0"},null,{"v":7,"d":"7.0"},{"v":7,"d":"7.0"},{"v":5.99,"d":"6.0"},{"v":6,"d":"6.0"},12.2,{"v":8.08,"d":"8.1"},{"v":15,"d":"15.0"},{"v":11,"d":"11.0"},{"v":4,"d":"4.0"},{"v":12.18,"d":"12.2"},{"v":9,"d":"9.0"},{"v":9,"d":"9.0"},{"v":11,"d":"11.0"},{"v":8,"d":"8.0"},{"v":8,"d":"8.0"},null,{"v":8,"d":"8.0"},{"v":8,"d":"8.0"},{"v":12.15,"d":"12.2"},{"v":5.45,"d":"5.5"},{"v":10,"d":"10.0"},null,{"v":4.95,"d":"5.0"},{"v":15.15,"d":"15.2"},{"v":5,"d":"5.0"},{"v":11,"d":"11.0"},{"v":8,"d":"8.0"},{"v":31,"d":"31.0"},{"v":2,"d":"2.0"},{"v":8,"d":"8.0"},{"v":8,"d":"8.0"},{"v":8,"d":"8.0"},{"v":19,"d":"19.0"},8.4,4.5,{"v":3,"d":"3.0"},{"v":2,"d":"2.0"},{"v":8,"d":"8.0"},10.4,6.3,{"v":2.45,"d":"2.5"},{"v":31,"d":"31.0"},2.5,{"v":9,"d":"9.0"},{"v":8,"d":"8.0"},{"v":9,"d":"9.0"},{"v":14,"d":"14.0"},{"v":15,"d":"15.0"},{"v":31,"d":"31.0"},{"v":15,"d":"15.0"},12.5,{"v":5,"d":"5.0"},null,{"v":3,"d":"3.0"},{"v":15,"d":"15.0"},{"v":10,"d":"10.0"},{"v":5.05,"d":"5.1"},{"v":7,"d":"7.0"},{"v":5,"d":"5.0"},{"v":5,"d":"5.0"},{"v":7,"d":"7.0"},6.3,{"v":6,"d":"6.0"},{"v":4.95,"d":"5.0"},5.5,8.1,{"v":9.35,"d":"9.4"},{"v":5,"d":"5.0"},8.1,21.3,{"v":9,"d":"9.0"},{"v":6,"d":"6.0"},{"v":10,"d":"10.0"},3.3,{"v":19,"d":"19.0"},{"v":4.05,"d":"4.1"},{"v":4,"d":"4.0"},{"v":3.45,"d":"3.5"},{"v":2.45,"d":"2.5"},{"v":6,"d":"6.0"},null,{"v":2,"d":"2.0"},9.5,{"v":7,"d":"7.0"},{"v":9,"d":"9.0"},{"v":4.55,"d":"4.6"},{"v":4,"d":"4.0"},{"v":2.45,"d":"2.5"},{"v":12.18,"d":"12.2"},{"v":8.18,"d":"8.2"},{"v":8,"d":"8.0"},{"v":3,"d":"3.0"},{"v":8,"d":"8.0"},null,{"v":14,"d":"14.0"},5.5,6.5,{"v":6,"d":"6.0"},{"v":7.45,"d":"7.5"},{"v":7,"d":"7.0"},{"v":7,"d":"7.0"},{"v":7,"d":"7.0"},{"v":7,"d":"7.0"},25.9,{"v":7,"d":"7.0"},6.1,6.1,23.5,{"v":2,"d":"2.0"},25.5,{"v":4,"d":"4.0"},{"v":3.05,"d":"3.1"},null,{"v":4,"d":"4.0"},5.5,{"v":5.55,"d":"5.6"},{"v":5.33,"d":"5.3"},{"v":9,"d":"9.0"},{"v":19,"d":"19.0"},{"v":19,"d":"19.0"},2.5,{"v":14,"d":"14.0"},5.5,{"v":9,"d":"9.0"},null,{"v":9,"d":"9.0"},{"v":3.33,"d":"3.3"},{"v":5,"d":"5.0"},11.6,{"v":5,"d":"5.0"},{"v":8,"d":"8.0"},{"v":13.15,"d":"13.2"},12.5,{"v":9,"d":"9.0"},{"v":4,"d":"4.0"},{"v":8,"d":"8.0"},{"v":9.35,"d":"9.4"},{"v":6.83,"d":"6.8"},{"v":2,"d":"2.0"},{"v":11,"d":"11.0"},{"v":7,"d":"7.0"},{"v":9,"d":"9.0"},{"v":11,"d":"11.0"},11.6,{"v":19.61,"d":"19.6"},8.6,{"v":11,"d":"11.0"},8.1,10.4,{"v":3,"d":"3.0"},{"v":4.55,"d":"4.6"},{"v":8,"d":"8.0"},{"v":15,"d":"15.0"},25.5,{"v":3,"d":"3.0"},{"v":3,"d":"3.0"},{"v":3,"d":"3.0"},9.1,{"v":15,"d":"15.0"},7.5,{"v":3,"d":"3.0"},{"v":8.33,"d":"8.3"},{"v":2.45,"d":"2.5"},{"v":8,"d":"8.0"},{"v":5,"d":"5.0"},23.5,7.5,{"v":8,"d":"8.0"},{"v":4,"d":"4.0"},8.6,{"v":6,"d":"6.0"},{"v":6,"d":"6.0"},{"v":8,"d":"8.0"},{"v":9,"d":"9.0"},{"v":4.55,"d":"4.6"},5.5,25.5,{"v":14.48,"d":"14.5"},{"v":18,"d":"18.0"},{"v":21,"d":"21.0"},{"v":2.45,"d":"2.5"},{"v":1,"d":"1.0"},{"v":8,"d":"8.0"},10.4,{"v":8,"d":"8.0"},23.5,7.9,25.9,{"v":5,"d":"5.0"},9.7,21.2,{"v":5,"d":"5.0"},{"v":5,"d":"5.0"},{"v":5.33,"d":"5.3"},{"v":11,"d":"11.0"},{"v":11,"d":"11.0"},9.5,7.9,{"v":11,"d":"11.0"},{"v":8,"d":"8.0"},{"v":19,"d":"19.0"},null,{"v":13.15,"d":"13.2"},{"v":8,"d":"8.0"},null,{"v":6,"d":"6.0"},12.5,3.5,null,null,25.5,25.5,6.1,null,6.1,9.1,15.3,{"v":4,"d":"4.0"},5.3,{"v":31,"d":"31.0"},{"v":12.15,"d":"12.2"},{"v":7,"d":"7.0"},7.9,7.9,{"v":3.33,"d":"3.3"},{"v":21,"d":"21.0"},{"v":31,"d":"31.0"},{"v":31,"d":"31.0"},{"v":5.45,"d":"5.5"},{"v":31,"d":"31.0"},{"v":9.67,"d":"9.7"},40.5,{"v":13.15,"d":"13.2"},8.4,{"v":1,"d":"1.0"},{"v":8,"d":"8.0"},9.5,{"v":6,"d":"6.0"},16.5,16.5,{"v":9.15,"d":"9.2"},{"v":21,"d":"21.0"},null,3.8,{"v":13.15,"d":"13.2"},{"v":15,"d":"15.0"},{"v":7,"d":"7.0"},{"v":2,"d":"2.0"},{"v":19,"d":"19.0"},{"v":6,"d":"6.0"},15.3,8.6,6.3,{"v":7,"d":"7.0"},{"v":2,"d":"2.0"},{"v":5,"d":"5.0"},15.3,{"v":1,"d":"1.0"},{"v":21,"d":"21.0"},{"v":39,"d":"39.0"},{"v":11,"d":"11.0"},{"v":3,"d":"3.0"},21.3,null,{"v":7,"d":"7.0"},6.1,6.7,{"v":10.23,"d":"10.2"},{"v":5,"d":"5.0"},6.7,3.8,5.5,{"v":21,"d":"21.0"},{"v":13.35,"d":"13.4"},{"v":4.55,"d":"4.6"},{"v":21,"d":"21.0"},{"v":6,"d":"6.0"},{"v":4.55,"d":"4.6"},{"v":3,"d":"3.0"},{"v":14.73,"d":"14.7"},2.5,9.1,{"v":7,"d":"7.0"},{"v":8,"d":"8.0"},6.1,25.9,{"v":8,"d":"8.0"},25.9,{"v":8,"d":"8.0"},{"v":9,"d":"9.0"},{"v":6,"d":"6.0"},null,3.9,{"v":2,"d":"2.0"},{"v":21,"d":"21.0"},8.6,{"v":7.15,"d":"7.2"},8.6,{"v":5,"d":"5.0"},{"v":9,"d":"9.0"},3.8,{"v":15,"d":"15.0"},{"v":7,"d":"7.0"},6.1,{"v":2,"d":"2.0"},{"v":10.61,"d":"10.6"},{"v":8,"d":"8.0"},{"v":11,"d":"11.0"},{"v":11,"d":"11.0"},6.1,{"v":21,"d":"21.0"},{"v":10,"d":"10.0"},{"v":3.05,"d":"3.1"}]
["EIQ Impacto ao meio ambiente (<40; 40 - 70; >70)",null,{"v":31,"d":"31.0"},{"v":40,"d":"40.0"},{"v":86.35,"d":"86.4"},{"v":86.35,"d":"86.4"},42.6,{"v":34,"d":"34.0"},{"v":47.15,"d":"47.2"},{"v":47.15,"d":"47.2"},{"v":47.15,"d":"47.2"},{"v":71.95,"d":"72.0"},{"v":43.59,"d":"43.6"},{"v":49.97,"d":"50.0"},45.9,{"v":45,"d":"45.0"},{"v":63,"d":"63.0"},{"v":68.87,"d":"68.9"},{"v":77.52,"d":"77.5"},{"v":33,"d":"33.0"},{"v":40.49,"d":"40.5"},{"v":69,"d":"69.0"},{"v":22,"d":"22.0"},{"v":66.62,"d":"66.6"},{"v":69,"d":"69.0"},{"v":37.59,"d":"37.6"},{"v":37.59,"d":"37.6"},{"v":42,"d":"42.0"},89.4,{"v":50,"d":"50.0"},null,45.6,{"v":41.66,"d":"41.7"},{"v":68,"d":"68.0"},{"v":79.57,"d":"79.6"},{"v":89.35,"d":"89.4"},{"v":42,"d":"42.0"},{"v":40.59,"d":"40.6"},{"v":40.59,"d":"40.6"},null,{"v":31,"d":"31.0"},{"v":52,"d":"52.0"},66.6,{"v":46,"d":"46.0"},86.4,{"v":42.55,"d":"42.6"},{"v":58.95,"d":"59.0"},39.2,{"v":56.55,"d":"56.6"},73.9,{"v":58,"d":"58.0"},29.2,{"v":68,"d":"68.0"},{"v":36.95,"d":"37.0"},{"v":33.63,"d":"33.6"},44.2,{"v":20,"d":"20.0"},{"v":94,"d":"94.0"},{"v":68,"d":"68.0"},{"v":33,"d":"33.0"},{"v":33,"d":"33.0"},{"v":72.82,"d":"72.8"},null,{"v":40,"d":"40.0"},{"v":53.55,"d":"53.6"},{"v":53.55,"d":"53.6"},{"v":39.42,"d":"39.4"},53.6,{"v":47.45,"d":"47.5"},63.9,{"v":66.25,"d":"66.3"},null,{"v":69,"d":"69.0"},{"v":71.95,"d":"72.0"},47.2,47.2,{"v":84.22,"d":"84.2"},86.4,24.8,24.8,{"v":31,"d":"31.0"},{"v":66.62,"d":"66.6"},{"v":66.62,"d":"66.6"},92.9,{"v":31,"d":"31.0"},{"v":26,"d":"26.0"},{"v":37,"d":"37.0"},{"v":49,"d":"49.0"},{"v":44.55,"d":"44.6"},{"v":58,"d":"58.0"},{"v":29,"d":"29.0"},{"v":86,"d":"86.0"},{"v":29,"d":"29.0"},null,null,{"v":31,"d":"31.0"},{"v":54,"d":"54.0"},{"v":65.85,"d":"65.9"},{"v":42,"d":"42.0"},85.4,{"v":16,"d":"16.0"},{"v":111.35,"d":"111.4"},{"v":111.35,"d":"111.4"},null,{"v":49.97,"d":"50.0"},{"v":22.95,"d":"23.0"},{"v":111.35,"d":"111.4"},82.6,{"v":36,"d":"36.0"},45.9,74.6,{"v":68,"d":"68.0"},21.2,{"v":46,"d":"46.0"},{"v":46,"d":"46.0"},{"v":49,"d":"49.0"},{"v":23.55,"d":"23.6"},76.3,{"v":54.37,"d":"54.4"},{"v":85.35,"d":"85.4"},{"v":47.55,"d":"47.6"},73.9,47.2,{"v":180,"d":"180.0"},{"v":33,"d":"33.0"},{"v":148.25,"d":"148.3"},{"v":63,"d":"63.0"},{"v":37,"d":"37.0"},{"v":45.95,"d":"46.0"},30.3,30.3,{"v":46,"d":"46.0"},{"v":111.35,"d":"111.4"},47.7,{"v":86,"d":"86.0"},{"v":86,"d":"86.0"},{"v":12,"d":"12.0"},{"v":86,"d":"86.0"},{"v":126.73,"d":"126.7"},{"v":55.87,"d":"55.9"},32.6,{"v":69,"d":"69.0"},88.2,88.2,65.5,{"v":66,"d":"66.0"},72.6,47.2,{"v":44,"d":"44.0"},{"v":40.63,"d":"40.6"},{"v":31,"d":"31.0"},{"v":40,"d":"40.0"},81.3,86.5,47.5,{"v":74,"d":"74.0"},27.7,{"v":29,"d":"29.0"},{"v":36,"d":"36.0"},{"v":174,"d":"174.0"},null,{"v":29.25,"d":"29.3"},92.9,{"v":58,"d":"58.0"},{"v":62.95,"d":"63.0"},{"v":89.35,"d":"89.4"},89.4,{"v":68,"d":"68.0"},{"v":53.45,"d":"53.5"},{"v":34.63,"d":"34.6"},42.6,{"v":31,"d":"31.0"},{"v":55,"d":"55.0"},{"v":41.42,"d":"41.4"},{"v":33,"d":"33.0"},41.7,102.5,{"v":72.82,"d":"72.8"},{"v":47.28,"d":"47.3"},42.6,42.6,42.6,81.3,{"v":72.55,"d":"72.6"},{"v":77.67,"d":"77.7"},18.2,47.2,68.9,89.4,{"v":58,"d":"58.0"},{"v":54.37,"d":"54.4"},92.9,53.9,48.8,{"v":36,"d":"36.0"},{"v":144,"d":"144.0"},53.6,{"v":70,"d":"70.0"},92.9,77.5,53.9,{"v":76.25,"d":"76.3"},81.3,48.8,48.8,33.6,{"v":167.45,"d":"167.5"},{"v":16,"d":"16.0"},89.4,81.3,81.3,81.3,{"v":68,"d":"68.0"},{"v":26,"d":"26.0"},{"v":65.15,"d":"65.2"},{"v":51.12,"d":"51.1"},65.2,41.7,{"v":86,"d":"86.0"},{"v":86,"d":"86.0"},74.6,{"v":86.35,"d":"86.4"},74.6,{"v":59,"d":"59.0"},{"v":35.92,"d":"35.9"},18.2,{"v":86,"d":"86.0"},{"v":86,"d":"86.0"},{"v":65,"d":"65.0"},{"v":65,"d":"65.0"},{"v":65,"d":"65.0"},{"v":65,"d":"65.0"},78.6,{"v":51.79,"d":"51.8"},78.6,{"v":65,"d":"65.0"},null,{"v":52.43,"d":"52.4"},50.9,74.6,74.6,{"v":75,"d":"75.0"},50.9,48.8,{"v":51.12,"d":"51.1"},50.9,50.9,{"v":31,"d":"31.0"},{"v":31,"d":"31.0"},{"v":59.35,"d":"59.4"},{"v":59.35,"d":"59.4"},{"v":45,"d":"45.0"},{"v":45,"d":"45.0"},{"v":70,"d":"70.0"},66.6,{"v":68,"d":"68.0"},66.3,{"v":29,"d":"29.0"},48.8,77.5,42.2,{"v":33,"d":"33.0"},{"v":67.82,"d":"67.8"},{"v":40,"d":"40.0"},{"v":62.95,"d":"63.0"},{"v":19.59,"d":"19.6"},{"v":31,"d":"31.0"},{"v":70,"d":"70.0"},{"v":23,"d":"23.0"},{"v":108.35,"d":"108.4"},{"v":73.98,"d":"74.0"},{"v":35.15,"d":"35.2"},42.2,{"v":74.43,"d":"74.4"},null,{"v":68,"d":"68.0"},{"v":30.92,"d":"30.9"},{"v":27,"d":"27.0"},{"v":71.14,"d":"71.1"},47.2,{"v":73.98,"d":"74.0"},{"v":29,"d":"29.0"},53.6,53.6,79.2,{"v":19.59,"d":"19.6"},42.6,89.4,{"v":40.63,"d":"40.6"},null,{"v":115,"d":"115.0"},{"v":20,"d":"20.0"},{"v":49,"d":"49.0"},{"v":68,"d":"68.0"},null,{"v":114.04,"d":"114.0"},{"v":71,"d":"71.0"},42.6,193.8,{"v":86,"d":"86.0"},40.6,32.6,{"v":66.95,"d":"67.0"},{"v":12,"d":"12.0"},null,{"v":72.15,"d":"72.2"},{"v":58,"d":"58.0"},{"v":44.55,"d":"44.6"},{"v":60.45,"d":"60.5"},65.5,32.3,46.2,49.8,49.8,{"v":38,"d":"38.0"},{"v":26,"d":"26.0"},{"v":58,"d":"58.0"},null,{"v":94,"d":"94.0"},{"v":45.95,"d":"46.0"},{"v":44,"d":"44.0"},{"v":41,"d":"41.0"},{"v":70,"d":"70.0"},{"v":37,"d":"37.0"},{"v":76.95,"d":"77.0"},{"v":76.95,"d":"77.0"},{"v":32.59,"d":"32.6"},{"v":31,"d":"31.0"},{"v":39,"d":"39.0"},47.2,{"v":29,"d":"29.0"},{"v":51.79,"d":"51.8"},{"v":50,"d":"50.0"},null,{"v":89.11,"d":"89.1"},{"v":29.25,"d":"29.3"},{"v":26,"d":"26.0"},{"v":58,"d":"58.0"},{"v":86,"d":"86.0"},81.3,89.4,{"v":70,"d":"70.0"},32.6,{"v":72.15,"d":"72.2"},{"v":46,"d":"46.0"},{"v":29,"d":"29.0"},92.9,{"v":34,"d":"34.0"},{"v":114.04,"d":"114.0"},{"v":114,"d":"114.0"},33.6,null,{"v":45,"d":"45.0"},null,{"v":33.45,"d":"33.5"},40.6,53.6,{"v":27,"d":"27.0"},81.3,{"v":35,"d":"35.0"},42.6,{"v":35,"d":"35.0"},82.5,{"v":35.92,"d":"35.9"},35.9,null,47.2,{"v":31,"d":"31.0"},null,42.6,{"v":71,"d":"71.0"},{"v":36,"d":"36.0"},82.6,{"v":174,"d":"174.0"},45.2,35.9,{"v":73,"d":"73.0"},40.6,50.9,{"v":89.35,"d":"89.4"},{"v":39,"d":"39.0"},{"v":39,"d":"39.0"},{"v":39,"d":"39.0"},{"v":39,"d":"39.0"},{"v":77,"d":"77.0"},66.3,null,{"v":70,"d":"70.0"},{"v":31,"d":"31.0"},81.3,35.2,35.2,{"v":42.55,"d":"42.6"},46.6,53.9,{"v":32,"d":"32.0"},{"v":32.49,"d":"32.5"},null,92.9,92.9,{"v":89.11,"d":"89.1"},{"v":44,"d":"44.0"},{"v":65,"d":"65.0"},null,56.6,null,{"v":84.22,"d":"84.2"},{"v":47.28,"d":"47.3"},{"v":111.35,"d":"111.4"},193.8,78.3,null,{"v":31,"d":"31.0"},{"v":72.06,"d":"72.1"},47.5,81.3,{"v":26,"d":"26.0"},{"v":39,"d":"39.0"},63.9,65.2,65.2,43.6,{"v":16,"d":"16.0"},108.4,50.9,{"v":66,"d":"66.0"},40.6,null,{"v":26,"d":"26.0"},21.2,46.6,72.6,{"v":23.55,"d":"23.6"},{"v":67.82,"d":"67.8"},{"v":42.55,"d":"42.6"},37.6,{"v":45,"d":"45.0"},108.4,{"v":49,"d":"49.0"},{"v":46,"d":"46.0"},47.2,42.6,40.5,{"v":40.49,"d":"40.5"},72.6,33.6,{"v":33,"d":"33.0"},193.8,35.2,{"v":39,"d":"39.0"},{"v":58,"d":"58.0"},null,48.8,{"v":39.95,"d":"40.0"},48.8,193.8,{"v":126.73,"d":"126.7"},{"v":33.63,"d":"33.6"},{"v":37,"d":"37.0"},{"v":60.45,"d":"60.5"},{"v":52.43,"d":"52.4"},{"v":69,"d":"69.0"},{"v":58,"d":"58.0"},{"v":68,"d":"68.0"},{"v":33,"d":"33.0"},30.3,null,{"v":33,"d":"33.0"},{"v":33,"d":"33.0"},{"v":79.57,"d":"79.6"},79.6,{"v":37,"d":"37.0"},{"v":47.55,"d":"47.6"},{"v":47,"d":"47.0"},{"v":49,"d":"49.0"},{"v":64,"d":"64.0"},{"v":79.95,"d":"80.0"},{"v":45,"d":"45.0"},{"v":45,"d":"45.0"},{"v":49,"d":"49.0"},78.3,69.1,null,{"v":34,"d":"34.0"},{"v":34,"d":"34.0"},{"v":51.79,"d":"51.8"},{"v":36.97,"d":"37.0"},{"v":32,"d":"32.0"},null,{"v":47.04,"d":"47.0"},{"v":45.95,"d":"46.0"},{"v":41,"d":"41.0"},{"v":45,"d":"45.0"},{"v":42.55,"d":"42.6"},{"v":70,"d":"70.0"},{"v":35.15,"d":"35.2"},42.6,42.6,42.6,63.9,56.6,{"v":58,"d":"58.0"},{"v":34,"d":"34.0"},72.6,{"v":34,"d":"34.0"},92.9,35.9,{"v":74.43,"d":"74.4"},{"v":70,"d":"70.0"},{"v":16,"d":"16.0"},{"v":177,"d":"177.0"},{"v":32,"d":"32.0"},46.6,{"v":40,"d":"40.0"},{"v":47,"d":"47.0"},{"v":70,"d":"70.0"},{"v":41,"d":"41.0"},47.2,30.3,null,{"v":49,"d":"49.0"},{"v":91,"d":"91.0"},{"v":42,"d":"42.0"},{"v":76.25,"d":"76.3"},82.5,{"v":33,"d":"33.0"},{"v":57,"d":"57.0"},42.6,35.9,42.6,{"v":47.04,"d":"47.0"},{"v":73,"d":"73.0"},48.8,34.8,{"v":71,"d":"71.0"},48.8,{"v":37,"d":"37.0"},{"v":37,"d":"37.0"},29.2,{"v":32,"d":"32.0"},72.2,27.7,{"v":68.87,"d":"68.9"},102.5,{"v":108.35,"d":"108.4"},{"v":84.52,"d":"84.5"},{"v":23,"d":"23.0"},null,{"v":36,"d":"36.0"},43.6,{"v":28,"d":"28.0"},46.6,{"v":51.02,"d":"51.0"},{"v":115,"d":"115.0"},{"v":86.35,"d":"86.4"},{"v":79.95,"d":"80.0"},{"v":77.67,"d":"77.7"},21.2,{"v":34,"d":"34.0"},{"v":31,"d":"31.0"},null,{"v":40,"d":"40.0"},{"v":42,"d":"42.0"},41.7,23.2,{"v":32.29,"d":"32.3"},53.6,53.6,53.6,53.6,{"v":68,"d":"68.0"},53.6,66.6,66.6,{"v":86,"d":"86.0"},{"v":36,"d":"36.0"},{"v":26,"d":"26.0"},{"v":65.85,"d":"65.9"},{"v":167.45,"d":"167.5"},null,{"v":20,"d":"20.0"},{"v":26,"d":"26.0"},{"v":33.45,"d":"33.5"},{"v":37.59,"d":"37.6"},{"v":177,"d":"177.0"},63.9,63.9,39.2,{"v":40,"d":"40.0"},{"v":26,"d":"26.0"},{"v":39,"d":"39.0"},null,79.2,{"v":52.44,"d":"52.4"},{"v":57,"d":"57.0"},46.2,{"v":69,"d":"69.0"},{"v":59,"d":"59.0"},{"v":72.06,"d":"72.1"},47.2,{"v":45,"d":"45.0"},{"v":115,"d":"115.0"},42.6,34.8,{"v":41.42,"d":"41.4"},72.6,193.8,74.6,{"v":75,"d":"75.0"},193.8,46.2,{"v":39.95,"d":"40.0"},{"v":59,"d":"59.0"},193.8,48.8,92.9,{"v":34,"d":"34.0"},{"v":22.95,"d":"23.0"},{"v":34,"d":"34.0"},{"v":91,"d":"91.0"},{"v":26,"d":"26.0"},{"v":35,"d":"35.0"},{"v":35,"d":"35.0"},{"v":35,"d":"35.0"},47.5,{"v":63,"d":"63.0"},{"v":180,"d":"180.0"},{"v":68,"d":"68.0"},45.2,{"v":84.52,"d":"84.5"},42.6,{"v":69,"d":"69.0"},{"v":86,"d":"86.0"},32.3,{"v":31,"d":"31.0"},{"v":115,"d":"115.0"},{"v":59,"d":"59.0"},{"v":46,"d":"46.0"},42.6,69.1,{"v":45,"d":"45.0"},{"v":51.02,"d":"51.0"},47.7,{"v":26,"d":"26.0"},{"v":39.42,"d":"39.4"},{"v":58,"d":"58.0"},{"v":44,"d":"44.0"},{"v":30.92,"d":"30.9"},{"v":109,"d":"109.0"},21.2,92.9,{"v":32,"d":"32.0"},{"v":86,"d":"86.0"},{"v":111.35,"d":"111.4"},{"v":68,"d":"68.0"},18.2,47.2,{"v":46,"d":"46.0"},{"v":69,"d":"69.0"},{"v":114,"d":"114.0"},{"v":37.59,"d":"37.6"},193.8,193.8,43.6,{"v":111.35,"d":"111.4"},193.8,42.6,63.9,null,{"v":148.25,"d":"148.3"},21.2,null,45.6,{"v":29,"d":"29.0"},108.4,null,null,{"v":26,"d":"26.0"},{"v":26,"d":"26.0"},49.8,null,49.8,66.3,{"v":40,"d":"40.0"},{"v":64,"d":"64.0"},43.6,{"v":70,"d":"70.0"},{"v":51.79,"d":"51.8"},{"v":77,"d":"77.0"},{"v":111.35,"d":"111.4"},{"v":111.35,"d":"111.4"},{"v":52.44,"d":"52.4"},{"v":44,"d":"44.0"},{"v":70,"d":"70.0"},{"v":70,"d":"70.0"},{"v":36.97,"d":"37.0"},{"v":70,"d":"70.0"},47.2,{"v":86,"d":"86.0"},{"v":71.87,"d":"71.9"},56.6,{"v":109,"d":"109.0"},69.1,44.2,{"v":144,"d":"144.0"},{"v":42,"d":"42.0"},{"v":42,"d":"42.0"},{"v":71.14,"d":"71.1"},{"v":29,"d":"29.0"},null,86.5,{"v":71.87,"d":"71.9"},{"v":63,"d":"63.0"},{"v":33,"d":"33.0"},{"v":36,"d":"36.0"},63.9,{"v":46,"d":"46.0"},{"v":40,"d":"40.0"},{"v":59,"d":"59.0"},35.9,{"v":39,"d":"39.0"},{"v":74,"d":"74.0"},{"v":55,"d":"55.0"},{"v":40,"d":"40.0"},{"v":52,"d":"52.0"},{"v":44,"d":"44.0"},{"v":54,"d":"54.0"},81.3,{"v":68,"d":"68.0"},{"v":36.95,"d":"37.0"},null,{"v":20,"d":"20.0"},66.6,{"v":43.15,"d":"43.2"},{"v":66.95,"d":"67.0"},{"v":33,"d":"33.0"},{"v":43.15,"d":"43.2"},86.5,{"v":42,"d":"42.0"},{"v":44,"d":"44.0"},{"v":34.63,"d":"34.6"},{"v":45.45,"d":"45.5"},{"v":44,"d":"44.0"},23.2,{"v":45.45,"d":"45.5"},{"v":35,"d":"35.0"},{"v":53.45,"d":"53.5"},85.4,66.3,42.6,69.1,66.6,{"v":68,"d":"68.0"},{"v":26,"d":"26.0"},{"v":68,"d":"68.0"},{"v":71,"d":"71.0"},{"v":29,"d":"29.0"},79.6,null,86.4,72.6,{"v":44,"d":"44.0"},{"v":59,"d":"59.0"},{"v":55.87,"d":"55.9"},{"v":59,"d":"59.0"},{"v":41,"d":"41.0"},{"v":31,"d":"31.0"},86.5,{"v":38,"d":"38.0"},{"v":28,"d":"28.0"},66.6,{"v":42,"d":"42.0"},{"v":32.49,"d":"32.5"},{"v":34,"d":"34.0"},81.3,81.3,49.8,{"v":44,"d":"44.0"},{"v":42,"d":"42.0"},{"v":55.95,"d":"56.0"},{"$nulls":143},"x"]
["Produtos banidos na União Européia (X)",null,null,"x",{"$nulls":4},"x","x","x",null,"x",null,"x","x","x",null,"x",null,"x",{"$nulls":4},"x","x",null,"x",null,"x",null,null,"x",null,"x",null,"x","x","x",{"$nulls":3},"x",null,null,"x","x",{"$nulls":3},"x","x",null,"x","x",null,null,"x","x","x","x",null,"x","x","x","x","x","x","x",null,"x",null,null,"x","x",{"$nulls":7},"x",null,null,"x","x",null,null,"x","x",null,"x","x",{"$nulls":4},"x",null,"x","x","x",null,null,"x",null,null,"x","x","x",{"$nulls":3},"x","x","x",null,"x",null,null,"x","x",null,null,"x",{"$nulls":4},"x","x","x","x","x",null,"x","x",null,"x",null,"x","x","x","x","x","x",null,"x",null,"x","x","x","x","x","x",null,null,"x","x",null,"x",null,null,"x","x","x",{"$nulls":8},"x","x",{"$nulls":4},"x","x","x",null,"x",null,"x",null,null,"x","x","x",null,"x","x",null,"x","x","x",null,"x","x","x","x","x",null,"x","x","x","x","x",{"$nulls":5},"x","x","x","x","x",null,"x",{"$nulls":7},"x",null,"x",null,"x","x","x","x","x","x","x","x",null,"x","x",{"$nulls":4},"x","x",{"$nulls":5},"x","x",{"$nulls":3},"x",null,"x",{"$nulls":8},"x",null,null,"x",null,"x",null,null,"x","x",null,"x","x","x","x","x",{"$nulls":3},"x","x",null,"x","x","x",null,null,"x",{"$nulls":7},"x","x",{"$nulls":15},"x",null,null,"x",{"$nulls":4},"x",{"$nulls":3},"x","x","x",null,"x",null,"x","x","x","x",null,null,"x",null,"x",null,"x","x","x","x","x",null,"x",null,null,"x","x",null,"x",{"$nulls":3},"x",null,null,"x",null,"x",null,"x","x","x","x","x","x","x",{"$nulls":5},"x",{"$nulls":3},"x","x","x","x",null,"x","x","x",{"$nulls":4},"x",null,null,"x","x",null,"x",null,null,"x","x",null,null,"x",null,null,"x",null,null,"x","x",null,"x",null,null,"x","x","x",null,null,"x","x",null,"x","x","x","x","x","x","x","x",null,"x",null,"x","x",null,"x",null,"x","x","x","x",null,null,"x",null,null,"x",{"$nulls":10},"x","x",null,"x","x","x",null,null,"x",{"$nulls":5},"x",{"$nulls":3},"x",{"$nulls":6},"x",null,"x","x","x",null,"x","x",{"$nulls":3},"x","x","x","x",{"$nulls":3},"x",null,"x",null,"x",{"$nulls":6},"x","x",null,null,"x",null,"x","x","x",null,"x",null,null,"x",null,"x",{"$nulls":5},"x",null,"x","x",null,"x",null,"x",null,"x",null,"x","x","x",null,null,"x","x","x","x","x","x","x",{"$nulls":4},"x",null,"x","x",null,null,"x","x","x","x","x","x","x",null,null,"x",null,"x",{"$nulls":5},"x","x",{"$nulls":4},"x","x","x","x","x",null,null,"x","x","x","x","x",null,null,"x","x",{"$nulls":3},"x","x","x",{"$nulls":6},"x",null,null,"x","x",null,null,"x","x","x","x","x",{"$nulls":5},"x","x",null,"x","x",null,"x",{"$nulls":3},"x","x","x","x","x","x",null,"x",{"$nulls":3},"x",{"$nulls":3},"x","x","x","x",null,"x",null,null,"x","x","x",{"$nulls":3},"x","x","x",{"$nulls":5},"x","x",{"$nulls":4},"x","x",{"$nulls":5},"x",null,"x",null,null,"x","x","x","x","x","x","x",null,"x",{"$nulls":3},"x",null,"x","x",null,null,"x",null,null,"x","x","x",{"$nulls":8},"x",{"$nulls":4},"x",null,"x","x",null,null,"x",null,"x",null,"x",null,"x",null,null,"x",{"$nulls":4},"x",null,"x","x"]
["Ano do banimento na UE",null,null,2009,{"$nulls":4},2003,2003,2003,{"$nulls":4},2007,null,null,2009,{"$nulls":9},2009,null,2009,null,null,2011,null,2022,null,2002,2002,2009,{"$nulls":11},2009,2011,null,2009,{"$nulls":3},2011,null,null,2002,null,2009,null,2004,2004,2004,2008,2009,{"$nulls":4},2002,2003,{"$nulls":7},2022,null,null,2022,2009,{"$nulls":3},2009,{"$nulls":7},2009,null,2009,2009,2009,null,null,2009,{"$nulls":3},2009,{"$nulls":4},2009,{"$nulls":3},2009,null,null,2002,{"$nulls":3},2009,{"$nulls":4},2007,2009,null,2009,2009,null,2009,null,null,2022,null,2002,2002,2008,2009,2009,2003,{"$nulls":4},2009,2009,2008,2009,2009,null,null,2009,null,null,2022,null,null,2022,2022,2011,{"$nulls":8},2001,2002,{"$nulls":4},2009,2009,2009,null,2002,null,2022,null,null,2022,2002,{"$nulls":3},2004,null,2022,2009,2002,null,2009,null,null,2009,2002,null,2022,2009,2009,2009,{"$nulls":6},2009,2009,2009,2002,2009,{"$nulls":13},2009,2009,2009,2009,2009,2002,2009,null,null,2009,2009,{"$nulls":4},2007,2022,{"$nulls":6},2009,{"$nulls":3},2009,null,2002,{"$nulls":8},2009,{"$nulls":4},2003,null,null,2004,2004,null,2002,2009,2009,null,2007,{"$nulls":4},2009,null,2000,2009,2009,null,null,2022,{"$nulls":7},2008,2022,{"$nulls":15},2022,null,null,2002,{"$nulls":8},2009,2009,2022,null,2022,null,2007,null,2022,2009,null,null,2009,null,2022,null,null,2002,2004,null,2009,null,2009,{"$nulls":5},2002,{"$nulls":3},2022,null,null,2009,{"$nulls":3},2002,2009,2022,2002,2002,2002,2002,{"$nulls":5},2009,{"$nulls":3},2009,2002,null,2004,null,2022,2022,{"$nulls":5},2009,null,null,2009,2009,{"$nulls":4},2008,2009,null,null,2009,{"$nulls":5},2009,2009,{"$nulls":4},2009,2009,{"$nulls":4},2007,null,2009,2007,2002,2009,null,null,2009,2009,null,2009,null,2002,{"$nulls":5},2009,null,2009,null,null,2009,{"$nulls":13},2009,null,null,2022,2022,2009,null,null,2009,{"$nulls":9},2007,{"$nulls":6},2009,null,null,2009,2009,null,2022,{"$nulls":6},2009,2009,{"$nulls":3},2003,{"$nulls":11},2009,{"$nulls":4},2000,null,2022,null,2009,null,null,2009,null,2001,{"$nulls":7},2009,null,null,2002,null,2009,null,2009,null,null,2009,{"$nulls":3},2022,2004,2004,2004,2004,2011,2004,{"$nulls":4},2006,null,2002,{"$nulls":4},2019,null,2009,2009,null,2009,null,null,2009,null,2022,{"$nulls":5},2003,2022,{"$nulls":4},2009,2009,2009,2002,2009,{"$nulls":3},2009,null,2022,2009,{"$nulls":3},2006,{"$nulls":3},2008,{"$nulls":8},2022,{"$nulls":3},2007,null,null,2022,null,null,2006,2004,{"$nulls":5},2022,null,null,2009,2011,null,2002,{"$nulls":3},2019,2009,2009,null,2009,2009,null,2009,{"$nulls":7},2007,2007,2006,2006,null,2007,{"$nulls":8},2009,2009,2022,{"$nulls":5},2002,2009,{"$nulls":11},2009,null,2009,null,null,2009,2007,{"$nulls":3},2002,2009,{"$nulls":5},2009,null,2022,2009,{"$nulls":6},2009,{"$nulls":9},2009,{"$nulls":4},2011,null,2011,2022,null,null,2009,null,2009,{"$nulls":6},2009,{"$nulls":4},2004,null,2009,2009]
[{"$f":"COUNTA(C22:OM22)","v":401},null,1,2,3,4,5,6,7,8,9,10,11,12,13,14,15,16,17,18,19,20,21,22,23,24,25,26,27,28,29,30,31,32,33,34,35,36,37,38,39,40,41,42,43,44,45,46,47,48,49,50,51,52,53,54,55,56,57,58,59,60,61,62,63,64,65,66,67,68,69,70,71,72,73,74,75,76,77,78,79,80,81,82,83,84,85,86,87,88,89,90,91,92,93,94,95,96,97,98,99,100,101,102,103,104,105,106,107,108,109,110,111,112,113,114,115,116,117,118,119,120,121,122,123,124,125,126,127,128,129,130,131,132,133,134,135,136,137,138,139,140,141,142,143,144,145,146,147,148,149,150,151,152,153,154,155,156,157,158,159,160,161,162,163,164,165,166,167,168,169,170,171,172,173,174,175,176,177,178,179,180,181,182,183,184,185,186,187,188,189,190,191,192,193,194,195,196,197,198,199,200,201,202,203,204,205,206,207,208,209,210,211,212,213,214,215,216,217,218,219,220,221,222,223,224,225,226,227,228,229,230,231,232,233,234,235,236,237,238,239,240,241,242,243,244,245,246,247,248,249,250,251,252,253,254,255,256,257,258,259,260,261,262,263,264,265,266,267,268,269,270,271,272,273,274,275,276,277,278,279,280,281,282,283,284,285,286,287,288,289,290,291,292,293,294,295,296,297,298,299,300,301,302,303,304,305,306,307,308,309,310,311,312,313,314,315,316,317,318,319,320,321,322,323,324,325,326,327,328,329,330,331,332,333,334,335,336,337,338,339,340,341,342,343,344,345,346,347,348,349,350,351,352,353,354,355,356,357,358,359,360,361,362,363,364,365,366,367,368,369,370,371,372,373,374,375,376,377,378,379,380,381,382,383,384,385,386,387,388,389,390,391,392,393,394,395,396,397,398,399,400,401]
["BASE DE DADOS (QUESTIONARIO;INDICADORES;RELATORIO)",null,"Q2DATA","Q3COLABORADOR_NOME","Q3COLABORADOR_CPF","Q4PRODUTOR_NOME","Q4PRODUTOR_CPF","Q4PRODUTOR_IDADE","Q5IMOVEL_GEOLOCALIZACAO","Q5MUNICIPIO","Q5ESTADO","Q5CURSO_DAGUA_PRINCIPAL","Q6POSSE","Q6PROCESSO_SUCESSORIO","Q6PARTICIPACAO_DA_MULHER","Q7IMOVEL_NOME","Q7IMOVEL_AREA","Q7TAMANHO_MODULO_FISCAL","Q7IMOVEL_NUMERO_MFs","Q7ENQUADRAMENTO_AGRICULTURA_FAMILIAR","Q7AREA_NAO_CONTIGUA_DESCRICAO","Q7AREA_NAO_CONTIGUA_HECTARES","Q8LAVOURAS_PERMANENTES","Q8LAVOURAS_TEMPORARIAS","Q8PASTAGENS","Q8SILVICULTURA","Q8AREA_NAO_AGRICOLA","Q8POUSIO","Q8CORPOS_DAGUA","Q8VEGETACAO_NATIVA","Q8AREAS_NAO_APROVEITAVEIS","Q8AREA_TOTAL","Q9CAR_USO_CONSOLIDADO","Q9CAR_USO_NAO_CONSOLIDADO_OUTROS_USOS","Q9CAR_POUSIO","Q9CAR_CORPOS_DAGUA","Q9CAR_VEGETACAO_NATIVA","Q9CAR_SERVIDAO_ADMINISTRATIVA","Q9CAR_AREA_TOTAL","Q9CAR_QUANTIDADE_MODULOS_FISCAIS","Q9DIFERENCA_AREA_TOTAL_CAR_USO_ATUAL","Q9CAR_APP_AREA_TOTAL","Q9CAR_APP_RECUPERAR","Q9CAR_APP_USO_CONSOLIDADO_VEGETACAO_NATIVA","Q9CAR_APP_RECUPERAR_IMOVE_<4MF","Q10RESERVA_LEGAL_AREA_VEGETACAO_NATIVA_EXCEDENTE","Q11CURSOS_DAGUA","Q11NASCENTES","Q11LAGOS_LAGOAS_NATURAIS","Q11REPRESAS","Q11USO_AGUA_SUPERFICIAL","Q11USO_AGUA_SUBTERRANEA","Q11AGUA_DISPONIBILIDADE_PROBLEMAS","Q11AGUA_DISPONIBILIDADE_PROBLEMAS_ESPECIFICACAO","Q12OUTORGA_USO_AGUA","Q12LICENCIAMENTO_AMBIENTAL","Q12REGULARIZACAO_AMBIENTAL_CAR","Q13PONTOS_CRITICOS_DESCRICAO1","Q13PONTOS_CRITICOS_DESCRICAO2","Q13PONTOS_CRITICOS_DESCRICAO3","I1RECEITA_BRUTA_ATIVIDADE_DESCRICAO1","I1RECEITA_BRUTA_VALOR_ESTIMADO1","I1RECEITA_BRUTA_ATIVIDADE_DESCRICAO2","I1RECEITA_BRUTA_VALOR_ESTIMADO2","I1RECEITA_BRUTA_ATIVIDADE_DESCRICAO3","I1RECEITA_BRUTA_VALOR_ESTIMADO3","I1ATIVIDADE1_DESCRICAO","I1ATIVIDADE1_UNID","I1ATIVIDADE1_PRODUTIVIDADE","I1ATIVIDADE1_PRECO","I1ATIVIDADE1_PRODUTIVIDE_REGIONAL","I1ATIVIDADE1_PRECO_REGIONAL","I1ATIVIDADE2_DESCRICAO","I1ATIVIDADE2_UNID","I1ATIVIDADE2_PRODUTIVIDADE","I1ATIVIDADE2_PRECO","I1ATIVIDADE2_PRODUTIVIDE_REGIONAL","I1ATIVIDADE2_PRECO_REGIONAL","I1ATIVIDADE3_DESCRICAO","I1ATIVIDADE3_UNID","I1ATIVIDADE3_PRODUTIVIDADE","I1ATIVIDADE3_PRECO","I1ATIVIDADE3_PRODUTIVIDE_REGIONAL","I1ATIVIDADE3_PRECO_REGIONAL","I1RESULTADO","I2ATIVIDADE_DESCRICAO1","I2ATIVIDADE_VALOR1","I2ATIVIDADE_DESCRICAO2","I2ATIVIDADE.VALOR2","I2ATIVIDADE_DESCRICAO3","I2ATIVIDADE_VALOR3","I2PENSAO_APOSENTADORIA_BOLSAS","I2OUTRAS_ATIVIDADES_PRESTACAO_SERVICOS","I2ATIVIDADES_AGRICOLAS_IMOVEL","I2OUTRAS_ATIVIDADES_IMOVEL","I2ATIVIDADES_FORA_DO_IMOVEL","I2PENSAO_APOSENTADORIA_BOLSAS","I2CONCENTRACAO_DE_RENDA_ATIVIDADE","I2RESULTADO","I3PERIODO_DE_AVALIACAO","I3BENFEITORIAS_RECENTES","I3BENFEITORIAS_RECENTES_VALOR","I3BENFEITORIAS_EXISTENTES","I3BENFEITORIAS_EXISTENTES_VALOR","I3BENFEITORIAS_TOTAL","I3EQUIPAMENTOS_RECENTES","I3EQUIPAMENTOS_RECENTES_VALOR","I3EQUIPAMENTOS_EXISTENTES","I3EQUIPAMENTOS_EXISTENTES_VALOR","I3EQUIPAMENTOS_TOTAL","I3SEMOVENTES_ESTOQUE_TOTAL","I3SEMOVENTES_ESTOQUE_TOTAL_HIST","I3IRRIGACAO_TIPO","I3IRRIGACAO_AREA","I3IRRIGACAO_HISTORICO_AREA","I3USO_DO_SOLO_AREA_TOTAL","I3USO_DO_SOLO_AREA_TOTAL_HIST","I3VALOR_DA_TERRA","I3VALOR_DA_TERRA_HIST","I3ESTIMATIVA_PATRIMONIAL","I3ESTIMATIVA_PATRIMONIAL_HIST","I3VALORIZACAO_DA_TERRA","I3EVOLUCAO_BENFEITORIAS","I3EVOLUCAO_EQUIPAMENTOS","I3EVOLUCAO_SEMOVENTES","I3EVOLUCAO_AREAS_AGRICOLAS_IRRIGACAO","I3EVOLUCAO_PATRIMONIAL_TOTAL","I3EVOLUCAO_PATRIMONIAL_TOTAL_SEM_VALORIZACAO_DA_TERRA","I3RESULTADO","I4FINANCIAMENTOS_COMPROMISSOS_FINANCEIROS","I4FINANCIAMENTOS_COMPROMISSOS_FINANCEIROS_PROPORCAO_ESTIMATIVA_PATRIMONIAL","I4RESULTADO","I5RESIDENCIAS","I5DISPONIBILIDADE_DE_AGUA","I5ENERGIA_ELETRICA","I5ESTRADA_DE_ACESSO","I5SERVICO_DE_SAUDE","I5TRANSPORTE_ESCOLAR","I5SEGURANCA","I5INTERNET","I5COLETADELIXO","I5RESULTADO_PARCIAL1","I5HORTALICAS","I5POMAR","I5ANIMAIS","I5RESULTADO_PARCIAL2","I5RESULTADO","I6FAMILIA","I6FAMILIA_ESCOLARIDADE_MENOR_9ANOS","I6FAMILIA_FUNDAMENTAL","I6FAMILIA_ENSINO_MEDIO","I6FAMILIA_CURSO_SUPERIOR","I6COLABORADORES","I6COLABORADORES_ESCOLARIDADE_MENOR_9ANOS","I6COLABORADORES_FUNDAMENTAL","I6COLABORADORES_ENSINO_MEDIO","I6COLABORADORES_CURSO_SUPERIOR","I6FAMILIA_CAPACITACAO_CURTA","I6FAMILIA_CAPACITACAO_LONGA","I6COLABORADORES_CAPACITACAO_CURTA","I6COLABORADORES_CAPACITACAO_LONGA","I6FAMILIA_6A18ANOS","I6FAMILIA_6A18ANOS_FREQ_ESCOLA","I6COLABORADORES_6A18ANOS","I6COLABORADORES_6A18ANOS_FREQ_ESCOLA","I6RESULTADO","I7FUNCIONARIOS","I7FUNCIONARIOS_REGISTRADOS","I7PGTO_HORA_EXTRA_AUSENCIA_HORA_EXTRA","I7SM>1","I7AUXILIO_ALIMENTACAO","I7AUXILIO_MORADIA","I7AUXILIO_EDUCACAO","I7PARTICIPACAO_LUCROS","I7SEGURO_ACIDENTES","I7ACESSO_LAZER","I7ESPACO_CULTIVOS","I7_FUNCIONARIOS_TEMPORARIOS_PROPORCAO","I7RESULTADO","I8FLUXO_DE_CAIXA","I8CUSTO_DE_PRODUCAO","I8ASSITENCIA_TECNICA","I8PARTICIPACAO_ASSOCIATIVA","I8REGUULARIZACAO_AMBIENTAL","I8CREDITO_INVESTIMENTOS","I8CREDITO_CUSTEIO","I8CREDITO_COMERCIALIZACAO","I8RESULTADO","I9INFORMACAO_COMPRADORES_DIVERSIFICADOS","I9PRODUTOS_CERTIFICADOS_MERCADO_INSTITUCIONAL","I9INOVACAO_ADOCAO","I9INOVACAO_ADOCAO_DESCRICAO","I9INOVACAO_CAPACIDADE_LIDERANCA","I9INOVACAO_CAPACIDADE_LIDERANCA_DESCRICAO","I9USO_DE_BIOINSUMOS","I9USO_DE_BIOINSUMOS_PROPORCAO","I9PLANTAS_DE_COBERTURA_OU_ESPECIES_ARBÓREAS","I9PLANTAS_DE_COBERTURA_OU_ESPECIES_ARBÓREAS_PROPORCAO","I9RESULTADO","I10ESGOTO1","I10ESGOTO2","I10LIXO1","I10LIXO2","I10COLETA_DESTINACAO_ADEQUADA_RESIDUOS_SOLIDOS","I10COLETA_DESTINACAO_ADEQUADA_EFLUENTES_LIQUIDOS","I10COLETA_DESTINACAO_ADEQUADA_EFLUENTES_GASOSOS","I10PONTO_CRITICO","I10PONTO_CRITICO_DESCRICAO","I10RESULTADO","I11AGROTOXICOS_MANUSEIO_PESSOAS","I11AGROTOXICOS_EPI_PESSOAS","I11AGROTOXICOS_ARMAZENAMENTO_ADEQUADO","I11AGROTOXICOS_DEVOLUCAO_EMBALAGENS","I11RESULTADO","I12DESCRICAO","I12ARGILA","I12TEXTURA","I12MOS_DAGKG-1","I12MOS","I12P_MGDM-3","I12P","I12CALCIO_CMOLDM-3","I12CALCIO","I12MAGNESIO_CMOLDM-3","I12MAGNESIO","I12POTASSIO_MGDM-3","I12POTASSIO","I12PH_UNIDADE","I12PH","I12ALUMINIO_CMOLDM-3","I12ALUMINIO","I12CTC_EFETIVA_CMOLDM-3","I12CTC_EFETIVA","I12SATURACAO_POR_BASES_%","I12SATURACAO_POR_BASES","I12RESULTADO_PARCIAL1","I12ARILSULFATASE_MGPNITROFENOLKG-1H-1","I12BETAGLICOSIDASE_MGPNITROFENOLKG-1H-1","I12MOS_PROF010_DAGKG-1","I1IQS_BIOLOGICO","I12IQS_QUIMICO","I12SUPRIMENTO_NUTRIENTES","I12.2.7.IQS Químico ","I12.2.8.IQS FertBio","I12.2..IQS BIOLOGICO.RESULTADO PARCIAL","I12.RESULTADO","I13MONTANTE_MARGENS\n","I13JUSANTE_MARGENS\n","I13MONTANTE_ALTERACOES_ANTROPICAS\n","I13JUSANTE_ALTERACOES_ANTROPICAS\n","I13MONTANTE_SOMBREAMENTO\n","I13JUSANTE_SOMBREAMENTO\n","I13MONTANTE_EROSAO\n","I13JUSANTE_EROSAO\n","I13MONTANTE_TRANSPARENCIA\n","I13JUSANTE_TRANSPARENCIA\n","I13MONTANTE_ODOR\n","I13JUSANTE_ODOR\n","I13MONTANTE_FUNDO\n","I13JUSANTE_FUNDO\n","I13MONTANTE_ECOSSISTEMA_AQUÁTICO\n","I13JUSANTE_ECOSSISTEMA_AQUATICO\n","I13.AGUA_SUPERFICIAL_MONTANTE","I13.AGUA_SUPERFICIAL_JUSANTE","I13AGUA_SUBTERRANEA","I13RESULTADO","I14PRODUTO1","I14CULTURA1","I14AREA1","I14VOLUME_POR_HECTARE1 ","I14VOLUME_TOTAL1","I14PRINCIPIO_ATIVO1","I14POTENCIAL_CONTAMINACAO1","I14TALHAO_VULNERABILIDADE1","I14RISCO_DE_CONTAMINACAO1","I14PRODUTO2","I14CULTURA2","I14AREA2","I14VOLUME_POR_HECTARE2","I14VOLUME_TOTAL2","I14PRINCIPIO_ATIVO2","I14POTENCIAL_CONTAMINACAO2","I14TALHAO_VULNERABILIDADE2","I14RISCO_DE_CONTAMINACAO2","I14PRODUTO3","I14CULTURA3","I14AREA3","I14VOLUME_POR_HECTARE3","I14VOLUME_TOTAL3","I14PRINCIPIO_ATIVO3","I14POTENCIAL_CONTAMINACAO3","I14TALHAO_VULNERABILIDADE3","I14RISCO_DE_CONTAMINACAO3","I14CULTURA_DESCRICAO1","I14CULTURA_AREA1","I14CULTURA_RISCO_MAXIMO1","I14CULTURA_DESCRICAO2","I14CULTURA_AREA2","I14CULTURA_RISCO_MAXIMO2","I14CULTURA_DESCRICAO3","I14CULTURA_AREA3","I14CULTURA_RISCO_MAXIMO3","I14RESULTADO","I15ESTAGIO","I15AREA","I15PROPORCAO_AREA_TOTAL","I15TENDENCIA_COMPORTAMENTO","I15RESULTADO","I16PRATICAS_CONSERVACIONISTAS_SUFICIENTE\n\n\n","I16PRATICAS_CONSERVACIONISTAS_INSUFICIENTE\n\n\n","I16PRATICAS_CONSERVACIONISTAS_SITUACAO_CRITICA\n\n\n","I16SITUACAO_CRITICA_ESPECIFICACAO\n\n\n","I16AGUA_PRATICAS_CONSERVACIONISTAS_RESERVACAO\n\n\n","I16.RESULTADO","I17ESTRADAS_DRENAGEM\n","I17ESTRADAS_LOMBADAS\n","I17ESTRADAS_CAIXAS_INFILTRACAO\n","I17ESTRADAS_BURACOS\n","I17ESTRADAS_SULCOS_DE_EROSAO\n","I17PONTO_CRITICO\n","I17PONTO_CRITICO_DESCRICAO\n","I17RESULTADO","I18FITOFISIONOMIA1\n","I18FITOFISIONOMIA_ESTAGIO_SUCESSIONAL_AVANCADO1\n","I18FITOFISIONOMIA_ESTAGIO_SUCESSIONAL_MEDIO1\n","I18FITOFISIONOMIA_ESTAGIO_SUCESSIONAL_INICIAL1\n","I18FITOFISIONOMIA2\n","I18FITOFISIONOMIA_ESTAGIO_SUCESSIONAL_AVANCADO2\n","I18FITOFISIONOMIA_ESTAGIO_SUCESSIONAL_MEDIO2\n","I18FITOFISIONOMIA_ESTAGIO_SUCESSIONAL_INICIAL2\n","I18FITOFISIONOMIA3\n","I18FITOFISIONOMIA_ESTAGIO_SUCESSIONAL_AVANCADO3\n","I18FITOFISIONOMIA_ESTAGIO_SUCESSIONAL_MEDIO3\n","I18FITOFISIONOMIA_ESTAGIO_SUCESSIONAL_INICIAL3\n","I18FITOFISIONOMIA4\n","I18FITOFISIONOMIA_ESTAGIO_SUCESSIONAL_AVANCADO4\n","I18FITOFISIONOMIA_ESTAGIO_SUCESSIONAL_MEDIO4\n","I18FITOFISIONOMIA_ESTAGIO_SUCESSIONAL_INICIAL4\n","I18FRAGMENTOS_VEGETACAO_NATIVA\n","I18CONEXAO_FRAGMENTOS\n","I18PROTECAO_INCENDIO_PASTOREIO\n","I18RESULTADO","I19APP_USO_CONSOLIDADO_VEGETACAO_NATIVA","I19APP_RECOMPOSICAO","I19APP_PROTECAO_CONSERVACAO","19RESULTADO","I20RL","I20RL_RECOMPOSICAO","I20VEGETACAO_NATIVA_EXCEDENTE","I20RL_FORA_DO_IMOVEL_RURAL","I20RL_NAO_PASSIVEL_DE_RECOMPOSICAO","I20RL_NECESSITA_RECOMPOSICAO","I20RESULTADO","I21PRATICAS_INDUCAO_AGROBIODIVERSIDADE_SUFICIENTE\n\n\n","I21PRATICAS_INDUCAO_AGROBIODIVERSIDADE_INSUFICIENTE\n\n\n","I21PRATICAS_INDUCAO_AGROBIODIVERSIDADE_SITUACAO_CRITICA\n\n\n","I21SITUACAO_CRITICA_ESPECIFICACAO\n\n\n","I21INDUCAO_AGROBIODIVERSIDADE_RESULTADO\n\n\n","I21INDICE_SHANON","I21INDICE_SHANON_RESULTADO","I21AREAS_LIMITROFES_PRESSAO_DE_MONOCULTIVOS","I21RESULTADO","INDICE_SUSTENTABILIDADE","DESVIO_PADRAO","I1PRODUTIVIDADE","I2DIVERSIFICACAO_DA_RENDA","I3_EVOLUCAO_PATRIMONIAL","I4_GRAU_DE_ENDIVIDAMENTO","I5_SERVICOS_BASICOS_SEGURANCA_ALIMENTAR","I6ESCOLARIDADE_CAPACITACAO","I7QUALIDADE_DO_EMPREGO","I8GESTAO","I9COMERCIALIZACAO_INOVACAO","I10GERENCIAMENTO_RESIDUOS","I11SEGURANCA_DO_TRABALHO","I12SAUDE_DO_SOLO","I13QUALIDADE_DA_AGUA","I14RISCO_DE_CONTAMINACAO_DA_AGUA","I15AVALIACAO_SOLOS_DEGRADADOS","I16PRATICAS_CONSERVACAO","I17ESTRADAS","I18FITOFISIONOMIAS","I19APPS","I20RESERVA_LEGAL","I21DIVERSIFICACAO_DA_PAISAGEM","R1RENDA_BRUTA_ANUAL","R1RENDA_BRUTA_ANUAL_R$HA-1 ","R1RENDA_BRUTA_ANUAL_ESTIMATIVA_PATRIMONIAL-1 ","R1TERRA_VALOR_DE_REFERENCIA","R1ESTIMATIVA_PATRIMONIAL","R1EVOLUCAO_PATRIMONIAL_SEM_VALORIZACAO_DA_TERRA","R1QTE_AGROTOXICOS_AREA_CULTIVADA-1","R1IEQ_CUMULATIVO","R1NUMERO_DE_PRODUTOS_COMERCIAIS","R1IEQ_MEDIO","R1IEQ_MAX","R1IEQ_TRABALHADOR_RURAL_MEDIO","R1IEQ_TRABALHADOR_RURAL_MAX","R1IEQ_CONSUMIDOR_MEDIO","R1IEQ_CONSUMIDOR_MAX","R1IEQ_MEIO_AMBIENTE_MEDIO","R1IEQ_MEIO_AMBIENTE_MAX","R1PROPORCAO_PRODUTOS_UTILIZADOS_BANIDOS_UNIAO_EUROPEIA"]
[null,null,{"$f":"'1 QUESTIONÁRIO'!B36","v":"00:00:00"},{"$f":"'1 QUESTIONÁRIO'!B39","v":0},{"$f":"'1 QUESTIONÁRIO'!B41","v":0},{"$f":"'1 QUESTIONÁRIO'!B44","v":0},{"$f":"'1 QUESTIONÁRIO'!B46","v":0},{"$f":"'1 QUESTIONÁRIO'!B48","v":0},{"$f":"'1 QUESTIONÁRIO'!B51","v":0},{"$f":"'1 QUESTIONÁRIO'!B53","v":0},{"$f":"'1 QUESTIONÁRIO'!E53","v":0},{"$f":"'1 QUESTIONÁRIO'!B55","v":0},{"$f":"'1 QUESTIONÁRIO'!B57","v":0},{"$f":"'1 QUESTIONÁRIO'!B59","v":0},{"$f":"'1 QUESTIONÁRIO'!B61","v":0},{"$f":"'1 QUESTIONÁRIO'!B64","v":0},{"$f":"'1 QUESTIONÁRIO'!B66","v":0},{"$f":"'1 QUESTIONÁRIO'!B68","v":0},{"$f":"'1 QUESTIONÁRIO'!F68","v":""},{"$f":"'1 QUESTIONÁRIO'!B70","v":0},{"$f":"'1 QUESTIONÁRIO'!B73","v":0},{"$f":"'1 QUESTIONÁRIO'!F73","v":0},{"$f":"'1 QUESTIONÁRIO'!D76","v":0},{"$f":"'1 QUESTIONÁRIO'!D77","v":0},{"$f":"'1 QUESTIONÁRIO'!D78","v":0},{"$f":"'1 QUESTIONÁRIO'!D79","v":0},{"$f":"'1 QUESTIONÁRIO'!D80","v":0},{"$f":"'1 QUESTIONÁRIO'!D81","v":0},{"$f":"'1 QUESTIONÁRIO'!D82","v":0},{"$f":"'1 QUESTIONÁRIO'!D83","v":0},{"$f":"'1 QUESTIONÁRIO'!D84","v":0},{"$f":"'1 QUESTIONÁRIO'!H84","v":{"v":0,"d":"0.00"}},{"$f":"'1 QUESTIONÁRIO'!D88","v":{"v":0,"d":"0.00"}},{"$f":"'1 QUESTIONÁRIO'!D89","v":{"v":0,"d":"0.00"}},{"$f":"'1 QUESTIONÁRIO'!D90","v":{"v":0,"d":"0.00"}},{"$f":"'1 QUESTIONÁRIO'!D91","v":{"v":0,"d":"0.00"}},{"$f":"'1 QUESTIONÁRIO'!D92","v":{"v":0,"d":"0.00"}},{"$f":"'1 QUESTIONÁRIO'!D93","v":{"v":0,"d":"0.00"}},{"$f":"'1 QUESTIONÁRIO'!G92","v":{"v":0,"d":"0.00"}},{"$f":"'1 QUESTIONÁRIO'!H93","v":{"$error":"#DIV/0!"}},{"$f":"'1 QUESTIONÁRIO'!H92","v":{"$error":"#DIV/0!"}},{"$f":"'1 QUESTIONÁRIO'!D97","v":{"v":0,"d":"0.00"}},{"$f":"'1 QUESTIONÁRIO'!D98","v":{"v":0,"d":"0.00"}},{"$f":"'1 QUESTIONÁRIO'!D99","v":{"v":0,"d":"0.00"}},{"$f":"'1 QUESTIONÁRIO'!D100","v":{"$error":"#DIV/0!"}},{"$f":"'1 QUESTIONÁRIO'!G104","v":{"v":0,"d":"0.00"}},{"$f":"'1 QUESTIONÁRIO'!E107","v":0},{"$f":"'1 QUESTIONÁRIO'!E108","v":0},{"$f":"'1 QUESTIONÁRIO'!E109","v":0},{"$f":"'1 QUESTIONÁRIO'!E110","v":0},{"$f":"'1 QUESTIONÁRIO'!E113","v":0},{"$f":"'1 QUESTIONÁRIO'!E114","v":0},{"$f":"'1 QUESTIONÁRIO'!B117","v":0},{"$f":"'1 QUESTIONÁRIO'!B119","v":0},{"$f":"'1 QUESTIONÁRIO'!B123","v":0},{"$f":"'1 QUESTIONÁRIO'!B126","v":0},{"$f":"'1 QUESTIONÁRIO'!B129","v":0},{"$f":"'1 QUESTIONÁRIO'!B131","v":0},{"$f":"'1 QUESTIONÁRIO'!B133","v":0},{"$f":"'1 QUESTIONÁRIO'!B135","v":0},{"$f":"'2 INDICADORES'!B9","v":0},{"$f":"'2 INDICADORES'!D9","v":0},{"$f":"'2 INDICADORES'!B10","v":0},{"$f":"'2 INDICADORES'!D10","v":0},{"$f":"'2 INDICADORES'!B11","v":0},{"$f":"'2 INDICADORES'!D11","v":0},{"$f":"'2 INDICADORES'!D14","v":0},{"$f":"'2 INDICADORES'!D15","v":0},{"$f":"'2 INDICADORES'!D16","v":0},{"$f":"'2 INDICADORES'!D17","v":0},{"$f":"'2 INDICADORES'!D18","v":0},{"$f":"'2 INDICADORES'!D19","v":0},{"$f":"'2 INDICADORES'!E14","v":0},{"$f":"'2 INDICADORES'!E15","v":0},{"$f":"'2 INDICADORES'!E16","v":0},{"$f":"'2 INDICADORES'!E17","v":0},{"$f":"'2 INDICADORES'!E18","v":0},{"$f":"'2 INDICADORES'!E19","v":0},{"$f":"'2 INDICADORES'!F14","v":0},{"$f":"'2 INDICADORES'!F15","v":0},{"$f":"'2 INDICADORES'!F16","v":0},{"$f":"'2 INDICADORES'!F17","v":0},{"$f":"'2 INDICADORES'!F18","v":0},{"$f":"'2 INDICADORES'!F19","v":0},{"$f":"'2 INDICADORES'!C21","v":{"v":0,"d":"0.00"}},{"$f":"'2 INDICADORES'!B27","v":0},{"$f":"'2 INDICADORES'!D27","v":0},{"$f":"'2 INDICADORES'!B28","v":0},{"$f":"'2 INDICADORES'!D28","v":0},{"$f":"'2 INDICADORES'!B29","v":0},{"$f":"'2 INDICADORES'!D29","v":0},{"$f":"'2 INDICADORES'!D32","v":0},{"$f":"'2 INDICADORES'!D33","v":0},{"$f":"'2 INDICADORES'!F36","v":{"$error":"#DIV/0!"}},{"$f":"'2 INDICADORES'!F37","v":{"$error":"#DIV/0!"}},{"$f":"'2 INDICADORES'!F38","v":{"$error":"#DIV/0!"}},{"$f":"'2 INDICADORES'!F39","v":{"$error":"#DIV/0!"}},{"$f":"'2 INDICADORES'!F40:F40","v":{"$error":"#DIV/0!"}},{"$f":"'2 INDICADORES'!C41","v":{"$error":"#DIV/0!"}},{"$f":"'2 INDICADORES'!F45","v":2},{"$f":"'2 INDICADORES'!B49","v":0},{"$f":"'2 INDICADORES'!E49","v":{"v":1E-3,"d":"R$ 0.00"}},{"$f":"'2 INDICADORES'!B51","v":0},{"$f":"'2 INDICADORES'!E51","v":{"v":1E-3,"d":"R$ 0.00"}},{"$f":"'2 INDICADORES'!E52","v":{"v":2E-3,"d":"R$ 0.00"}},{"$f":"'2 INDICADORES'!B54","v":0},{"$f":"'2 INDICADORES'!E54","v":{"v":1E-3,"d":"R$ 0.00"}},{"$f":"'2 INDICADORES'!B56","v":0},{"$f":"'2 INDICADORES'!E56","v":{"v":1E-3,"d":"R$ 0.00"}},{"$f":"'2 INDICADORES'!E57","v":{"v":2E-3,"d":"R$ 0.00"}},{"$f":"'2 INDICADORES'!D67","v":{"v":1E-3,"d":"R$ 0.00"}},{"$f":"'2 INDICADORES'!F67","v":{"v":1E-3,"d":"R$ 0.00"}},{"$f":"'2 INDICADORES'!B70","v":0},{"$f":"'2 INDICADORES'!C70","v":{"v":0,"d":"0.0"}},{"$f":"'2 INDICADORES'!D70","v":{"v":0,"d":"0.0"}},{"$f":"'2 INDICADORES'!C82","v":0},{"$f":"'2 INDICADORES'!D82","v":0},{"$f":"'2 INDICADORES'!C84","v":0},{"$f":"'2 INDICADORES'!D84","v":0},{"$f":"'2 INDICADORES'!C87","v":{"$error":"#DIV/0!"}},{"$f":"'2 INDICADORES'!D87","v":{"$error":"#DIV/0!"}},{"$f":"'2 INDICADORES'!F91","v":""},{"$f":"'2 INDICADORES'!F92","v":{"v":0.8431882035766225,"d":"84.3%"}},{"$f":"'2 INDICADORES'!F93","v":{"v":0.8049985560008663,"d":"80.5%"}},{"$f":"'2 INDICADORES'!F94","v":{"v":0,"d":"0.0%"}},{"$f":"'2 INDICADORES'!F95","v":{"$error":"#DIV/0!"}},{"$f":"'2 INDICADORES'!F96","v":{"$error":"#DIV/0!"}},{"$f":"'2 INDICADORES'!F97","v":{"$error":"#DIV/0!"}},{"$f":"'2 INDICADORES'!C99","v":{"$error":"#DIV/0!"}},{"$f":"'2 INDICADORES'!E104","v":0},{"$f":"'2 INDICADORES'!E105","v":{"$error":"#DIV/0!"}},{"$f":"'2 INDICADORES'!C106","v":{"$error":"#DIV/0!"}},{"$f":"'2 INDICADORES'!D110","v":0},{"$f":"IF(SUM('2 INDICADORES'!$E$113:$E$120)=0,'2 INDICADORES'!D113,('2 INDICADORES'!D113+'2 INDICADORES'!E113)/2)","v":0},{"$f":"IF(SUM('2 INDICADORES'!$E$113:$E$120)=0,'2 INDICADORES'!D114,('2 INDICADORES'!D114+'2 INDICADORES'!E114)/2)","v":0},{"$f":"IF(SUM('2 INDICADORES'!$E$113:$E$120)=0,'2 INDICADORES'!D115,('2 INDICADORES'!D115+'2 INDICADORES'!E115)/2)","v":0},{"$f":"IF(SUM('2 INDICADORES'!$E$113:$E$120)=0,'2 INDICADORES'!D116,('2 INDICADORES'!D116+'2 INDICADORES'!E116)/2)","v":0},{"$f":"IF(SUM('2 INDICADORES'!$E$113:$E$120)=0,'2 INDICADORES'!D117,('2 INDICADORES'!D117+'2 INDICADORES'!E117)/2)","v":0},{"$f":"IF(SUM('2 INDICADORES'!$E$113:$E$120)=0,'2 INDICADORES'!D118,('2 INDICADORES'!D118+'2 INDICADORES'!E118)/2)","v":0},{"$f":"IF(SUM('2 INDICADORES'!$E$113:$E$120)=0,'2 INDICADORES'!D119,('2 INDICADORES'!D119+'2 INDICADORES'!E119)/2)","v":0},{"$f":"IF(SUM('2 INDICADORES'!$E$113:$E$120)=0,'2 INDICADORES'!D120,('2 INDICADORES'!D120+'2 INDICADORES'!E120)/2)","v":0},{"$f":"'2 INDICADORES'!C122","v":{"v":0,"d":"0.00"}},{"$f":"IF(SUM('2 INDICADORES'!$E$125:$E$127)=0,'2 INDICADORES'!D125,('2 INDICADORES'!D125+'2 INDICADORES'!E125)/2)","v":0},{"$f":"IF(SUM('2 INDICADORES'!$E$125:$E$127)=0,'2 INDICADORES'!D126,('2 INDICADORES'!D126+'2 INDICADORES'!E126)/2)","v":0},{"$f":"IF(SUM('2 INDICADORES'!$E$125:$E$127)=0,'2 INDICADORES'!D127,('2 INDICADORES'!D127+'2 INDICADORES'!E127)/2)","v":0},{"$f":"'2 INDICADORES'!C128","v":""},{"$f":"'2 INDICADORES'!C129","v":{"v":0,"d":"0.00"}},{"$f":"'2 INDICADORES'!D135","v":0},{"$f":"'2 INDICADORES'!D136","v":0},{"$f":"'2 INDICADORES'!D137","v":0},{"$f":"'2 INDICADORES'!D138","v":0},{"$f":"'2 INDICADORES'!D139","v":0},{"$f":"'2 INDICADORES'!E135","v":0},{"$f":"'2 INDICADORES'!E136","v":0},{"$f":"'2 INDICADORES'!E137","v":0},{"$f":"'2 INDICADORES'!E138","v":0},{"$f":"'2 INDICADORES'!E139","v":0},{"$f":"'2 INDICADORES'!D142","v":0},{"$f":"'2 INDICADORES'!D143","v":0},{"$f":"'2 INDICADORES'!E142","v":0},{"$f":"'2 INDICADORES'!E143","v":0},{"$f":"'2 INDICADORES'!D148","v":0},{"$f":"'2 INDICADORES'!D149","v":0},{"$f":"'2 INDICADORES'!E148","v":0},{"$f":"'2 INDICADORES'!E149","v":0},{"$f":"'2 INDICADORES'!C151","v":{"$error":"#DIV/0!"}},{"$f":"'2 INDICADORES'!E157+'2 INDICADORES'!F157","v":0},{"$f":"'2 INDICADORES'!E158+'2 INDICADORES'!F158","v":0},{"$f":"'2 INDICADORES'!E159+'2 INDICADORES'!F159","v":0},{"$f":"'2 INDICADORES'!E162","v":0},{"$f":"'2 INDICADORES'!E163","v":0},{"$f":"'2 INDICADORES'!E164","v":0},{"$f":"'2 INDICADORES'!E165","v":0},{"$f":"'2 INDICADORES'!E166","v":0},{"$f":"'2 INDICADORES'!E167","v":0},{"$f":"'2 INDICADORES'!E168","v":0},{"$f":"'2 INDICADORES'!E169","v":0},{"$f":"IF('2 INDICADORES'!F157>0,'2 INDICADORES'!F157/('2 INDICADORES'!F157+'2 INDICADORES'!E157),\"\")","v":""},{"$f":"'2 INDICADORES'!C171","v":{"v":0.7,"d":"0.70"}},{"$f":"'2 INDICADORES'!E175","v":0},{"$f":"'2 INDICADORES'!E176","v":0},{"$f":"'2 INDICADORES'!E177","v":0},{"$f":"'2 INDICADORES'!E178","v":0},{"$f":"'2 INDICADORES'!E179","v":0},{"$f":"'2 INDICADORES'!E180","v":0},{"$f":"'2 INDICADORES'!E181","v":0},{"$f":"'2 INDICADORES'!E182","v":0},{"$f":"'2 INDICADORES'!C184","v":{"v":0,"d":"0.00"}},{"$f":"'2 INDICADORES'!E188","v":0},{"$f":"'2 INDICADORES'!E189","v":0},{"$f":"'2 INDICADORES'!E191","v":0},{"$f":"'2 INDICADORES'!C192","v":0},{"$f":"'2 INDICADORES'!E193","v":0},{"$f":"'2 INDICADORES'!C194","v":0},{"$f":"'2 INDICADORES'!D197","v":0},{"$f":"'2 INDICADORES'!E197","v":{"v":0,"d":"0%"}},{"$f":"'2 INDICADORES'!D198","v":0},{"$f":"'2 INDICADORES'!E198","v":{"v":0,"d":"0%"}},{"$f":"'2 INDICADORES'!C200","v":{"v":0,"d":"0.00"}},{"$f":"'2 INDICADORES'!D206","v":0},{"$f":"'2 INDICADORES'!F206","v":0},{"$f":"'2 INDICADORES'!D207","v":0},{"$f":"'2 INDICADORES'!F207","v":0},{"$f":"'2 INDICADORES'!F209","v":{"v":0,"d":"0%"}},{"$f":"IF('2 INDICADORES'!F211=\"\",\"sem efluente\",'2 INDICADORES'!F211)","v":"sem efluente"},{"$f":"IF('2 INDICADORES'!F212=\"\",\"sem efluente\",'2 INDICADORES'!F212)","v":"sem efluente"},{"$f":"'2 INDICADORES'!F214","v":0},{"$f":"'2 INDICADORES'!D215","v":0},{"$f":"'2 INDICADORES'!C216","v":{"v":0.7,"d":"0.70"}},{"$f":"'2 INDICADORES'!E220","v":0},{"$f":"'2 INDICADORES'!E221","v":0},{"$f":"'2 INDICADORES'!E223","v":0},{"$f":"'2 INDICADORES'!E224","v":0},{"$f":"'2 INDICADORES'!C225","v":{"v":0.7,"d":"0.70"}},{"$f":"'2 INDICADORES'!C229","v":0},{"$f":"'2 INDICADORES'!C231/100","v":{"v":0,"d":"0%"}},{"$f":"'2 INDICADORES'!E231","v":0},{"$f":"'2 INDICADORES'!C232","v":{"v":0,"d":"0.00"}},{"$f":"'2 INDICADORES'!E232","v":{"v":0,"d":"0.00"}},{"$f":"'2 INDICADORES'!C233","v":{"v":0,"d":"0.00"}},{"$f":"'2 INDICADORES'!E233","v":{"v":0,"d":"0.00"}},{"$f":"'2 INDICADORES'!C234","v":0},{"$f":"'2 INDICADORES'!E234","v":{"v":0,"d":"0.00"}},{"$f":"'2 INDICADORES'!C235","v":0},{"$f":"'2 INDICADORES'!E235","v":{"v":0,"d":"0.00"}},{"$f":"'2 INDICADORES'!C236","v":0},{"$f":"'2 INDICADORES'!E236","v":{"v":0,"d":"0.00"}},{"$f":"'2 INDICADORES'!C237","v":0},{"$f":"'2 INDICADORES'!E237","v":{"v":0,"d":"0.00"}},{"$f":"'2 INDICADORES'!C238","v":0},{"$f":"'2 INDICADORES'!E238","v":{"v":0,"d":"0.00"}},{"$f":"'2 INDICADORES'!C239","v":0},{"$f":"'2 INDICADORES'!E239","v":{"v":0,"d":"0.00"}},{"$f":"'2 INDICADORES'!C240","v":0},{"$f":"'2 INDICADORES'!E240","v":{"v":0,"d":"0.00"}},{"$f":"'2 INDICADORES'!C253","v":{"v":0,"d":"0.00"}},{"$f":"'2 INDICADORES'!C243","v":0},{"$f":"'2 INDICADORES'!C244","v":0},{"$f":"'2 INDICADORES'!C245","v":{"v":0,"d":"0.00"}},{"$f":"'2 INDICADORES'!C246","v":{"v":0,"d":"0.00"}},{"$f":"'2 INDICADORES'!C247","v":{"v":0,"d":"0.00"}},{"$f":"'2 INDICADORES'!C248","v":{"v":0,"d":"0.00"}},{"$f":"'2 INDICADORES'!C249","v":{"v":0,"d":"0.00"}},{"$f":"'2 INDICADORES'!C250","v":{"v":0,"d":"0.00"}},{"$f":"'2 INDICADORES'!C251","v":{"v":0,"d":"0.00"}},{"$f":"'2 INDICADORES'!C253","v":{"v":0,"d":"0.00"}},{"$f":"'2 INDICADORES'!D261","v":0},{"$f":"'2 INDICADORES'!D262","v":0},{"$f":"'2 INDICADORES'!D263","v":0},{"$f":"'2 INDICADORES'!D264","v":0},{"$f":"'2 INDICADORES'!D265","v":0},{"$f":"'2 INDICADORES'!D266","v":0},{"$f":"'2 INDICADORES'!D267","v":0},{"$f":"'2 INDICADORES'!D268","v":0},{"$f":"'2 INDICADORES'!D269","v":0},{"$f":"'2 INDICADORES'!D270","v":0},{"$f":"'2 INDICADORES'!D271","v":0},{"$f":"'2 INDICADORES'!D272","v":0},{"$f":"'2 INDICADORES'!D273","v":0},{"$f":"'2 INDICADORES'!D274","v":0},{"$f":"'2 INDICADORES'!D288","v":{"v":0,"d":"0.00"}},{"$f":"'2 INDICADORES'!D289","v":{"v":0,"d":"0.00"}},{"$f":"'2 INDICADORES'!D291","v":{"v":0,"d":"0.00"}},{"$f":"'2 INDICADORES'!D292","v":{"v":0,"d":"0.00"}},{"$f":"'2 INDICADORES'!E299","v":""},{"$f":"'2 INDICADORES'!C300","v":{"v":0,"d":"0.00"}},{"$f":"'2 INDICADORES'!D304","v":0},{"$f":"'2 INDICADORES'!D305","v":0},{"$f":"'2 INDICADORES'!D306","v":0},{"$f":"'2 INDICADORES'!D307","v":0},{"$f":"'2 INDICADORES'!D308","v":0},{"$f":"'2 INDICADORES'!D309","v":""},{"$f":"'2 INDICADORES'!D316","v":""},{"$f":"'2 INDICADORES'!D326","v":""},{"$f":"'2 INDICADORES'!D327","v":""},{"$f":"'2 INDICADORES'!E304","v":0},{"$f":"'2 INDICADORES'!E305","v":0},{"$f":"'2 INDICADORES'!E306","v":0},{"$f":"'2 INDICADORES'!E307","v":0},{"$f":"'2 INDICADORES'!E308","v":0},{"$f":"'2 INDICADORES'!E309","v":""},{"$f":"'2 INDICADORES'!E316","v":""},{"$f":"'2 INDICADORES'!E326","v":""},{"$f":"'2 INDICADORES'!E327","v":""},{"$f":"'2 INDICADORES'!F304","v":0},{"$f":"'2 INDICADORES'!F305","v":0},{"$f":"'2 INDICADORES'!F306","v":0},{"$f":"'2 INDICADORES'!F307","v":0},{"$f":"'2 INDICADORES'!F308","v":0},{"$f":"'2 INDICADORES'!F309","v":""},{"$f":"'2 INDICADORES'!F316","v":""},{"$f":"'2 INDICADORES'!F326","v":""},{"$f":"'2 INDICADORES'!F327","v":""},{"$f":"'2 INDICADORES'!D329","v":0},{"$f":"'2 INDICADORES'!D330","v":0},{"$f":"'2 INDICADORES'!D331","v":0},{"$f":"'2 INDICADORES'!E329","v":0},{"$f":"'2 INDICADORES'!E330","v":0},{"$f":"'2 INDICADORES'!E331","v":0},{"$f":"'2 INDICADORES'!F329","v":0},{"$f":"'2 INDICADORES'!F330","v":0},{"$f":"'2 INDICADORES'!F331","v":0},{"$f":"'2 INDICADORES'!C332","v":{"v":1,"d":"1.00"}},{"$f":"'2 INDICADORES'!D336","v":{"v":0,"d":"0.00"}},{"$f":"'2 INDICADORES'!E336","v":{"v":0,"d":"0.00"}},{"$f":"'2 INDICADORES'!F336","v":" "},{"$f":"'2 INDICADORES'!D338","v":0},{"$f":"'2 INDICADORES'!C340","v":{"v":0.7,"d":"0.70"}},{"$f":"SUM('2 INDICADORES'!D345:G345)","v":{"v":0,"d":"0.00"}},{"$f":"SUM('2 INDICADORES'!D346:G346)","v":{"v":0,"d":"0.00"}},{"$f":"SUM('2 INDICADORES'!D347:G347)","v":{"v":0,"d":"0.00"}},{"$f":"'2 INDICADORES'!D348","v":0},{"$f":"'2 INDICADORES'!D350","v":0},{"$f":"'2 INDICADORES'!C353","v":""},{"$f":"'2 INDICADORES'!E357","v":{"v":0,"d":"0%"}},{"$f":"'2 INDICADORES'!E358","v":{"v":0,"d":"0%"}},{"$f":"'2 INDICADORES'!E359","v":{"v":0,"d":"0%"}},{"$f":"'2 INDICADORES'!E361","v":{"v":0,"d":"0%"}},{"$f":"'2 INDICADORES'!E362","v":{"v":0,"d":"0%"}},{"$f":"IF('2 INDICADORES'!E364=\"x\",1,0)","v":0},{"$f":"'2 INDICADORES'!D365","v":0},{"$f":"'2 INDICADORES'!C366","v":{"v":0,"d":"0.00"}},{"$f":"'2 INDICADORES'!D370","v":0},{"$f":"'2 INDICADORES'!D371","v":0},{"$f":"'2 INDICADORES'!D372","v":0},{"$f":"'2 INDICADORES'!D373","v":0},{"$f":"'2 INDICADORES'!E370","v":0},{"$f":"'2 INDICADORES'!E371","v":0},{"$f":"'2 INDICADORES'!E372","v":0},{"$f":"'2 INDICADORES'!E373","v":0},{"$f":"'2 INDICADORES'!F370","v":0},{"$f":"'2 INDICADORES'!F371","v":0},{"$f":"'2 INDICADORES'!F372","v":0},{"$f":"'2 INDICADORES'!F373","v":0},{"$f":"'2 INDICADORES'!G370","v":0},{"$f":"'2 INDICADORES'!G371","v":0},{"$f":"'2 INDICADORES'!G372","v":0},{"$f":"'2 INDICADORES'!G373","v":0},{"$f":"'2 INDICADORES'!E376","v":0},{"$f":"'2 INDICADORES'!G379","v":0},{"$f":"'2 INDICADORES'!G380","v":0},{"$f":"'2 INDICADORES'!C381","v":{"v":0,"d":"0.00"}},{"$f":"'2 INDICADORES'!G385","v":{"v":0,"d":"0.00"}},{"$f":"'2 INDICADORES'!G386","v":{"v":0,"d":"0.00"}},{"$f":"'2 INDICADORES'!G388","v":{"v":0,"d":"0.0%"}},{"$f":"'2 INDICADORES'!C389","v":{"v":0,"d":"0.00"}},{"$f":"'2 INDICADORES'!D392","v":{"v":0,"d":"0.00"}},{"$f":"'2 INDICADORES'!D393","v":{"$error":"#DIV/0!"}},{"$f":"'2 INDICADORES'!F395","v":{"v":0,"d":"0.00"}},{"$f":"'2 INDICADORES'!F396","v":{"v":0,"d":"0.00"}},{"$f":"'2 INDICADORES'!F397","v":{"$error":"#DIV/0!"}},{"$f":"'2 INDICADORES'!F398","v":{"v":0,"d":"0.00"}},{"$f":"'2 INDICADORES'!C400","v":{"$error":"#DIV/0!"}},{"$f":"SUM('2 INDICADORES'!D405:G405)","v":{"v":0,"d":"0.00"}},{"$f":"SUM('2 INDICADORES'!D406:G406)","v":{"v":0,"d":"0.00"}},{"$f":"SUM('2 INDICADORES'!D407:G407)","v":{"v":0,"d":"0.00"}},{"$f":"'2 INDICADORES'!D408","v":0},{"$f":"'2 INDICADORES'!C411","v":{"$error":"#DIV/0!"}},{"$f":"'2 INDICADORES'!E412","v":{"$error":"#DIV/0!"}},{"$f":"'2 INDICADORES'!C413","v":{"$error":"#DIV/0!"}},{"$f":"IF('2 INDICADORES'!G415=\"x\",1,0)","v":0},{"$f":"'2 INDICADORES'!C416","v":{"$error":"#DIV/0!"}},{"$f":"'3 RELATÓRIO'!G97","v":{"$error":"#DIV/0!"}},{"$f":"'3 RELATÓRIO'!C96","v":{"$error":"#DIV/0!"}},{"$f":"'3 RELATÓRIO'!G98","v":{"v":0,"d":"0.00"}},{"$f":"'3 RELATÓRIO'!G99","v":{"$error":"#DIV/0!"}},{"$f":"'3 RELATÓRIO'!G100","v":{"$error":"#DIV/0!"}},{"$f":"'3 RELATÓRIO'!G101","v":{"$error":"#DIV/0!"}},{"$f":"'3 RELATÓRIO'!G102","v":{"v":0,"d":"0.00"}},{"$f":"'3 RELATÓRIO'!G103","v":{"$error":"#DIV/0!"}},{"$f":"'3 RELATÓRIO'!G104","v":{"v":0.7,"d":"0.70"}},{"$f":"'3 RELATÓRIO'!G105","v":{"v":0,"d":"0.00"}},{"$f":"'3 RELATÓRIO'!G106","v":{"v":0,"d":"0.00"}},{"$f":"'3 RELATÓRIO'!G107","v":{"v":0.7,"d":"0.70"}},{"$f":"'3 RELATÓRIO'!G108","v":{"v":0.7,"d":"0.70"}},{"$f":"'3 RELATÓRIO'!G109","v":{"v":0,"d":"0.00"}},{"$f":"'3 RELATÓRIO'!G110","v":{"v":0,"d":"0.00"}},{"$f":"'3 RELATÓRIO'!G111","v":{"v":1,"d":"1.00"}},{"$f":"'3 RELATÓRIO'!G112","v":{"v":0.7,"d":"0.70"}},{"$f":"'3 RELATÓRIO'!G113","v":""},{"$f":"'3 RELATÓRIO'!G114","v":{"v":0,"d":"0.00"}},{"$f":"'3 RELATÓRIO'!G115","v":{"v":0,"d":"0.00"}},{"$f":"'3 RELATÓRIO'!G116","v":{"v":0,"d":"0.00"}},{"$f":"'3 RELATÓRIO'!G117","v":{"$error":"#DIV/0!"}},{"$f":"'3 RELATÓRIO'!G118","v":{"$error":"#DIV/0!"}},{"$f":"'3 RELATÓRIO'!G86","v":0},{"$f":"'3 RELATÓRIO'!G87","v":{"$error":"#DIV/0!"}},{"$f":"'3 RELATÓRIO'!G94","v":{"$error":"#DIV/0!"}},{"$f":"'3 RELATÓRIO'!G92","v":0},{"$f":"'3 RELATÓRIO'!G93","v":{"$error":"#DIV/0!"}},{"$f":"'3 RELATÓRIO'!O87","v":{"$error":"#DIV/0!"}},{"$f":"'3 RELATÓRIO'!O88","v":""},{"$f":"'3 RELATÓRIO'!O89","v":0},{"$f":"COUNTA('2 INDICADORES'!D304:F304,FÓRMULAS!D473:L473,FÓRMULAS!D501:L501,FÓRMULAS!D528:I528)","v":0},{"$f":"OC23/OD23","v":{"$error":"#DIV/0!"}},{"$f":"MAX('2 INDICADORES'!D320:F320,FÓRMULAS!D490:L490,FÓRMULAS!D518:L518,FÓRMULAS!D545:I545)","v":{"v":0,"d":"0.0"}},{"$f":"AVERAGE('2 INDICADORES'!D317:F317,FÓRMULAS!D487:L487,FÓRMULAS!D515:L515,FÓRMULAS!D542:I542)","v":{"$error":"#DIV/0!"}},{"$f":"MAX('2 INDICADORES'!D317:F317,FÓRMULAS!D487:L487,FÓRMULAS!D515:L515,FÓRMULAS!D542:I542)","v":{"v":0,"d":"0.0"}},{"$f":"AVERAGE('2 INDICADORES'!D318:F318,FÓRMULAS!D488:L488,FÓRMULAS!D516:L516,FÓRMULAS!D543:I543)","v":{"$error":"#DIV/0!"}},{"$f":"MAX('2 INDICADORES'!D318:F318,FÓRMULAS!D488:L488,FÓRMULAS!D516:L516,FÓRMULAS!D543:I543)","v":{"v":0,"d":"0.0"}},{"$f":"AVERAGE('2 INDICADORES'!D319:F319,FÓRMULAS!D489:L489,FÓRMULAS!D517:L517,FÓRMULAS!D544:I544)","v":{"$error":"#DIV/0!"}},{"$f":"MAX('2 INDICADORES'!D319:F319,FÓRMULAS!D489:L489,FÓRMULAS!D517:L517,FÓRMULAS!D544:I544)","v":{"v":0,"d":"0.0"}},{"$f":"FÓRMULAS!N547/'Base de dados'!OD23","v":{"$error":"#DIV/0!"}}]
[]
[{"$nulls":22},"Pousio",{"$f":"AB23/$AF$23","v":{"$error":"#DIV/0!"}},{"$nulls":284},{"$f":"KW23","v":{"v":0,"d":"0.0"}},{"$f":"KX23","v":{"v":0,"d":"0.0"}},{"v":0,"d":"0.0"},{"$nulls":42},{"$f":"MP23","v":{"v":0,"d":"0.0"}},{"$f":"MQ23","v":{"v":0,"d":"0.0"}},{"v":0,"d":"0.0"}]
[null,null,"REFERÊNCIAS",{"$nulls":19},"Silvicultura",{"$f":"Z23/$AF$23","v":{"$error":"#DIV/0!"}},{"$nulls":109},"Coleta de Lixo",{"$f":"EK23","v":{"v":0,"d":"0.0%"}},{"$nulls":173},{"$f":"KW25","v":{"v":0,"d":"0.0"}},{"$f":"KX25","v":{"v":0,"d":"0.0"}},{"$f":"KY25","v":{"v":0,"d":"0.0"}},{"$nulls":42},{"$f":"MP25","v":{"v":0,"d":"0.0"}},{"$f":"MQ25","v":{"v":0,"d":"0.0"}},{"$f":"MR25","v":{"v":0,"d":"0.0"}}]
[{"$nulls":22},"Áreas inaproveitáveis",{"$f":"AE23/$AF$23","v":{"$error":"#DIV/0!"}},{"$nulls":97},"Valorização da terra",{"$f":"DR23","v":""},{"$nulls":10},"Segurança Zona Rural",{"$f":"EI23","v":{"v":0,"d":"0.0%"}},{"$nulls":22},"Integrantes da Família (curta duração)","Família (longa duração)","Colaboradores (curta duração)","Colaboradores (longa duração)",{"$nulls":18},"Crédito Comercialização",{"$f":"GE23","v":{"v":0,"d":"0.0%"}},{"$nulls":7},"Comercialização Informação Diversificação venda",{"$f":"GG23","v":0},{"$nulls":56},"Montante",{"$nulls":61},{"$f":"KW26/$KW$28","v":{"$error":"#DIV/0!"}},{"$f":"KX26/$KW$28","v":{"$error":"#DIV/0!"}},{"$f":"KY26/$KW$28","v":{"$error":"#DIV/0!"}},{"$nulls":3},"Drenagem Abaulamento (%)",{"$f":"LC23","v":{"v":0,"d":"0%"}},{"$nulls":37},{"$f":"MP26/$KW$28","v":{"$error":"#DIV/0!"}},{"$f":"MQ26/$KW$28","v":{"$error":"#DIV/0!"}},{"$f":"MR26/$KW$28","v":{"$error":"#DIV/0!"}}]
[null,null,"CALLISTO, M. et al. Aplicação de um pro- tocolo de avaliação rápida da diversidade de habitats em atividades de ensino e pesqui- sa (MG-RJ). Acta Limnologica Brasiliensis, São Paulo, v.14, n.1, p.91-98, 2002. ",{"$nulls":19},"Área não agrícola",{"$f":"AA23/$AF$23","v":{"$error":"#DIV/0!"}},{"$nulls":72},"Pensão; aposent; outras fontes",{"$f":"CS23","v":{"$error":"#DIV/0!"}},null,null,"Benfeitorias",{"$f":"DA23","v":{"v":2E-3,"d":"R$ 0.00"}},{"$f":"CX28/$CX$32","v":{"$error":"#DIV/0!"}},{"$nulls":18},"Benfeitorias",{"$f":"DS23","v":{"v":0.8431882035766225,"d":"84.3%"}},{"$nulls":10},"Internet",{"$f":"EJ23","v":{"v":0,"d":"0.0%"}},{"$nulls":22},{"$f":"IF(ER23=0,\"\",FB23/ER23)","v":""},{"$f":"IF(ER23=0,\"\",FC23/ER23)","v":""},{"$f":"IF(EW23=0,\"\",FD23/EW23)","v":""},{"$f":"IF(EW23=0,\"\",FE23/EW23)","v":""},{"$nulls":18},"Crédito Custeio",{"$f":"GD23","v":{"v":0,"d":"0.0%"}},{"$nulls":7},"Inovação Adoção",{"$f":"GI23","v":0},{"$nulls":15},"Coleta/Destinação adequada Ef. Gasosos",{"$f":"IF('2 INDICADORES'!F212=\"\",\"\",'2 INDICADORES'!F212)","v":""},{"$nulls":39},"Tipo de ocupação das margens ",{"$f":"IM23","v":{"v":0,"d":"0.00"}},{"$nulls":60},{"$f":"SUM(KW25:KY25)","v":{"v":0,"d":"0.00"}},{"$nulls":5},"Lombadas (%)",{"$f":"LD23","v":{"v":0,"d":"0%"}},{"$nulls":37},{"$f":"SUM(MP26:MR26)","v":{"v":0,"d":"0.00"}}]
[null,null,"CHAVES, H. M. L.; SOUZA M. A. Índice para a avaliação do risco de contaminação da água por pesticidas: desenvolvimento e validação. Revista Brasileira de Recursos Hídricos RBRH vol. 20 nº 2, Porto Alegre abr/jun 2015 p. 286-297 ",{"$nulls":19},"Corpos d'água",{"$f":"AC23/$AF$23","v":{"$error":"#DIV/0!"}},{"$nulls":72},"Atividades fora do imóvel",{"$f":"CR23","v":{"$error":"#DIV/0!"}},null,null,"Equipamentos",{"$f":"DF23","v":{"v":2E-3,"d":"R$ 0.00"}},{"$f":"CX29/$CX$32","v":{"$error":"#DIV/0!"}},{"$nulls":18},"Equipamentos",{"$f":"DT23","v":{"v":0.8049985560008663,"d":"80.5%"}},{"$nulls":10},"Serviço de saúde",{"$f":"EG23","v":{"v":0,"d":"0.0%"}},{"$nulls":44},"Crédito Investimentos",{"$f":"GC23","v":{"v":0,"d":"0.0%"}},{"$nulls":7},"Inovação/Capacidade de liderança",{"$f":"GK23","v":0},{"$nulls":15},"Coleta/Destinação adequada Ef. Líquidos",{"$f":"IF('2 INDICADORES'!F211=\"\",\"\",'2 INDICADORES'!F211)","v":""},{"$nulls":39},"Alterações antrópicas",{"$f":"IO23","v":{"v":0,"d":"0.00"}},{"$nulls":66},"Caixas infiltração (%)",{"$f":"LE23","v":{"v":0,"d":"0%"}}]
[null,null,"DEPONTI, C.M.; ECKERT, C.; AZAMBUJA, J.L.B. Estratégia para construção de indica- dores para avaliação da sustentabilidade e monitoramento de sistemas. Agroecologia e Desenvolvimento Rural Sustentável, Porto Alegre, v.3, n.4, p.44-52, 2002. ",{"$nulls":19},"Lavouras Temporárias",{"$f":"X23/$AF$23","v":{"$error":"#DIV/0!"}},{"$nulls":72},"Outras atividades no imóvel",{"$f":"CQ23","v":{"$error":"#DIV/0!"}},null,null,"Semoventes",{"$f":"DG23","v":{"v":1E-3,"d":"R$ 0.00"}},{"$f":"CX30/$CX$32","v":{"$error":"#DIV/0!"}},{"$nulls":18},"Semoventes",{"$f":"DU23","v":{"v":0,"d":"0.0%"}},{"$nulls":10},"Estradas de acesso",{"$f":"EF23","v":{"v":0,"d":"0.0%"}},{"$nulls":44},"Custo de Produção",{"$f":"FY23","v":{"v":0,"d":"0.0%"}},{"$nulls":7},"Comercialização Certificação Mercados Institucionais",{"$f":"GH23","v":0},{"$nulls":15},"Coleta/Destinação adequada Esgoto",{"$f":"'2 INDICADORES'!G206","v":{"$error":"#DIV/0!"}},{"$nulls":39},"Cobertura vegetal no leito",{"$f":"IQ23","v":{"v":0,"d":"0.00"}},{"$nulls":60},"Suficiente","Insuficiente","Situação Crítica",{"$nulls":42},"Suficiente","Insuficiente","Situação Crítica"]
[null,null,"KOVACH, J., PETZOLDT, C., DEGNI, J. & TETTE, J. A method to measure the environmental impact of pesticides. NY Food Life Sci. Bull. 139, 1–8 (1992). ",{"$nulls":19},"Lavouras Permanentes",{"$f":"W23/$AF$23","v":{"$error":"#DIV/0!"}},{"$nulls":72},"Atividades agrícolas no imóvel",{"$f":"CP23","v":{"$error":"#DIV/0!"}},null,null,"Valor da terra",{"$f":"DL23*DN23","v":0},{"$f":"CX31/$CX$32","v":{"$error":"#DIV/0!"}},{"$nulls":18},"Área com irrigação",{"$f":"DV23","v":{"$error":"#DIV/0!"}},{"$nulls":10},"Energia Elétrica",{"$f":"EE23","v":{"v":0,"d":"0.0%"}},{"$nulls":44},"Fluxo de Caixa",{"$f":"FX23","v":{"v":0,"d":"0.0%"}},{"$nulls":24},"Destinação adequada Lixo",{"$f":"'2 INDICADORES'!G207","v":{"$error":"#DIV/0!"}},{"$nulls":39},"Erosão próxima e/ou nas margens",{"$f":"IS23","v":{"v":0,"d":"0.00"}},{"$nulls":60},{"$f":"KW27","v":{"$error":"#DIV/0!"}},{"$f":"KX27","v":{"$error":"#DIV/0!"}},{"$f":"KY27","v":{"$error":"#DIV/0!"}},{"$nulls":3},"Buracos (%)",{"$f":"LF23","v":{"v":0,"d":"0%"}},{"$nulls":37},{"$f":"MP27","v":{"$error":"#DIV/0!"}},{"$f":"MQ27","v":{"$error":"#DIV/0!"}},{"$f":"MR27","v":{"$error":"#DIV/0!"}}]
[null,null,"MENDES, I. C. et al. Critical limits for microbial indicators in tropical Oxisols at post-harvest: The FERTBIO soil sample concept. Applied Soil Ecology, https://doi.org/10.1016/j.apsoil. 2019. ",{"$nulls":19},"Veg. Nativa",{"$f":"AD23/$AF$23","v":{"$error":"#DIV/0!"}},{"$nulls":76},"Estimativa Patrimonial",{"$f":"DP23","v":{"$error":"#DIV/0!"}},{"$nulls":31},"Transporte Escolar",{"$f":"EH23","v":{"v":0,"d":"0.0%"}},{"$nulls":44},"Grau de organização (Associação etc.)",{"$f":"GA23","v":{"v":0,"d":"0.0%"}},{"$nulls":24},"Coleta/Destinação adequada Res. Sólidos",{"$f":"'2 INDICADORES'!F209","v":{"v":0,"d":"0.0%"}},{"$nulls":39},"Transparência da água",{"$f":"IU23","v":{"v":0,"d":"0.00"}},{"$nulls":66},"Sulcos de erosão (%)",{"$f":"LG23","v":{"v":0,"d":"0%"}}]
[null,null,"RIBEIRO, A. C.; GUIMARÃES, P. T. G.; ALVARES, V. H. V. Recomendações para o uso de corretivos e fertilizantes em Minas Gerais: 5ª aproximação. Viçosa, MG: UFV, 359 p. 1999.",{"$nulls":19},"Pastagens",{"$f":"Y23/$AF$23","v":{"$error":"#DIV/0!"}},{"$nulls":97},"Evolução Patrimonial Anual Total",{"$f":"DW23","v":{"$error":"#DIV/0!"}},{"$nulls":10},"Disponibilidade Água",{"$f":"ED23","v":{"v":0,"d":"0.0%"}},{"$nulls":44},"Assistência Técnica",{"$f":"FZ23","v":{"v":0,"d":"0.0%"}},{"$nulls":65},"Odor da água",{"$f":"IW23","v":{"v":0,"d":"0.00"}}]
[null,null,"RODRIGUES, G.S. et al. Integrated farm sustainability assessment for the environ- mental management of rural activities. En- vironmental Impact Assessment Review, v.30, n.4, p.229-239, July 2010. ",{"$nulls":118},"Evolução Patrimonial Anual Total s/valorização da terra",{"$f":"DX23","v":{"$error":"#DIV/0!"}},{"$nulls":56},"Regularização Ambiental",{"$f":"GB23","v":{"v":0,"d":"0.0%"}},{"$nulls":65},"Tipo de fundo",{"$f":"IY23","v":{"v":0,"d":"0.00"}}]
[null,null,"SOUSA, D.M.G.; LOBATO, E. & REIN, T.A. Adubação com fósforo. In: SOUSA, D.M.G. & LOBATO, E., eds. Cerrado: Correção do solo e adubação. 2.ed. Planaltina, Embrapa Cerrados, 2004. p.147-168. "]
[{"$nulls":246},"Jusante"]
[{"$nulls":246},"Tipo de ocupação das margens ",{"$f":"IN23","v":{"v":0,"d":"0.00"}}]
[{"$nulls":246},"Alterações antrópicas",{"$f":"IP23","v":{"v":0,"d":"0.00"}}]
[{"$nulls":246},"Cobertura vegetal no leito",{"$f":"IR23","v":{"v":0,"d":"0.00"}}]
[{"$nulls":246},"Erosão próxima e/ou nas margens",{"$f":"IT23","v":{"v":0,"d":"0.00"}}]
[{"$nulls":246},"Transparência da água",{"$f":"IV23","v":{"v":0,"d":"0.00"}}]
[{"$nulls":246},"Odor da água",{"$f":"IX23","v":{"v":0,"d":"0.00"}}]
[{"$nulls":246},"Tipo de fundo",{"$f":"IZ23","v":{"v":0,"d":"0.00"}}]
{"$rows_empty":9}
[{"$nulls":343},"Gerenciamento de resíduos - pontos críticos",{"$f":"IF(GY23=1,\"sim\",\"não\")","v":"não"}]