{"text_format":"3","workbook":"xlsx","n_sheets":14,"sheets":["Guia de aplicação","1 Questionário","2 Indicadores","3 Relatório","4 Plano de adequação","Plan1","Sheet3","Sheet4","Sheet5","Sheet6","Relatório de Assist (2)","Fórmulas","Base de dados","IQS 1"],"not_rendered":{"charts":6,"images":60,"defined_names":42,"comments":1},"read":"whole","date_system":"1900"}

{"sheet":"Guia de aplicação","index":0,"n_rows":336,"n_cols":6,"rows_kept":336,"merged":[[0,1,1,2],[2,1,2,2],[13,1,13,12],[15,1,15,12],[17,1,17,12],[19,1,19,12],[21,1,22,12],[24,1,24,12],[26,1,26,12],[28,0,34,0],[28,1,34,12],[36,0,37,0],[36,1,37,12],[39,0,41,0],[39,1,41,12],[45,1,45,12],[46,1,55,12],[57,1,57,12],[58,1,64,12],[66,1,66,12],[67,1,72,12],[74,1,74,12],[75,1,79,12],[81,1,81,12],[82,1,94,12],[96,1,96,12],[97,1,103,12],[105,1,105,12],[106,1,111,12],[113,1,113,12],[114,1,122,12],[124,1,124,12],[125,1,134,12],[136,1,136,12],[137,1,148,12],[150,1,150,12],[151,1,158,12],[160,1,160,12],[161,1,172,12],[174,1,174,12],[175,1,191,12],[193,1,193,12],[194,1,211,12],[213,1,213,12],[214,1,222,12],[224,1,224,6],[225,3,225,4],[225,5,225,6],[226,3,226,4],[226,5,226,6],[227,3,227,4],[227,5,227,6],[228,3,228,4],[228,5,228,6],[230,1,230,12],[231,1,241,12],[243,1,247,12],[249,1,254,12],[256,1,273,12],[275,1,275,12],[276,1,283,12],[285,1,289,12],[291,1,291,12],[292,1,303,12],[306,1,306,12],[307,1,312,12],[314,1,314,12],[315,1,321,12],[323,1,323,12],[324,1,333,12],[335,1,345,12]]}
[null,"ISA"]
[{"$nulls":3},"GUIA DE APLICAÇÃO"]
[null,"ISBN 978-85-99764-26-8"]
[null,"Indicadores de Sustentabilidade em Agroecossistemas - ISA"]
[null,"O sistema ISA é composto por 7 pastas e uma pasta assessória:"]
[null,"1ª - Guia de aplicação"]
[null,"2ª - Questionário"]
[null,"3ª - Indicadores"]
[null,"4ª - Relatório"]
[null,"5ª - Plano de adequação"]
[null,"6ª - Fórmulas utilizadas nos Indicadores"]
[null,"7ª - Base de dados"]
[null,"Pastas assessórias - Índice Qualidade do Solo na escala de um sistema de produção"]
[null,"A ferramenta ISA tem como objetivo avaliar limitações, potencialidades e aptidões para os diversos usos e ocupações na escala de um imóvel rural, integrando as dimensões ambiental, social e econômica. Cada indicador recebe um valor de 0 a 1, sendo 0,7 a referência para um bom desempenho ambiental, social e/ou econômico. Funções são aplicadas a cada indicador, comparando o valor medido na propriedade com o valor de referência, e um Índice Final (Aba Relatório) é gerado com base na média dos 21 indicadores de sustentabilidade. A ferramenta pode auxiliar produtores e técnicos no processo de planejamento, monitoramento e tomada de decisões, como também no gerenciamento de riscos. \t\t\t\t\t\t\t\t\t\t\n\t\t\t\t\t\t\t\t\t\t\t"]
[]
[null,"Aplicação do ISA"]
[]
[null,"1 - Crie um croqui do imóvel rural, começando pelo perímetro, usando o Google Earth ou um programa semelhante.\t\t\t\t\t\t\t\t\t"]
[]
[null,"2 - Identifique no croqui os diversos usos e ocupações do solo, incluindo culturas anuais, culturas perenes, pastagens, florestas, habitats naturais, corpos d'água, nascentes, represas e lagos. Esses dados (polígonos, linhas ou pontos) poderão ser aproveitados para gerar, verificar ou retificar o Cadastro Ambiental Rural (CAR).\t\t\t\t\t\t\t"]
[]
[null,"3 - A partir do croqui gerado, e de informações levantadas no CAR, como, por exemplo, as Áreas de Preservação Permanente (APPs) que necessitam de restauração, inicia-se o planejamento da visita de campo, definindo-se os locais que serão percorridos, com o objetivo de verificar o manejo das áreas produtivas, o estado de conservação das áreas com vegetação nativa, o estado de conservação das estradas, definir os locais para a coleta de amostras de solo, quando necessário, e os locais para a avaliação da qualidade da água e dos ecossistemas aquáticos, quando presentes. \n\t\t\t\t\t\t\t\t\t\t\t"]
[]
[]
[null,"Preenchimento dos dados "]
[null,"1 QUESTIONÁRIO"]
[1,"Colar os croquis do imóvel (croqui gerado no Google Earth ou outro programa similar, e o croqui gerado no CAR)."]
[]
[6,"O preenchimento da posse de terra diz respeito ao vínculo que o produtor possui com o imóvel rural. Proprietário é a pessoa física ou jurídica que possui o imóvel rural, válido e regularmente destacado do patrimônio público, com o registro imobiliário no seu nome. Ele detém o domínio pleno direto (direito de dispor do imóvel rural) e útil (direito de utilizar ou usufruir do imóvel rural).  O Posseiro é aquele que exerce o direito de posse por um ato translativo de domínio, por um documento de passagem de propriedade de um titular a outro, o que ocorre quando o título de propriedade ainda não foi levado a registro imobiliário. Arrendatário é aquele que arrenda (aluga) o imóvel rural para fins de exploração agrícola ou pecuária, na condição de uma regular utilização. Parceiro, ou \"Meeiro\", é aquele que explora o imóvel rural, no todo ou em parte, mediante contrato agrário escrito ou verbal, remunerando o proprietário ou titular do domínio útil com um percentual da produção alcançada. Assentado, pessoa ou família contemplada por um projeto de Reforma Agrária; Usufrutuário é a pessoa que utiliza a terra como usufruto, geralmente com vínculo familiar, e não tem a posse ou propriedade."]
{"$rows_empty":7}
[7,"A planilha ISA foi concebida para ser aplicada em um imóvel rural em consonância com a declaração do Cadastro Ambiental Rural (CAR). Caso o produtor possua outras áreas que compõem a renda ou façam parte do seu empreendimento rural (áreas não contíguas ao imóvel, áreas de arrendamento, áreas destinadas para a compensação de Reserva Legal), as mesmas serão descritas na tabela localizada nesse item, mas não serão objeto de análise dos indicadores."]
[]
[]
[8,"Identificar no imóvel rural as áreas de produção das culturas anuais, perenes, pastagens e florestas plantadas (silvicultura), além das áreas não agrícolas (construções, estradas, terreiros, etc.), áreas de pousio, espelho e cursos d'água (represas, lagos, lagoas, e cursos d'água), vegetação nativa e as áreas inaproveitáveis (vossorocas e outras áreas que no momento da avaliaçâo estavam inaproveitáveis para atividades econômicas). A somatória de todas as áreas lançadas neste item deve corresponder à área do imóvel rural lançada no item 7. Nota: O uso e a ocupação do solo referem-se apenas ao impóvel rural em análise e não incluem outros imóveis e áreas não contíguas."]
[]
[]
[]
[null,"2 INDICADORES"]
[]
[1,"ÍNDICES DE PRODUTIVIDADE E PREÇOS DE VENDA"]
[null,"DESCRIÇÃO\nAvalia a renda bruta anual do imóvel rural proveniente das atividades agrícolas e compara sua produtividade média e preço de mercado com a referência regional ou local. Esse indicador analisa também a contribuição relativa de cada atividade para a receita bruta total do imóvel rural.\nAPLICAÇÃO\n1ª ETAPA  - Identifique as principais fontes de renda das atividades agrícolas e liste-as em ordem decrescente com base na receita bruta anual estimada (Item 1.1): a primeira linha deve indicar a atividade que gera a maior receita bruta; a segunda linha deve indicar a atividade que gera a segunda maior receita bruta; as demais atividades devem ser agrupadas na terceira linha.                                                                                                                                                                                                    2ª ETAPA -  Selecione as atividades agrícolas e as unidades de medida para avaliar a produtividade. As atividades e unidades de medida podem ser modificadas na Aba Fórmulas.\n3ª ETAPA - Insira os índices de produtividade: para culturas anuais, considere a produtividade média da última safra; para a pecuária, considere a produção média do último ano; para culturas perenes, considere a média de produção das duas últimas safras.\n4ª ETAPA - Informe o preço médio de venda da safra mais recente ou do último ano. Para vendas parceladas, calcule o valor médio.\n5ª ETAPA - Lançe a média de produtividade e do preço de venda dos produtos levantados na região ou município. Utilize dados de relatórios anuais oficiais, cooperativas, associações ou agricultores reconhecidos como referência na região. O cálculo do resultado final é feito automaticamente, a partir da média dos índices gerados de cada atividade do empreendimento. Possíveis informações complementares / indagações: Como essa produtividade foi alcançada? Qual é a capacidade produtiva do solo nas áreas agrícolas? Como as atividades são gerenciadas? Quais insumos são utilizados e em quais quantidades? Quais são os critérios para aplicação desses insumos? Quais são as estratégias de compra de insumos?Há disponibilidade de máquinas e equipamentos, ou os serviços são terceirizados? Existe mão de obra qualificada na região? Há infraestrutura pós-colheita ou depende de serviços terceirizados? Como a produção é comercializada e transportada? Ao responder a essas e outras perguntas relevantes, é possível entender como o indicador foi formado. Com base nessa análise, avalie se o resultado está adequado e identifique oportunidades de melhoria. Nota: se a renda bruta média gerada no imóvel rural for menor que R$ 300,00/ha/ano — considerando a receita bruta estimada e a área do imóvel rural — é gerado um rebate de 30% na nota final deste indicador (cálculo realizado automaticamente)."]
{"$rows_empty":10}
[2,"DIVERSIDADE DE RENDA"]
[null,"DESCRIÇÃO\nAnalisa a diversidade das fontes de renda, atribuindo diferentes pesos com base na origem (dentro ou fora da propriedade) e no tipo de renda.                                                                                                                                                                                                     APLICAÇÃO\nEstimar as outras fontes de renda dentro do imóvel rural (item 2.1) e as fontes de renda fora do imóvel rural (atividades agropecuárias, ou não, realizadas fora do imóvel rural e recebimentos de pensão, aposentadoria, bolsas e outras ajudas financeiras - item 2.2) pelos membros da família diretamente envolvidos nas atividades produtivas do imóvel rura. Os porcentuais de cada fonte de renda são lançados automaticamente, assim como a verificação de concentração de renda em uma única atividade agropecuária (item 2.3)."]
{"$rows_empty":7}
[3,"EVOLUÇÃO PATRIMONIAL DO IMÓVEL RURAL\t\t\t\t\t\t\t\t\t\t\t"]
[null,"DESCRIÇÃO\nEstima o valor dos ativos da fazenda, incluindo equipamentos, benfeitorias, semoventes (animais), estoque de grãos, uso e ocupação do solo e valor das terras. O indicador analisa o crescimento ou a redução dos ativos ao longo de um período de tempo definido.\nAPLICAÇÃO\n1ª ETAPA - (item 3.1) - Defina o tempo de aferição da evolução patrimonial - referência 1 ano ou o período referente à última aplicação do ISA.                                                                                         2ª ETAPA - (item 3.2) – Informe o valor estimado das instalações, benfeitorias ou reformas recentemente concluídas (durante o período definido no Item 3.1), assim como o valor estimado das instalações e benfeitorias existentes antes desse período (informe o valor ou utilize o valor da última aplicação do ISA). Informe o valor estimado das máquinas e equipamentos adquiridos recentemente (durante o período definido no primeiro passo, Item 3.1) e o valor estimado das máquinas e equipamentos existentes antes do período (Item 3.2).\n3ª ETAPA  - (item 3.3) – Informe a quantidade de animais e o estoque agrícola, juntamente com a estimativa do valor de cada categoria (R$). Informe os dados do histórico do rebanho (1 ano antes ou referente a última aplicação). A avaliação das estruturas (equipamentos e benfeitorias) e do estoque no imóvel rural auxilia na atualização cadastral do produtor(a) rural nas instituições financeiras.                                                                                                                                                                                                                4ª ETAPA  - (item 3.4) -  Levante a área de agricultura irrigada na fazenda. Verifique se houve alguma alteração na área irrigada na coluna “Uso histórico”.\n5ª ETAPA  - (item 3.5) -  Verifique se houve alguma mudança no histórico de uso e ocupação do solo em comparação com a ocupação atual descrita no levantamento.                                                                                                                                                                                                                                        6ª ETAPA - (item 3.6) - Informe os valores atuais e históricos do preço da terra.\n"]
[]
[]
[]
[]
[]
[]
[4,"GRAU DE ENDIVIDAMENTO\t\t\t\t\t\t\t\t\t\t\t"]
[null,"DESCRIÇÃO\nAvalia o nível de endividamento do imóvel rural comparando o valor total dos empréstimos (de curto e longo prazo) com o valor patrimonial estimado no Indicador 3.\nAPLICAÇÃO\nLevantar todos os financiamentos de curto e longo prazos contraídos pelo produtor até o presente momento e lançar o valor no item 4.1 "]
[]
[]
[]
[]
[]
[5,"SERVIÇOS BÁSICOS DISPONÍVEIS PARA O IMÓVEL RURAL / SEGURANÇA ALIMENTAR"]
[null,"DESCRIÇÃO\nAvalia o acesso aos serviços básicos como água (quantidade e qualidade), eletricidade, estradas, transporte escolar, saúde, segurança, internet e coleta pública de lixo. Para pequenas propriedades, verifica também a disponibilidade da produção de alimentos no próprio imóvel rural  como medida para aferir segurança alimentar (hortaliças, frutas, tubérculos e fontes de proteína animal).\nAPLICAÇÃO - Basic services\n1ª ETAPA  - Verifique quantas residências com moradores regulares possui o estabelecimento.\n2ª ETAPA - Para cada residência, verifique a disponibilidade dos serviços listados no Indicador. Para o preenchimento deste indicador, deve-se colocar 1 (se atende satisfatoriamente), 0,5 (se atende parcialmente), ou 0 (não atende ou inexistente).                                 \nAPLICAÇÃO - Produção própia de alimentos (para os imóveis classificados como Agricultores Familiares)\n1ª ETAPA - Verifique quantas residências com moradores regulares possui o estabelecimento \n2ª ETAPA - Para cada residência ou conjunto de residências, verifique se há produção de hortaliças, tubérculos, frutas e criação de animais para o consumo dos residentes.\nOBS:  Os valores utilizados no preenchimento de cada item são: 1 (presente); 0,5 (parcial) ou 0 (inexistente). Entende-se por parcial a presença do item, mas em quantidade insuficiente para atender à demanda da família. Exemplo de uma referência para uma família com 5 pessoas (demanda média de 2.630 kcal/dia): Citros, 4 pés; Mamoeiros, 13 pés; Bananeiras, 18 pés; Vacas de leite, 2; Cevados (porcos)/ano, 4; Frangos/ano, 100; Galinhas, 50; Galos, 3; Mandioca, 200 kg; Hortaliças (folhosas, frutos e tubérculos)/ano, 600 kg (Fonte: Emater/MG).                                                                                         \n"]
{"$rows_empty":13}
[6,"ESCOLARIDADE & CURSOS DIRECIONADOS ÀS PRINCIPAIS ATIVIDADES\t\t\t\t\t\t\t\t\t\t\t"]
[null,"DESCRIÇÃO\nVerifica o nível de escolaridade do agricultor, dos membros da família envolvidos nas atividades do imóvel rural e dos trabalhadores permanentes. Avalia a participação em cursos e oficinas de curta e média duração. Verifica se todas as crianças em idade escolar estão frequentando a escola.\nAPLICAÇÃO\n1ª ETAPA - Verifique o número de adultos com vínculo direto à produção e funcionários permanentes. Levantar o número de dependentes em idade escolar que residem no estabelecimento.\n2ª ETAPA - Para cada pesssoa identificada na primeira etapa verifique o grau de escolaridadee a participação dos mesmos em cursos de capacitação direcionado às atividades (no último ano). É feita também a verificação se todos os dependentes em idade escolar, residentes no imóvel rural, estão frequentando a escola.\n"]
{"$rows_empty":7}
[7,"OCUPAÇÃO & EMPREGO\t\t\t\t\t\t\t\t\t\t\t"]
[null,"DESCRIÇÃO\nVerifica o cumprimento da legislação trabalhista e a adesão às normas recomendadas de trabalho tanto para funcionários permanentes quanto temporários.\nAPLICAÇÃO\n1ª ETAPA - Verifique o número de funcionários permanentes (contratação efetiva) e temporários (item 7.1). \n2ª ETAPA - A partir do levantamento do número de funcionários permanentes e temporários, verifique quantos são atendidos pelo item 7.1 (referente às obrigações da legislação trabalhista) e item 7.2 (referente às recomendações e determinações do Ministério do Trabalho)."]
[]
[]
[]
[]
[]
[]
[8,"GESTÃO DO EMPREENDIMENTO\t\t\t\t\t\t\t\t\t\t\t"]
[null,"DESCRIÇÃO\nAvalia o uso de ferramentas de gestão do imóvel rural - fluxo de caixa; registros dos custos de produção; acesso à assistência técnica; participação em associações, sindicatos ou cooperativas; conformidade com regulamentações ambientais; e acesso a crédito financeiro.\nAPLICAÇÃO\n1ª ETAPA - Verifique se é feito um controle de receitas e despesas no empreendimento rural (fluxo de caixa).\n2ª ETAPA - Verifique se é feito um controle de custos de produção para as atividades desenvolvidas no imóvel rural.\n3ª ETAPA - Verifique se o produtor tem acesso à assistência técnica (assistência de revendas ou lojas de insumos agropecuários não são consideradas).\n4ª ETAPA - Verifique se o produtor participa ativamente ou de forma eventual em associações, cooperativas, sindicatos, ou outras formas de organização dos produtores rurais .\n5ª ETAPA - Verifique a situação da regularização ambiental do produtor com relação a água, licença ambiental e regularização da Reserva Legal (RL) e das Áreas de Preservação Permanente (APP) a partir do Cadastro Ambiental Rural (CAR).\n6ª ETAPA - Verifique se o produtor tem acesso às linhas de crédito (custeio, investimentos e/ou crédito para a comercialização da produção). Para o preenchimento deste indicador, deve-se colocar o valor 1 (se a atividade é realizada satisfatoriamente), 0,5 (se a atividade é realizada parcialmente) ou 0 (se inexistente)."]
{"$rows_empty":9}
[9,"COMERCIALIZAÇÃO & INOVAÇÃO\t\t\t\t\t\t\t\t\t\t\t"]
[null,"DESCRIÇÃO\nAvalia se o produtor(a) busca informações de mercado, acessa mercados institucionais ou com valor agregado, adota técnicas inovadoras e ambientalmente adequadas, e demonstra capacidade de inovação ou exerce papel de liderança na comunidade.\nAPLICAÇÃO\n1ª ETAPA -  Verifique quais estratégias são utilizadas para a comercialização da produção e como o produtor obtem informações sobre o mercado (consultas em sites,  Cooperativas, Associações, etc.). Verificarocorrência de produção certificada ou direcionada para mercados institucionais (orgânica e outras certificações, mercados institucionais como, por exemplo, o Programa de Aquisição de Alimentos - PAA e o Programa Nacional de Alimentação Escolar - PNAE).\n2ª ETAPA - Verifique, durante as visitas aos talhões, quais os principais entraves e quais medidas e tecnologias estão sendo adotadas pelo produtor para resolver ou minimizar os eventuais problemas (com o foco nos princípios e fundamentos da agricultura conservacionista / regenerativa). Caso afirmativo, fazer a descrição da técnica inovadora adotada. Verificar também a capacidade de inovação do produtor ou se o mesmo tem uma posição de liderança na comunidade (caso afirmativo fazer a descrição). Avaliar a adoção de práticas que promovam cobertura permanente e diversificada do solo (optativo).\n"]
{"$rows_empty":10}
[10,"GERENCIAMENTO DE RESÍDUOS E EFLUENTES NO IMÓVEL RURAL\t\t\t\t\t\t\t\t\t\t\t"]
[null,"DESCRIÇÃO\nVerifica o índice de coleta e destinação adequada do lixo e esgoto, o índice de reaproveitamento dos resíduos orgânicos no imóvel rural, e o índice de tratamento e destinação adequada de efluentes líquidos e gasosos quando presentes no imóvel rural.\nAPLICAÇÃO\n1ª ETAPA - Verifique o destino do esgoto doméstico gerado em cada residência existente no imóvel rural (item 10.1).\n2ª ETAPA - Examine o destino do lixo doméstico e do lixo gerado nas unidades de produção (lixo reciclável – embalagens, plástico, papel, latas, e o lixo não reciclável) (item 10.2).\n3ª ETAPA -  Estime a proporção (%) do total de resíduos orgânicos que são compostados ou reaproveitados nas unidades de produção (palhadas, esterco, cama de frango, entre outros).\n4ª ETAPA - Verifique se ocorre geração de efluentes líquidos (curral, galpões para criação de animais, unidades de compostagem, café despolpado, chorumeira, etc.). Caso afirmativo, estime qual a proporção (%) dos efluentes gerados que recebem tratamento e destinação adequada.\n5ª ETAPA -  Verifique se ocorre a geração de efluentes gasosos (caldeiras, carvoaria, biodigestores, etc.). Cas afirmatico, estime qual a proporção (%) do total de efluentes gasosos gerados que possuem um tratamento adequado antes de serem lançados na atmosfera.\n6ª ETAPA - Identifique a ocorrecência de alguma situação crítica com relação ao gerenciamento de resíduos e efluentes:  fossa seca (negra) localizada próxima a um curso d'água ou poço artesiano; lançamento de efuentes (domésticos ou de criações) sem nehum tratamento em corpos d'água; esgoto a céu aberto, queima de resíduos plásticos, baterias, e outros materiais sintéticos no imóvel rural, entre outros."]
{"$rows_empty":12}
[11,"SEGURANÇA DO TRABALHO / GESTÃO DO USO DE AGROTÓXICOS\t\t\t\t\t\t\t\t\t\t\t"]
[null,"DESCRIÇÃO\nAvalia o cumprimento das exigências legais para o uso de agrotóxicos e medicamentos veterinários, incluindo medidas de proteção com o uso de equipamento de proteção individuais, armazenamento e devolução das embalagens.\nAPLICAÇÃO\n1ª ETAPA - Verifique se agrotóxicos são utilizados em alguma parte do imóvel rural, o número de pessoas que os manuseiam e quantas usam equipamentos de proteção individual.\n2ª ETAPA - Verifique se o imóvel rural possui um local adequado para o armazenamento das embalagens de agrotóxicos (local exclusivo com acesso restrito e ventilado) e se o produtor faz a devolução dessas embalagens no local indicado pela revenda, conforme a Lei 12.305/10 que institui a Política Nacional de Resíduos Sólidos e trata da logística reversa dos resíduos (excolher a opção \"sim\" quando for adequado e suficiente).\n"]
{"$rows_empty":8}
[12,"QUALIDADE DO SOLO"]
[null,"DESCRIÇÃO\nAvalie a fertilidade e atividade biológica do solo. A avaliação da atividade biológica é opcional e considera as enzimas arilsulfatase e β-glicosidase (tecnologia BioAS da Embrapa).\nAPLICAÇÃO\n1ª ETAPA - Identifique a área mais representativa do imóvel rural ou a área direcionada para as intervenções propostas no plano de adequação. Verificar se o entrevistado possui análises recentes de fertilidade do solo (período até 2 anos), e se as mesmas possuem análise granulométrica do solo (textura). \n2ª ETAPA - A partir das informações levantadas verifique a necessidade de fazer outras coletas de amostras de solos para análise química em laboratório de solo. Se necessário, fazer a coleta de amostras de solo evitando talhões que foram recentemente adubados, locais próximos a brejos, casas, galpões, formigueiros ou voçorocas. As coletas devem ser realizadas na profundidade de 0-20 cm, com auxílio de um trado, caminhando em zigue-zague pela área. Após a coleta de amostras, o solo deve ser bem misturado, para obtenção de uma amostra composta do talhão. Desta, separa-se uma porção da amostra composta de, aproximadamente, 300 g, em saco plástico limpo e identificado (nome do talhão, data e o código do estabelecimento), para ser encaminhada ao laboratório de solos. Para as análises da biologia do solo, realizar o mesmo procedimento, porém, na profundidade de 0-10 cm.\n3ª ETAPA -  Ao lançar os dados da análise de solo, primeiro, faça a descrição do talhão e a data da análise no laboratório (campo descrição do talhão). As interpretações dos teores de matéria orgânica e fósforo consideram a textura do solo. Pode ser inserido (opcional) dados sobre aspectos relacionados à atividade biológica do solo envolvendo a BioAS (análise das enzimas arilsulfatase e betaglicosidase em amostras de solo coletadas conforme a descrição da 2ª etapa, na profundidade de 0-10cm). As interpretações dos dados são baseados no sistema da Embrapa (Mendes et al., 2021).\n"]
{"$rows_empty":12}
[13,"QUALIDADE DA ÁGUA"]
[null,"DESCRIÇÃO\nAvalia os ecossistemas aquáticos em dois trechos de um curso d’água utilizando um protocolo de avaliação rápida com nove parâmetros. Análises adicionais (opcional) podem incluir testes a campo (fitas) do pH, nitrato e coliformes e medição da turbidez.\nAPLICAÇÃO\n1ª ETAPA -  Identifique os corpos d'água que passam pelo imóvel rural. Escolher o curso d'água mais representativo ou mais importante para o imóvel rural (abastecimento ou irrigação).\n2ª ETAPA - Depois que o curso de água for definido, identifique os locais de amostragem a montante e a jusante: montante – o ponto onde o curso de água entra no imóvel rural ou próximo de uma nascente; jusante – o ponto de saída do curso d'água que passa dentro ou na divisa do imóvel rural, ou próximo ao local onde um curso d'água deságua em outro corpo d'água.\n3ª ETAPA -  Aplique o protocolo de avaliação rápida dos ecossistemas aquáticos.  Pode ser levado um notebook, tablet ou o cheklist impresso para realizar o seu preenchimento no próprio local de avaliação (item 3.1). \n4ª ETAPA (opcional) - Se for utilizar as fitas para leitura de pH e nitrato, os resultados devem ser anotados ou registrados in loco, no caso da cartela microbiológica para análise da presença de coliformes termotolerantes, fazer a leitura após incubação por 15 horas (para a sua coleta, não tocar na cartela, deixar o excesso de água escorrer e guardar a mesma envolta em um papel alumínio até o local de incubação. Após a incubação, proceder a contagem das colônias, considerando sempre os dois lados da cartela. Coliformes fecais são os pontos azuis. Multiplicar cada ponto por 60 para lançar na planilha). A avaliação da turbidez pode ser feita no local utilizando-se equipamentos portáteis para a sua avaliação (item 13.2). OBS: A análise da qualidade da água subterrânea no imóvel rural também é opcional, e pode ser feita com a coleta de água de um poço ou água utilizada para consumo no imóvel rural (item 13.3).\n"]
{"$rows_empty":17}
[14,"RISCO DE CONTAMINAÇÃO DA ÁGUA POR AGROTÓXICOS "]
[null,"DESCRIÇÃO\nAvalia o potencial de contaminação da água por agroquímicos com base na vulnerabilidade da área de aplicação (determinada pela textura do solo, proximidade de cursos d’água e práticas de manejo do solo) e no potencial de contaminação dos princípios ativos (com base na persistência, mobilidade e toxicidade dos ingredientes ativos).\nAPLICAÇÃO\n1ª ETAPA - Selecione o ingrediente ativo principal dos produtos (pesticidas) usados ​​para controle de pragas, doenças e plantas invasoras/espontâneas em sistemas agrícolas, pastagens e florestas comerciais (clique no cabeçalho e selecione o produto – item 14.1).\n2ª ETAPA - Para cada produto (pesticida), identifique, opcional, a procentagem do ingrediente ativo, identtifique a cultura, a área de aplicação (ha) e o volume aplicado (L ou kg/ha). Recomenda-se agrupar os pesticidas por cultura (por exemplo, café, milho, soja), mesmo que um produto seja usado em várias culturas, pois as taxas de aplicação podem variar.\n3ª ETAPA -  Os dados de toxicidade, mobilidade do produto no ambiente (coeficiente Koc, que representa a absorção do pesticida na matéria orgânica do solo) e persistência do produto (t1/2, meia-vida in situ em dias) são preenchidos automaticamente. Informações adicionais sobre ingredientes ativos não listados estão disponíveis no Banco de Dados (https://sitem.herts.ac.uk/aeru/ppdb/en/). Dados sobre riscos de contaminação para trabalhadores rurais, consumidores e o meio ambiente (índice EIQ da Universidade Cornell) também estão incluídos, juntamente com detalhes sobre a identificação de pesticidas que estão proibidos na União Europeia.                                                                                                                                                                                                                                                               4ª ETAPA -  Para cada pesticida, identifique as características da área de aplicação, considerando: teor de argila (1, 2 ou 3, com base no item 14.5); distância até o curso d’água mais próximo (1, 2 ou 3, com base no item 14.6); tipo de manejo do solo (1, 2 ou 3, com base no item 14.7). Esta etapa visa determinar a vulnerabilidade dessas áreas quanto à contaminação das águas.\n5ª ETAPA - O risco de contaminação é calculado automaticamente para cada produto. Para gerar uma pontuação de risco final, insira no item 14.3 as culturas identificadas, suas respectivas áreas e, para cada cultura, o maior risco de contaminação verificado (1, 2 ou 3, onde 3 é o maior). Por exemplo, se cinco pesticidas foram aplicados em uma cultura de milho, com os seguintes riscos de contaminação: Dois produtos classificados como 1; Dois produtos classificados como 2; Um produto classificado como 3. O valor registrado no indicador será 3, pois representa o maior risco de contaminação. O resultado final considera o risco máximo e a área equivalente de cada cultura na fazenda.\n"]
{"$rows_empty":18}
[15,"EROSÃO DO SOLO"]
[null,"DESCRIÇÃO\nVerifica a ocorrência ou não de áreas afetadas, estimando a extensão, intensidade (inicial, intermediária ou avançada) e tendência de comportamento do processo erosivo (redução, inalterado ou intensificação). Se não houver processos erosivos no imóvel rural, deixe o indicador sem preencher (a nota será = 0,7)\nAPLICAÇÃO\n1ª ETAPA - Identifique quaisquer áreas com degradação do solo.\n2ª ETAPA - Após a identificação, determine qual área apresenta a maior intensidade e/ou o estágio mais severo de degradação. As estimativas podem ser feitas no local ou com o auxílio de imagens de satélite. Apenas uma área será registrada na planilha, selecionando uma categoria (estágio Inicial, Intermediário ou Avançado).\n3ª ETAPA - Selecione qual tendência de comportamento do processo erosivo: redução, inalterado ou intensificação."]
{"$rows_empty":9}
[null,"Indicativos da Intensidade do estágio de degradação"]
[null,null,"Inicial","Intermediário",null,"Avançado"]
[null,"Erosão laminar","Redução de infiltração de água Raízes expostas","Remoção do horizonte superficial do solo"]
[null,"Erosão em sulcos",null,"Presença de sulcos rasos localizados",null,"Sulcos profundos e disseminados em toda a área"]
[null,"Voçoroca",{"$nulls":3},"Presença de voçorocas, movimento de  massa (deslocamento de grandes volumes de solo)"]
[]
[16,"GRAU DE ADOÇÃO DE PRÁTICAS CONSERVACIONISTAS"]
[null,"DESCRIÇÃO\nAvalia a adoção de medidas de conservação do solo e da água (suficientes, insuficientes ou inadequadas) em todos os sistemas de produção, incluindo a implantação de terraceamentos, quando necessário, cobertura permanente e diversificada do solo, entre outras estratégias para tornar os sistemas mais resilientes  ao estresse hídrico e chuvas de alta intensidade, ampliar a capacidade do solo de infiltrar e reter as águas pluviais, além de outras estratégias para reservação de água no imóvel rural.\nAPLICAÇÃO\n1ª ETAPA - Avalie a adoção de medidas de conservação do solo em todos os sistemas de produção identificados no questionário (item 8). Veja exemplos abaixo.\n2ª ETAPA - Após avaliar o grau de adoção de práticas de conservação — considerando a topografia, a cobertura vegetal e, para culturas permanentes e florestas plantadas, seu estágio de desenvolvimento — registre as respectivas áreas de cada talhão e pasto de acordo com as seguintes categorias: Adequado — As medidas de conservação são adequadas para conter eventuais processos erosivos, não há simais de erosão na área; Médio - existem medidas para conservação do solo mas são inadequadas para prevenir completamente a erosão, incluindo a erosão laminar de baixa intensidade; Baixo — Existem algumas medidas pontuais, mas estão distantes do mínimo necessário para previnir os processo erosivos;  Situação crítica — Grave ausência de práticas de conservação do solo e/ou presença de processos erosivos de alta intensidade.                                                                                                                                                                                                                                           3ª ETAPA - Verifique com o produtor o grau de adoção de estratégias para a conservação e reservação das águas, considerando todo o imóvel rural, marcando uma das opções: suficiente; insuficiente; ou situação inadequada ou de alta fragilidade (item 16.2).\n"]
{"$rows_empty":11}
[null,"PRÁTICAS CONSERVACIONISTAS - SOLO (REFERÊNCIA)\nADEQUADO - Terraços, rotação de culturas, sistemas de plantio direto e cobertura de solo permanente e diversificada, sem sinais de erosão.                        MÉDIO - Práticas adotadas para a conservação do solo são insuficientes, solos sem boa estrutura ou compactados.\nBAIXO - Solo desprotegido, plantio sem respeitar as curvas de nível, revolvimento do solo (aração, gradagem, etc.).\nSITUAÇÃO CRÍTICA - Ausência de práticas de conservação do solo, processos severos de erosão, solos muito compactados, uso intensivo de grade e arado, presença de fogo, monocultivos sem rotação de culturas, solo exposto, etc."]
[]
[]
[]
[]
[]
[null,"PRÁTICAS CONSERVACIONISTAS - ÁGUA (REFERÊNCIA)\nSUFICIENTE - Práticas adotadas são suficientes para garantir o abastecimento de água (para consumo humano e/ou atividades agrícolas); implementação de estruturas para minimizar o poder erosivo do escoamento superficial (principalmente enxurradas) em talhões e estradas; adoção de estratégias para manter ou aumentar a matéria orgânica do solo e atividade biológica visando maior estabilidade de agregados e melhora na infiltração e retenção de água no solo.\nINSUFICIENTE - Práticas adotadas não são suficientes para previnir processos erosivos, e, consequentemente, a perda de água nos sistemas. Práticas adotadas não garantem o abastecimento de água para consumo, e atividades agrícolas.\nINADEQUADO - Escassez de água para consumo humano; para consumo animal; ausência de práticas para lidar com a seca; processos erosivos de alta intensidade."]
[]
[]
[]
[]
[]
[]
[null,"PLANTIO EM CURVA DE NÍVEL - Preparo do solo é realizado seguindo a direção da curva de nível do terreno. Para terrenos com pequena declividade, o plantio em nível cria obstáculos à descida do escoamento superficial das águas pluviais, propiciando a redução dos processos erosivos e aumento da infiltração de água no solo.                                                                                                                                                                                                                                       SISTEMA PLANTIO DIRETO - É um sistema de semeadura, no qual a semente é colocada diretamente no solo não revolvido, usando-se máquinas específicas. Somente é aberto um pequeno sulco ou cova de largura e profundidade suficientes para a adequada cobertura e contato das sementes com o solo. O sistema plantio direto segue três princípios: não revolvimento do solo, cobertura permanente do solo e rotação de culturas, além da diversificação de culturas e minimização dos distúrbios à atividade microbiológica do solo. \nCOBERTURA PERMANENTE DO SOLO  - A permanência de palhadas de colheitas anteriores ou o uso de plantas de cobertura evitam que o solo fique exposto à insolação, reduz a evaporação, fornece também proteção contra o impacto das gotas de chuva, reduzindo o escoamento superficial e a erosão. A cobertura permanente do solo apresenta como benefícios: a redução da incidência de plantas invasoras; promoção do equilíbrio da flora e da fauna do solo; favorecimento do manejo integrado de pragas e doenças; maior estabilização da taxa de reciclagem de nutrientes; e promoção da atividade biológica no solo.             ROTAÇÃO DE CULTURAS  - Consiste em alternar, anualmente, espécies vegetais, numa mesma área agrícola. As espécies escolhidas podem ter, ao mesmo tempo, propósito comercial e de recuperação do solo. A diversidade de plantas influencia na diversidade da microbiota do solo, proporcionando maior resiliência dos sistemas de produção.\nQUEBRA-VENTOS / BARREIRAS VEGETAIS  - Plantio de árvores em intervalos regulares no entorno de lavouras e pastagens em direção perpendicular aos ventos dominantes, ou formação de barreiras vegetais. Seus benefícios principais são as alterações no microclima, o que pode levar a incrementos na produção, reduzindo a necessidade por insumos externos. O sombreamento auxilia no aumento da umidade do solo, enquanto a redução dos ventos diminui a erosão eólica. A presença de árvores também funciona como um fator atrativo para diversas espécies. \nFAIXAS COM VEGETAÇÃO NATURAL, ROÇADAS ALTERNADAS  -  Aplicável em novas áreas, onde o desmatamento parcial permite a permanência de fileiras alternadas de vegetação nativa permanente entre as culturas cultivadas. Essa vegetação nativa serve como quebra-ventos e oferece refúgio para predadores naturais de pragas.\nCULTURAS INTERCALARES - Podem ser utilizadas culturas comerciais ou não. O plantio de culturas de porte, ciclo e comportamento agronômico diferentes podem trazer benefícios com o aumento da biodiversidade e melhor aproveitamento dos nutrientes do solo, explorando diferentes camadas do solo.\nTERRACEAMENTO -   Os terraços podem ser locados em nível, em desnível ou de forma mista. Os terraços em nível possuem as extremidades bloqueadas e têm a função de acumular e infiltrar a água, e são recomendados para áreas com boa permeabilidade e declividade de até 12%. Os terraços em desnível apresentam pequeno gradiente ao longo de seu comprimento e conduzem a água para as laterais, sendo mais adequados, para áreas com menor permeabilidade e/ou declividades superiores a 12%. Os terraços mistos englobam os dois tipos anteriores, ou seja, são projetados em pequeno desnível e com capacidade de acumulação de água que, ao ser excedida, escoa pelas laterais. Em encostas ou morros onde o volume e a velocidade da enxurrada são grandes, dependendo do comprimento de rampa e da declividade, o terraço em desnível é mais recomendado para se evitar que estes se rompam, podendo ser construídos com menor largura. A seleção do tipo de terraço a ser construído, assim como seu dimensionamento, sua locação e sua construção devem ser feitas por profissionais qualificados. Os terraços classificam-se ainda quanto a sua largura, em base estreita (menos de 3 m), base média (3 a 6 m) e base larga (6 a 12 m). \n\n\n"]
{"$rows_empty":18}
[17,"CONSERVAÇÃO DAS ESTRADAS"]
[null,"DESCRIÇÃO\nAvalie a presença de estruturas de drenagem e sistemas de escoamento de águas pluviais nas estradas, bem como o estado e a manutenção das estradas dentro do imóvel rural.\nAPLICAÇÃO\n1ª ETAPA - Percorra as estradas de acesso que cruzam ou margeiam o imóvel rural, bem como as estradas internas, verificando seu estado de conservação e eventuais medidas de conservação adotadas.\n2ª ETAPA - Estime o grau de adoção de medidas de conservação implementadas (item 17.1) e a proporção de buracos e sulcos de erosão (item 17.2).                               3ª ETAPA  - Verifique se há pontos críticos no local que possam interferir no acesso e/ou compromoter o escoamento de produtos (item 17.3).\n"]
{"$rows_empty":8}
[null,"DECLIVIDADE TRANSVERSAL DA ESTRADA - Inclinação da seção transversal, a partir do eixo da estrada, para permitir o escoamento das águas superficiais para as valas laterais.\nLOMBADAS PARA DESVIO DE ENXURRADA - Elevações construídas transversalmente ao longo de toda a largura do leito da estrada, com o objetivo de conduzir as águas pluviais aos dispositivos (caixas de infiltração ou barraginhas) para absorvê-las e ou armazená-las.\nCAIXAS DE CAPTAÇÃO DE ÁGUA OU BARRAGINHAS - Estruturas para a captação da águas de chuva - pequenas barragens ou miniaçudes. \nBACIAS DE INFILTRAÇÃO  - Depressão no terreno construída, geralmente às margens da estrada, com o objetivo de reduzir o volume das enxurradas e promover a recarga da água subterrânea. \n"]
[]
[]
[]
[]
[]
[18,"VEGETAÇÃO NATIVA - FITOFISIONOMIAS E ESTADO DE CONSERVAÇÃO\t\t\t\t\t\t\t\t\t\t\t"]
[null,"DESCRIÇÃO\nIdentifica as fitofisionomias (habitats naturais) presentes no imóvel rural e avalia seu estado de conservação (estágio sucessional). Verifica o número de fragmentos de vegetação nativa existentes no imóvel rural e se esses fragmentos estão protegidos contra pastoreio e fogo.\nAPLICAÇÃO\n1ª ETAPA - Identifique os diferentes tipos de vegetação nativa (selecione a fitofisionomia no cabeçalho da tabela - item 18.1).\n2ª ETAPA - Estime a área correspondente a cada fragmento de vegetação nativa e identifique seu estágio sucessional.\n3ª ETAPA  - Verifique a quantidade de fragmentos com vegetação nativa dentro do imóvel rural por meio de observações de campo e imagens de satélite (item 18.2).\n4ª ETAPA - Verifique se algum fragmento de vegetação nativa tem conexão com a vegetação nativa de imoveis rurais vizinhos (marque com um \"X\" se houver) (item 18.3).                                                                                                                                                                                                                                                                     5ª ETAPA - Verifique se todos os fragmentos de vegetação nativa estão protegidos do pastoreio (com cercas suficientes) e incêndios (presença de aceiros com manutenção anual). Caso afirmativo, marque com um \"X\" (item 18.4).\n "]
{"$rows_empty":13}
[19,"ÁREAS DE PRESERVAÇÃO PERMANENTE (APPs) \t\t\t\t\t\t\t\t\t\t"]
[null,"DESCRIÇÃO\nAvalie o estado de conservação das APPs. Essas áreas funcionam como zonas de amortecimento para prevenir a erosão do solo, filtrar o escoamento superficial e fornecer habitat para espécies aquáticas e terrestres\nAPLICAÇÃO\n1ª ETAPA - O lançamento dos dados é feito automaticamente no item 19.1, a partir da identificação do uso e ocupação do solo nas APPs (item 9 do questionário).  \n2ª ETAPA - Verifique no campo e na imagem de satélite o percentual das APPs efetivamente protegidas e com bom estado de conservação (item19.2).                  Considera-se APP: faixas marginais de qualquer curso d'água natural perene e intermitente; as áreas no entorno das nascentes e dos olhos d’água perenes; as áreas no entorno dos reservatórios d’água artificiais, decorrentes de barramento ou represamento de cursos d’água naturais; as encostas ou partes destas com declividade superior a 45º , equivalente a 100% (cem por cento) na linha de maior declive; as bordas dos tabuleiros ou chapadas, até a linha de ruptura do relevo; em veredas, a faixa marginal, em projeção horizontal, com largura mínima de 50 (cinquenta) metros, a partir do espaço permanentemente brejoso e encharcado;\tno topo de morros, montes, montanhas e serras, com altura mínima de 100 (cem) metros e inclinação média maior que 25º; as áreas em altitude superior a 1.800 (mil e oitocentos) metros, qualquer que seja a vegetação; as restingas, como fixadoras de dunas ou estabilizadoras de mangues; os manguezais, em toda a sua extensão (Código Florestal LEI 12.651 de 25 de maio de 2012).\t\t\t\t\t\t"]
[]
[]
[]
[]
[]
[]
[20,"RESERVA LEGAL"]
[null,"DESCRIÇÃO\nAvaliar o cumprimento da exigência de Reserva Legal (RL) no imóvel rural, conforme o Novo Código Florestal. Verificar também se o imóvel rural possui área com vegetação nativa excedente à exigência para RL (considerado como um ativo ambiental). \nAPLICAÇÃO\nA Verificação do cumprimento da RL é feita automaticamente para imóveis com área menor que 4 Módulos Fiscais - no campo \"Áreas de/para RL não passíveis de recomposição\". Para os demais imóveis rurais (>4MF), o preenchimento não será feito de forma automátca, utilizando-se os campos do item 20.1: \"Área de RL fora do imóvel rural\" (Se a RL, ou parte da RL, estiver localizada fora do imóvel rural); \"Áreas de/para RL que necessitam de recomposição \" (se a RL estiver localizada dentro do imóvel rural, verificar se a mesma possui alguma área que necessita de recomposição); \"Áreas de/para RL não passíveis de recomposição\".\n\n"]
{"$rows_empty":7}
[21,"BIODIVERSIDADE E ECOLOGIA DA PAISAGEM"]
[null,"DESCRIÇÃO\nAvalia o grau de adoção de práticas que promovem a biodiversidade nas áreas cultivadas, bem como avalia a diversidade na escala do imóvel rural, a qual é medida automaticamente utilizando o índice de Shannon-Weaver.\nAPLICAÇÃO\n1ª ETAPA - Avalie o grau de adoção de práticas que promovem a agrobiodiversidade nas áreas de produção agrícola. Essas práticas incluem cultivos consorciados, policultivos, integração lavoura-pecuária, sistemas agroflorestais, adubação verde, barreiras vegetais, corredores ecológicos, rotação de culturas, ativação da biologia do solo e redução de perturbações à atividade biológica (por exemplo, uso indiscriminado de pesticidas, fertilizantes de alta solubilidade, mecanização intensa e pressão de monoculturas). O item 21.1 pode ser preenchido de forma semelhante ao item 16.1 do Indicador 16 (grau de adoção de práticas conservacionistas).\n2ª ETAPA - O grau de diversidade na escala do imóvel rural é medido automaticamente pela avaliação da diversidade de fitofisionomias dos habitats naturais (vegetação nativa) e dos diversos usos e ocupação do solo, utilizando o índice de Shannon-Weaver.\n3ª ETAPA - O grau de diversificação do uso e ocupação do imóvel e das áreas no seu entorno é avaliado, ao considerar a proporção de cultivos e usos similares ao longo das áreas fronteiriças, com o objetivo de verificar se ocorre pressão de monocultivos. Se for identificado uma alta proporção das áreas limítrofes ao imóvel rural com o mesmo uso do solo (acima de 70%), marque \"sim\" no item 21.3.\n"]
{"$rows_empty":10}
[null,"\n\n"]

{"sheet":"1 Questionário","index":1,"n_rows":207,"n_cols":10,"rows_kept":207,"merged":[[0,1,1,2],[31,1,31,3],[71,1,71,2],[73,1,73,2],[75,1,75,2],[75,4,75,5],[77,1,77,8],[82,1,82,6],[84,1,84,2],[84,4,84,6],[85,1,85,2],[86,1,86,2],[87,1,87,2],[88,1,88,2],[89,1,89,2],[90,1,90,2],[91,1,91,2],[92,1,92,2],[93,1,93,2],[94,1,94,6],[95,1,95,8],[97,1,97,2],[97,4,97,6],[98,1,98,2],[99,1,99,2],[100,1,100,2],[101,1,101,2],[101,5,101,6],[103,1,103,8],[104,5,104,6],[107,1,107,6],[109,1,109,3],[110,1,110,3],[111,1,111,3],[112,1,112,3],[116,1,116,3],[116,5,116,6],[117,1,117,3],[117,5,117,6],[118,1,118,5],[120,1,120,3],[120,5,120,6],[121,1,121,5],[124,1,124,6],[126,5,126,6],[128,5,128,6],[130,5,130,6],[133,1,133,8],[180,1,180,6],[185,1,185,5],[186,1,186,5],[188,1,189,5],[188,6,189,6],[191,1,191,6],[203,1,203,7],[206,1,206,7]]}
[null,"ISA",null,"QUESTIONÁRIO"]
[]
[1,"CROQUI DO IMÓVEL RURAL (CAR)"]
{"$rows_empty":28}
[null,"Preencher todos os campos em amarelo\t"]
[]
[2,"DATA "]
[]
[3,"ENTREVISTADOR(A)"]
[]
[null,"Nome"]
[]
[null,"CPF"]
[]
[4,"PRODUTOR(A) RURAL"]
[]
[null,"Nome"]
[]
[null,"CPF"]
[]
[null,"Idade (anos)"]
[]
[5,"LOCALIZAÇÃO DO IMÓVEL RURAL"]
[]
[null,"Geolocalização* "]
[null,"*coordenadas graus decimais"]
[null,"Município"]
[]
[null,"Estado"]
[]
[null,"Bacia Hidrográfica*"]
[null,"*Identificação do principal rio próximo ao imóvel rural"]
[6,"POSSE DA TERRA"]
[]
[null,"Posse da terra",null,null,"Escolha uma opção ao clicar no campo ao lado\t\t\t",{"$nulls":3},"Proprietário"]
[{"$nulls":8},"Posseiro"]
[null,"Sucessão* ",null,null,"Escolha uma opção  \t",{"$nulls":3},"Arrendatário"]
[null,"*Envolvimento dos filhos nos negócios; participação dos filhos em cursos de capacitação.",{"$nulls":6},"Parceiro"]
[null,"Participação da mulher (gestão)",null,null,"Escolha uma opção  \t",{"$nulls":3},"Assentado"]
[{"$nulls":8},"Usufrutuário"]
[7,"DESCRIÇÃO DO IMÓVEL RURAL"]
[{"$nulls":8},"Sim"]
[null,"Identificação",{"$nulls":6},"Não"]
[{"$nulls":5},"Módulos Fiscais"]
[null,"Área - hectares (ha)",{"$nulls":3},{"$f":"IF(D74>0,D72/D74,\"\")","v":""}]
[]
[null,"Tamanho do módulo fiscal (ha)*\t\t\t"]
[null,"*Tamanho do módulo fiscal no município"]
[null,"Agricultura Familiar",null,null,"Escolha uma opção  \t"]
[]
[null,"Outras áreas não contíguas ao imóvel rural e/ou áreas de arrendamento que integram a renda do produtor(a)"]
[null,"Identificação"]
[]
[null,"Área (ha)"]
[]
[8,"USO E OCUPAÇÃO DO SOLO NO IMÓVEL RURAL \t\t\t\t\t"]
[]
[null,"Descrição",null,"Uso atual Área (ha) ","Proporção em relação a área total%\t",{"$nulls":4},"                 "]
[null,"Lavouras permanentes\t",null,null,{"$f":"D86/'3 Relatório'!$H$5","v":{"$error":"#DIV/0!"}}]
[null,"Lavouras temporárias\t",null,null,{"$f":"D87/'3 Relatório'!$H$5","v":{"$error":"#DIV/0!"}}]
[null,"Pastagens\t",null,null,{"$f":"D88/'3 Relatório'!$H$5","v":{"$error":"#DIV/0!"}}]
[null,"Silvicultura\t",null,null,{"$f":"D89/'3 Relatório'!$H$5","v":{"$error":"#DIV/0!"}}]
[null,"Área não agrícola\t",null,null,{"$f":"D90/'3 Relatório'!$H$5","v":{"$error":"#DIV/0!"}},{"$nulls":3},{"$f":"SUM(D86:D90,D94)","v":{"v":0,"d":"0.0"}}]
[null,"Pousio\t",null,null,{"$f":"D91/'3 Relatório'!$H$5","v":{"$error":"#DIV/0!"}}," Verificação ",null,null,{"$f":"D91","v":{"v":0,"d":"0.0"}}]
[null,"Corpos d'água\t",null,null,{"$f":"D92/'3 Relatório'!$H$5","v":{"$error":"#DIV/0!"}},{"$nulls":3},{"$f":"D92","v":{"v":0,"d":"0.0"}}]
[null,"Vegetação nativa\t\t",null,null,{"$f":"D93/'3 Relatório'!$H$5","v":{"$error":"#DIV/0!"}},{"$nulls":3},{"$f":"D93","v":{"v":0,"d":"0.0"}}]
[null,"Áreas inaproveitáveis*\t",null,null,{"$f":"D94/'3 Relatório'!$H$5","v":{"$error":"#DIV/0!"}},{"$f":"IF(H94>0,(H94/D72),\"\")","v":""},"Total (ha)",{"$f":"SUM(D86:D94)","v":{"v":0,"d":"0.0"}},{"$f":"SUM(I90:I93)","v":{"v":0,"d":"0.0"}}]
[null,"*Vossorocas e outras áreas que no momento da avaliação são inaproveitáveis para atividades econômicas\t\t\t\t\t",{"$nulls":6},{"$f":"SUM(I90:I93)","v":{"v":0,"d":"0.0"}}]
[9,"ÁREAS DE PRESERVAÇÃO PERMANENTE (APPs)"]
[]
[{"$nulls":3},"Área (ha) ","Proporção em relação a área total (%)\t\t",null,null,{"v":0.1,"d":"10%"}]
[null,"Área total de APPs\t",null,null,{"$f":"IF(D99>0,D99/I94,0)","v":{"v":0,"d":"0.0%"}},null,null,{"v":0.2,"d":"20%"},{"$f":"D99-D100","v":{"v":0,"d":"0.00"}}]
[null,"Área da APP a ser recuperada\t\t",null,null,{"$f":"IF(D100>0,D100/I94,0)","v":{"v":0,"d":"0.0%"}},null,null,{"v":0.3,"d":"30%"}]
[null,"*Área a ser recuperada para imóveis até 4MF\t\t\t",null,{"$f":"IF(AND(E100>0.1,F72<2),D72*0.1,IF(AND(E100>0.2,F72<4),D72*0.2,D100))","v":{"v":0,"d":"0.0"}},{"$nulls":3},{"v":0.8,"d":"80%"}]
[]
[10,"RESERVA LEGAL (RL)"]
[]
[null,"Conservation Reserve Area (% of the farm area)",{"$nulls":3},"Escolha uma opção  \t"]
[null,"Área com vegetação nativa excedente à area exigida para RL",null,null,{"$f":"IF(D93>'2 Indicadores'!D458,'1 Questionário'!D93-'2 Indicadores'!D458,0)","v":{"v":0,"d":"0.00"}}]
[]
[11,"RECURSOS HÍDRICOS NO IMÓVEL RURAL\t\t\t\t\t"]
[{"$nulls":4},"Quantidade"]
[null,"Cursos d´água \t\t"]
[null,"Nascentes e olhos d'água perenes*\t\t"]
[null,"Lagos e lagoas naturais\t\t\t"]
[null,"Represas\t\t"]
[null," * Afloramento natural do lençol freático que apresenta perenidade e dá início a um curso d'água "]
[]
[null,"Fonte de água utilizada no imóvel rural:"]
[null,"Superficial\t\t",{"$nulls":3},"Escolha uma opção  \t"]
[null,"Subterrânea*\t\t\t\t",{"$nulls":3},"Escolha uma opção  \t"]
[null,"* Cisternas, poço tubular (artesiano)\t\t\t\t"]
[]
[null,"Problemas com qualidade/disponibilidade de água* ",{"$nulls":3},"Escolha uma opção  \t"]
[null,"*Para consumo humano e atividades rurais"]
[null,"Especificar (descrição do problema)"]
[]
[12,"REGULARIZAÇÃO AMBIENTAL DO IMÓVEL RURAL\t\t\t\t\t"]
[]
[null,"Regularização do uso da água",{"$nulls":3},"Escolha uma opção  \t"]
[null,"Outorga; ou cadastro de uso insignificante; ou cadastro na campanha \"água: faça uso legal\"; ou cadastro de pequeno núcleo populacional rural."]
[null,"Licenciamento ambiental",{"$nulls":3},"Escolha uma opção  \t"]
[null,"Certidão de não passível (dispensa de licenciamento), Autorização Ambiental de Funcionamento (AAF), Licenciamento Ambiental."]
[null,"Regularização RL e APP",{"$nulls":3},"Escolha uma opção  \t"]
[null,"Cadastro Ambiental Rural - CAR."]
[]
[13,"PONTOS CRÍTICOS - principais problemas enfrentados pelo produtor rural (na visão dele)\t\t\t\t\t\t\t"]
[]
[null,"Descrição"]
[]
[null,"Descrição"]
[]
[null,"Descrição"]
[]
[]
[18]
{"$rows_empty":37}
[19,"ATIVIDADE PECUÁRIA (opcional)"]
[]
[null,"19.1 - Utiliza pastagens plantadas para a atividade pecuária",{"$nulls":5},"caso afirmativo marque x"]
[null,"Estimativa da área, considerando áreas próprias e arrendadas (ha)"]
[]
[null,"Total de UA (Unidade Animal) do empreendimento - item 12.3 =>",{"$nulls":4},{"$f":"('2 Indicadores'!C75*1.5)+'2 Indicadores'!#REF!+'2 Indicadores'!#REF!+('2 Indicadores'!#REF!*0.75)+('2 Indicadores'!#REF!*0.75)+('2 Indicadores'!#REF!*0.5)+('2 Indicadores'!#REF!*0.5)","v":{"$error":"#REF!"}}]
[null,"Estimativa da taxa média de lotação das áreas com pastagem",{"$nulls":4},{"$f":"IF(G183=\"x\",(G186/G184),\"\")","v":""}]
[]
[null,"Proporção das pastagens no imóvel rural que apresentam processo de  degradação dos solos e baixa capacidade de suporte de animais (%)"]
[]
[]
[20,"ADUBAÇÃO NITROGENADA NA LAVOURA DE MILHO (opcional)"]
[]
[null,"20.1 - Possui lavoura de milho para produção de grãos"]
[null,"Estimativa da área (ha)"]
[]
[null,"20.2 - Possui lavoura de milho para produção de silagem"]
[null,"Estimativa da área (ha)"]
[]
[null,"20.3 - Estimativa da adubação nitrogenada para a lavoura de milho (kg de N/ha)*"]
[null,"*Considerar apenas os adubos nitrogenados solúveis (NPK, ureia, sulfato de amônia, etc.)"]
[]
[null,"20.4 - Produtividade da lavoura de milho para grãos (sc/ha)*"]
[null,"Estimativa da relação: sc milho produzido (60 Kg)/kg de N via adubação/ha ",{"$nulls":6},{"$f":"IF(I194=\"x\",(I203/I200),\"\")","v":""}]
[]
[null,"20.5 - Produtividade da lavoura de milho para silagem (t/ha)*"]
[null,"Estimativa da relação: tonelada (t) de milho produzido (silagem)/kg de N via adubação/ha ",{"$nulls":6},{"$f":"IF(I197=\"x\",(I206/I200),\"\")","v":""}]

{"sheet":"2 Indicadores","index":2,"n_rows":488,"n_cols":9,"rows_kept":488,"merged":[[0,1,1,1],[0,2,1,2],[2,1,2,2],[6,1,6,3],[11,1,11,3],[13,1,13,2],[13,6,13,7],[14,1,14,2],[14,6,14,7],[15,1,15,2],[16,1,16,2],[16,6,17,6],[16,7,17,7],[17,1,17,2],[18,1,18,2],[19,1,19,2],[38,1,38,4],[39,1,39,4],[40,1,40,4],[41,1,41,4],[42,1,42,4],[43,1,43,4],[43,6,44,6],[52,1,52,2],[52,6,52,7],[53,6,53,7],[57,1,57,2],[58,6,58,7],[62,1,62,2],[62,6,62,7],[63,6,63,7],[67,1,67,2],[68,6,68,7],[72,1,72,3],[72,4,72,5],[78,3,79,3],[100,1,101,1],[102,5,102,7],[104,1,105,4],[104,5,105,5],[104,6,105,6],[106,2,106,4],[107,1,110,1],[107,2,107,4],[108,2,108,4],[109,2,109,4],[110,2,110,4],[111,1,111,4],[112,1,112,4],[118,1,118,3],[118,6,118,7],[119,1,119,3],[119,6,119,7],[120,1,120,2],[120,6,120,7],[128,3,128,6],[129,1,129,2],[130,1,130,2],[131,1,131,2],[132,1,132,2],[133,1,133,2],[134,1,134,2],[135,1,135,2],[136,1,136,2],[137,1,137,2],[138,1,138,2],[138,3,138,7],[140,1,140,2],[141,1,142,2],[141,3,141,6],[143,1,143,2],[144,1,144,2],[145,1,145,2],[147,1,147,2],[152,1,152,2],[153,1,153,2],[154,1,154,2],[155,1,155,2],[156,1,156,2],[157,1,157,2],[160,1,160,2],[161,1,161,2],[162,1,162,2],[165,1,166,2],[165,3,166,3],[165,4,166,4],[165,5,166,5],[167,1,167,2],[168,1,168,2],[169,1,169,3],[174,1,175,3],[174,4,175,4],[174,5,175,5],[174,6,175,6],[176,1,176,3],[177,1,177,3],[178,1,178,3],[181,1,182,3],[181,4,182,4],[181,5,182,5],[181,6,182,6],[183,1,183,3],[184,1,184,3],[185,1,185,3],[186,1,186,3],[187,1,187,3],[188,1,188,3],[189,1,189,3],[190,1,190,3],[191,1,191,3],[196,2,196,4],[197,1,198,1],[197,2,197,3],[198,2,198,3],[199,1,199,3],[200,1,200,3],[201,1,201,3],[202,1,204,1],[202,2,202,3],[203,2,203,3],[204,2,204,3],[212,1,212,3],[213,1,213,3],[215,1,215,3],[216,1,216,3],[217,1,217,3],[218,1,218,3],[219,1,219,3],[220,1,220,7],[222,1,222,2],[222,4,222,7],[223,1,223,2],[224,1,224,2],[225,1,225,7],[231,3,231,4],[231,7,232,7],[233,1,233,2],[234,1,234,2],[236,1,236,4],[237,1,237,4],[239,1,239,4],[240,1,240,4],[241,1,241,4],[244,1,244,4],[245,3,245,4],[252,1,252,3],[253,1,253,3],[255,1,255,3],[256,1,256,3],[276,1,276,3],[287,1,287,2],[297,6,299,7],[301,1,302,1],[303,1,304,1],[305,1,306,1],[307,1,308,1],[309,1,310,1],[311,1,312,1],[313,1,314,1],[316,1,316,5],[319,1,320,1],[321,1,322,1],[323,1,324,1],[325,1,326,1],[328,1,329,1],[331,1,332,1],[334,1,334,5],[335,1,335,2],[337,1,337,2],[338,1,338,2],[339,1,339,2],[340,1,340,2],[347,1,347,2],[348,1,348,2],[349,1,349,2],[350,1,350,2],[351,1,351,2],[352,1,352,2],[353,1,353,2],[354,1,354,2],[355,1,355,2],[356,1,356,2],[357,1,357,2],[358,1,358,2],[359,1,359,2],[360,1,360,2],[361,1,361,2],[362,1,362,2],[363,1,363,2],[364,1,364,2],[367,3,367,4],[368,1,368,2],[369,1,369,2],[370,1,370,2],[371,1,371,2],[372,1,372,2],[375,1,375,2],[376,1,376,2],[377,1,377,2],[380,17,380,18],[380,19,380,20],[383,1,383,2],[384,1,384,5],[386,1,386,2],[387,1,387,5],[393,2,394,2],[393,7,394,7],[395,1,398,1],[399,1,399,2],[400,5,400,6],[402,1,402,2],[410,3,410,4],[411,1,413,1],[411,2,411,3],[412,2,412,3],[413,2,413,3],[414,3,414,4],[415,3,415,4],[416,1,417,1],[416,2,416,3],[416,6,416,7],[417,2,417,3],[420,1,420,3],[421,2,421,3],[426,7,427,7],[428,1,430,1],[432,7,433,7],[434,1,434,4],[437,1,437,4],[440,1,440,4],[444,7,446,7],[447,1,448,1],[447,2,447,5],[448,2,448,5],[451,1,451,5],[457,1,457,2],[458,1,458,2],[461,1,464,1],[461,2,461,4],[462,2,462,4],[463,2,463,4],[464,2,464,4],[465,1,465,3],[471,2,472,2],[471,7,472,7],[471,27,471,28],[473,1,476,1],[477,1,477,2],[478,1,478,4],[478,5,478,6],[479,1,479,4],[482,1,482,3],[485,1,485,5]]}
[null,"ISA","INDICADORES"]
[]
[null,"Preencher todos os campos em amarelo\t"]
[]
[1,"PRODUTIVIDADE E PREÇOS DE VENDA"]
[]
[null,"1.1 Renda bruta anual estimada agropecuária (ordem decrescente)\t\t"]
[null,null,"Escolha uma opção","Valor estimado anual (R$)"]
[null,"Atividade 1 (> receita)",null,null,{"$f":"(D9/($D$9+$D$10+$D$11+D29+$D$30+$D$31+'2 Indicadores'!$D$35+'2 Indicadores'!D36))","v":{"$error":"#DIV/0!"}}]
[null,"Atividade 2",null,null,{"$f":"(D10/($D$9+$D$10+$D$11+D29+$D$30+$D$31+'2 Indicadores'!$D$35+'2 Indicadores'!D36))","v":{"$error":"#DIV/0!"}}]
[null,"Outras atividades",null,null,{"$f":"(D11/($D$9+$D$10+$D$11+$D$29+$D$30+$D$31+'2 Indicadores'!$D$35+D36))","v":{"$error":"#DIV/0!"}}]
[null,"*Atividades agrícolas, de pecuária e/ou silvicultura conduzidas no imóvel rural"]
[]
[null,"1.2 Produtividade das principais atividades",null,"Atividade 1","Atividade 2","Atividade 3"]
[null,"Atividades (selecione)",{"$nulls":4},"Fator de ponderação \t"]
[null,"Unidades de medida (selecione)",{"$nulls":4},"> 20%",0.9]
[null,"Produtividade média atual\t",{"$nulls":4},"produção ou preço de venda = ao regionall ",0.7]
[null,"Preço médio de venda  (R$/unidade de venda)\t"]
[null,"Produtividade média na região*\t",{"$nulls":4},"< 20%",0.5]
[null,"Média de preço da região (R$/unidade de venda)*\t",{"$nulls":4},"< 40%",0.3]
[null,"* Base de dados  - Cooperativa no município, Emater, IBGE, etc."]
[]
[null,"Resultado",{"$f":"IF(D17>0,Fórmulas!G15,0)","v":{"v":0,"d":"0.00"}},"Referência: Depontti (2001); Correa (2007); Mattos Filho (2004); Lopez e Ridaura (2001)."]
[]
[2,"DIVERSIDADE DE RENDA"]
[]
[null,"2.1 Renda bruta anual estimada - outras atividades no imóvel rural* \t\t\t\t\t\t"]
[null,null,"Descrição das atividades\t","Valor estimado no ano (R$)\t"]
[null,"Atividade 1",null,null,{"$f":"(D29/($D$9+$D$10+$D$11+$D$30+$D$31+'2 Indicadores'!$D$35+D29+D36))","v":{"$error":"#DIV/0!"}}]
[null,"Atividade 2",null,null,{"$f":"(D30/($D$9+$D$10+$D$11+$D$30+$D$31+'2 Indicadores'!$D$35+'2 Indicadores'!D36+D29))","v":{"$error":"#DIV/0!"}}]
[null,"Outras atividades",null,null,{"$f":"(D31/($D$9+$D$10+$D$11+$D$29+$D$30+$D$31+'2 Indicadores'!$D$35+'2 Indicadores'!D36))","v":{"$error":"#DIV/0!"}}]
[null,"*Turismo, artesanato, agroindústria, produção de cachaça, alimentos processados, aplicações financeiras do capital de giro do imóvel rural, etc."]
[]
[null,"2.2 Renda bruta anual estimada fora imóvel rural*"]
[null,"Pensão, aposentadoria, ajudas financeiras (R$)",null,null,{"$f":"(D35/('2 Indicadores'!$D$9+'2 Indicadores'!$D$10+'2 Indicadores'!$D$11+$D$29+'2 Indicadores'!$D$30+'2 Indicadores'!$D$31+$D$35+'2 Indicadores'!D36))","v":{"$error":"#DIV/0!"}}]
[null,"Outras atividades/prestação de serviços (R$)",null,null,{"$f":"(D36/('2 Indicadores'!$D$9+'2 Indicadores'!$D$10+'2 Indicadores'!$D$11+$D$29+'2 Indicadores'!$D$30+'2 Indicadores'!$D$31+$D$36+'2 Indicadores'!D35))","v":{"$error":"#DIV/0!"}}]
[null,"*De todas as rendas das pessoas com vínculo direto com o estabelecimento (locação de máquinas, emprego fora do estabelecimento, prestação de serviços, etc.)"]
[]
[null,"2.3 Diversidade de Renda\t\t\t\t\t",{"$nulls":3},"Proporção da renda (%)","Fator de ponderação"]
[null,"Atividades agrícolas, pecuárias e florestais realizadas no estabelecimento\t\t\t",{"$nulls":3},{"$f":"(E11+E10+E9)","v":{"$error":"#DIV/0!"}},{"v":2,"d":"2.0"}]
[null,"Outras atividades realizadas no estabelecimento\t\t\t\t\t",{"$nulls":3},{"$f":"(E31+E30+E29)","v":{"$error":"#DIV/0!"}},{"v":2,"d":"2.0"}]
[null,"Atividades realizadas fora do estabelecimento\t\t\t",{"$nulls":3},{"$f":"'2 Indicadores'!E36","v":{"$error":"#DIV/0!"}},{"v":1,"d":"1.0"}]
[null,"Aposentadoria; Pensão; Ajuda Financeira; Outras fontes de renda\t\t\t",{"$nulls":3},{"$f":"'2 Indicadores'!E35","v":{"$error":"#DIV/0!"}},0.3]
[null,"Concentração numa única atividade no imóvel rural (> 80% da receita total)\t",{"$nulls":3},{"$f":"IF('2 Indicadores'!E9>0.8,\"sim\",\"não\")","v":{"$error":"#DIV/0!"}},"Verificação da proporção de renda",{"$f":"F40+F41+F42+F43","v":{"$error":"#DIV/0!"}}]
[]
[null,"Resultado",{"$f":"IF(H44<0.99,\"\",Fórmulas!H32)","v":{"$error":"#DIV/0!"}},"Adaptação APOIA-NovoRural (Rodrigues et al, 2010), Deponti (2002)."]
[]
[3,"EVOLUÇÃO PATRIMONIAL DO IMÓVEL RURAL"]
[]
[null,"3.1 Período da evolução patrimonial (anos)\t\t",null,{"v":1,"d":"1.0"}]
[]
[null,"3.2 Avaliação dos bens do imóvel rural\t\t\t\t"]
[null,"3.2.1 Construções/ Reformas (período recente)* \t"]
[null,"Descrição","Valor estimado ($)\t"]
[null,null,{"v":1E-3,"d":"R$ 0.00"}]
[null,"*período de avaliação definido no item 3.1"]
[]
[null,"3.2.2 Construcões existentes no imóvel rural*"]
[null,"Descrição","Valor estimado ($)\t",{"$nulls":3},{"$f":"IF(C60>0,((1+0.04167)^'2 Indicadores'!$D$50*C60),\" \")","v":{"v":1.0416700000000002E-3,"d":"R$ 0.00"}}]
[null,null,{"v":1E-3,"d":"R$ 0.00"},null,"Valor Histórico*"]
[null,"*Depreciação vida útil 40 anos","Total",{"$f":"C60+C55","v":{"v":2E-3,"d":"$0.00"}},{"$f":"SUM(G59:G59)","v":{"v":1.0416700000000002E-3,"d":"$0.00"}}]
[]
[null,"3.2.3 Equipamentos adquiridos (período recente)*",{"$nulls":4},"Valor histórico*"]
[null,"Descrição","Valor estimado ($)\t"]
[null,null,{"v":1E-3,"d":"R$ 0.00"}]
[null,"*período de avaliação definido no item 3.1"]
[]
[null,"3.2.4 Equipamentos já existentes no imóvel*"]
[null,"Descrição","Valor estimado ($)\t",{"$nulls":3},{"$f":"IF(C70>0,((1+0.052632)^'2 Indicadores'!$D$50*C70),\" \")","v":{"v":1.052632E-3,"d":"R$ 0.00"}}]
[null,null,{"v":1E-3,"d":"R$ 0.00"},null,"Valor Histórico*"]
[null,"*Depreciação vida útil 20 anos","Total",{"$f":"C70+C65","v":{"v":2E-3,"d":"$0.00"}},{"$f":"SUM(G69:G69)","v":{"v":1.052632E-3,"d":"$0.00"}}]
[]
[null,"3.3 Avaliação semoventes / estoque*\t\t",null,null,"Histórico (anterior - período item 3.1)"]
[null,"Descrição (selecione)","Quantidade (un.)","Valor atual ($)","Quantidade (un.)","Valor histórico ($)"]
[]
[{"$nulls":3},{"v":1E-3,"d":"R$ 0.00"},null,{"v":1E-3,"d":"R$ 0.00"}]
[null,"*Milho, soja, café, entre outros. ","Total",{"$f":"SUM(D75:D76)","v":{"v":1E-3,"d":"R$ 0.00"}},"Total",{"$f":"SUM(F75:F76)","v":{"v":1E-3,"d":"R$ 0.00"}}]
[]
[null,"3.4 Sistemas de irrigação",null,"Uso histótico (ha)*"]
[null,"Tipo de irrigação","Área total irrigada (ha)"]
[]
[null,"*Anterior ao período de avaliação item 3.1"]
[]
[null,"3.5 Uso do solo","Uso atual (ha)","Uso histótico (ha)*"]
[null,"Lavouras permanentes",{"$f":"'1 Questionário'!D86","v":0},{"$f":"C85","v":{"v":0,"d":"0.00"}}]
[null,"Lavouras temporárias",{"$f":"'1 Questionário'!D87","v":0},{"$f":"C86","v":{"v":0,"d":"0.00"}}]
[null,"Pastagens",{"$f":"'1 Questionário'!D88","v":0},{"v":0,"d":"0.00"}]
[null,"Silvicultura",{"$f":"'1 Questionário'!D89","v":0},{"v":0,"d":"0.00"}]
[null,"Área não agrícola",{"$f":"'1 Questionário'!D90","v":0},{"v":0,"d":"0.00"}]
[null,"Pousio\t",{"$f":"'1 Questionário'!D91","v":0},{"v":0,"d":"0.00"}]
[null,"Espelho/cursos d'água",{"$f":"'1 Questionário'!D92","v":0},{"v":0,"d":"0.00"}]
[null,"Vegetação nativa",{"$f":"'1 Questionário'!D93","v":0},{"v":0,"d":"0.00"}]
[null,"Áreas inaproveitáveis",{"$f":"'1 Questionário'!D94","v":0},{"v":0,"d":"0.00"}]
[null,"Total (ha)",{"$f":"SUM(C85:C93)","v":{"v":0,"d":"0.00"}},{"$f":"SUM(D85:D93)","v":{"v":0,"d":"0.00"}}]
[null,"*período de avaliação item 3.1"]
[]
[null,"3.6 Valor da terra","Atual ($/ha)","Histórico ($/ha)* "]
[null,"Valor de referência na região "]
[null,"*Período de avaliação item 3.1"]
[]
[null,"Estimativa patrimonial do imóvel rural**","Current ($/ha)","Historical ($/ha)* "]
[null,null,{"$f":"Fórmulas!E51+Fórmulas!E52+Fórmulas!E53+Fórmulas!E54+Fórmulas!E55+'2 Indicadores'!D77+'2 Indicadores'!D71+'2 Indicadores'!D61","v":{"$error":"#DIV/0!"}},{"$f":"Fórmulas!I51+Fórmulas!I52+Fórmulas!I53+Fórmulas!I54+Fórmulas!I55+'2 Indicadores'!E61+'2 Indicadores'!E71+'2 Indicadores'!F77","v":{"$error":"#DIV/0!"}}]
[null,"** (Somatória de benfeitorias, máquinas, equipamentos, animais e valor da terra)\t\t\t"]
[]
[null,"Evolução Patrimonial",{"$nulls":3},"Evolução no período (%)","Fator de ponderação"]
[]
[null,"Fator externo","Valor da terra na região",null,null,{"$f":"IF('2 Indicadores'!C98>0,('2 Indicadores'!C98/'2 Indicadores'!D98-1),\"\")","v":""},{"v":0.67,"d":"0.7"}]
[null,"Fatores internos em relação ao imóvel rural","Benfeitorias",null,null,{"$f":"IF('2 Indicadores'!D61>0,('2 Indicadores'!D61/'2 Indicadores'!E61-1),\"\")","v":{"v":0.9199938560196605,"d":"92.0%"}},{"v":1,"d":"1.0"}]
[null,null,"Equipamentos",null,null,{"$f":"IF('2 Indicadores'!D71>0,('2 Indicadores'!D71/'2 Indicadores'!E71-1),\"\")","v":{"v":0.8999992400003041,"d":"90.0%"}},{"v":1,"d":"1.0"}]
[null,null,"Semoventes / Estoque de grãos",null,null,{"$f":"IF('2 Indicadores'!D77>0,('2 Indicadores'!D77/'2 Indicadores'!F77-1),\"\")","v":{"v":0,"d":"0.0%"}},{"v":1,"d":"1.0"}]
[null,null,"Ampliação da área de lavoura e/ou agricultura irrigada",null,null,{"$f":"+Fórmulas!H59","v":{"$error":"#DIV/0!"}},{"v":1,"d":"1.0"}]
[null,"Média anual da Evolução Patrimonial total (%)",{"$nulls":3},{"$f":"(+Fórmulas!H63)/D50","v":{"$error":"#DIV/0!"}}]
[null,"Média anual da Evolução Patrimonial (sem valorização da terra) (%)",{"$nulls":3},{"$f":"(Fórmulas!H61)/D50","v":{"$error":"#DIV/0!"}}]
[]
[null,"Resultado",{"$f":"IF(Fórmulas!I39>1,1,Fórmulas!I39)","v":{"$error":"#DIV/0!"}},"Referência: Rodrigues et al, 2010; Gitman and Zutter (2015)."]
[]
[4,"GRAU DE ENDIVIDAMENTO"]
[{"$nulls":5},"% dívidas/valor pat.","Fator de ponderação"]
[null,"4.1 Total de financiamentos em relação à estimativa patrimonial\t\t",{"$nulls":3},"0-7,5%","07 - 1 (y = 0,04x + 0,7)"]
[null,"Valor Total - financiamentos e outros compromissos financeiros \t\t",{"$nulls":3},"7,5-30%","1 - 01 (y = -0,04x + 1,3)"]
[null,"Total de dívidas/valor patrimonial estimado (%)\t",null,null,{"$f":"E120/C102","v":{"$error":"#DIV/0!"}},">30%",0.1]
[]
[null,"Resultado",{"$f":"Fórmulas!G68","v":{"$error":"#DIV/0!"}},"Adaptação APOIA-NovoRural (Rodrigues et al, 2010), Deponti (2002)."]
[]
[5,"SERVIÇOS BÁSICOS DISPONÍVEIS PARA O IMÓVEL RURAL"]
[]
[null,"5.1 Total de residências no imóvel rural"]
[]
[{"$nulls":3},"Escolha uma opção: 1 (atende satisfatoriamente); 0,5 (parcialmente); 0 (inexistente)           \t\t\t"]
[null,"5.2 Serviços básicos disponíveis\t",null,"Residência rural (1)","Outras residências","Fator de ponderação"]
[null,"Disponibilidade de água (quantidade e qualidade)\t",{"$nulls":3},{"v":1,"d":"1.0"}]
[null,"Acesso a energia elétrica\t",{"$nulls":3},{"v":1,"d":"1.0"}]
[null,"Acesso regular para escoamento da produção\t",{"$nulls":3},{"v":1,"d":"1.0"}]
[null,"Acesso ao serviço de saúde*\t",{"$nulls":3},{"v":1,"d":"1.0"}]
[null,"Acesso regular ao transporte escolar\t",{"$nulls":3},{"v":1,"d":"1.0"}]
[null,"Segurança no campo \t",{"$nulls":3},{"v":1,"d":"1.0"}]
[null,"Internet \t",{"$nulls":3},{"v":1,"d":"1.0"}]
[null,"Coleta pública de lixo\t",{"$nulls":3},{"v":1,"d":"1.0"}]
[null,"* Produtor atendido pelo Programa Saúde da Família - PSF \t"]
[null,"Resultado Parcial",{"$f":"IF('1 Questionário'!E121=\"sim\",(Fórmulas!H77/10),(Fórmulas!H77/8))","v":{"v":0,"d":"0.00"}},"Adaptação APOIA-NovoRural (Rodrigues et al, 2010)."]
[]
[null,"5.3 Produção própria de alimentos (somente para imóveis rurais ≤ 4MF)\t",null,"Escolha uma opção: 1 (atende satisfatoriamente); 0,5 (parcialmente); 0 (inexistente)           \t\t\t\t         "]
[{"$nulls":3},"Residência rural (1)","Outras residências","Fator de ponderação"]
[null,"Hortaliças, grãos e tubérculos\t",{"$nulls":3},{"v":1,"d":"1.0"}]
[null,"Pomar\t",{"$nulls":3},{"v":1,"d":"1.0"}]
[null,"Criação de animais (carne, leite, ovos)\t\t",{"$nulls":3},{"v":1,"d":"1.0"}]
[null,"Resultado Parcial",{"$f":"IF('1 Questionário'!D76=\"Não\",\"\",Fórmulas!F89/3)","v":{"v":0,"d":"0.00"}},"Referência- Correa (2007)."]
[]
[null,"Resultado",{"$f":"IF(C147=\"\",C140,(((C140*2)+C147)/3))","v":{"v":0,"d":"0.00"}}]
[]
[6,"ESCOLARIDADE & CURSOS DIRECIONADOS ÀS PRINCIPAIS ATIVIDADES"]
[{"$nulls":3},"Marque o nº de pessoas em cada campo"]
[null,"6.1 Grau de escolaridade \t\n\t",null,"Membros da família","Funcionários"]
[null,"Número de adultos no imóvel rural\t",{"$nulls":3},"Fator de ponderação"]
[null,"Menos de 9 anos de estudo\t",{"$nulls":3},0.7]
[null,"Ensino Fundamental completo\t",{"$nulls":3},{"v":1,"d":"1.0"}]
[null,"Ensino Médio completo\t",{"$nulls":3},1.2]
[null,"Curso superior\t",{"$nulls":3},1.5]
[]
[{"$nulls":3},"Marque o nº de pessoas em cada campo"]
[null,"6.2 Cursos direcionados às atividades rurais",null,"Membros da família","Funcionários","Fator de ponderação"]
[null,"Capacitação curta temporada\t",{"$nulls":3},0.5]
[null,"Capacitação longa temporada",{"$nulls":3},0.8]
[]
[{"$nulls":3},"Marque o nº de pessoas em cada campo"]
[null,"6.3 Frequência da rede de ensino dos dependentes",null,"Integrantes da família (6 - 18 anos)","Filhos de funcionários residentes imóvel rural (6 - 18 anos)"]
[]
[null,"Número de dependentes no imóvel rural\t",{"$nulls":3},"Fator de ponderação"]
[null,"Frequenta rede de ensino \t",{"$nulls":3},{"v":1,"d":"1.0"}]
[]
[null,"Resultado",{"$f":"IF(Fórmulas!K96>1,1,Fórmulas!K96)","v":{"$error":"#DIV/0!"}},"Referência: Calorio (1997), Correa (2007) e Rodrigues et al. (2003)."]
[]
[7,"OCUPAÇÃO & EMPREGO"]
[{"$nulls":4},"Marque o nº de pessoas em cada campo"]
[null,"7.1 Cumprimento da Legislação Trabalhista\t\t",null,null,"Funcionários permanentes","Funcionários temporários","Fator de ponderação"]
[]
[null,"Número de funcionários no imóvel rural\t\t"]
[null,"Registro de funcionários (carteira de trabalho)\t\t",{"$nulls":4},{"v":1,"d":"1.0"}]
[null,"Pagamento de hora extra / banco de horas / ausência de hora extra\t\t\t\t",{"$nulls":4},{"v":1,"d":"1.0"}]
[]
[{"$nulls":4},"Marque o nº de pessoas em cada campo"]
[null,"7.2 Adoção de benefícios / observância das recomendações/determinações do Ministério do Trabalho\t\t\n\t\t\n\t\t",null,null,"Funcionários permanentes","Funcionários temporários","Fator de ponderação"]
[]
[null,"Acima de 1 salário mínimo\t\t",{"$nulls":4},{"v":1,"d":"1.0"}]
[null,"Auxílio alimentação\t\t",{"$nulls":4},{"v":1,"d":"1.0"}]
[null,"Auxílio moradia\t\t",{"$nulls":4},{"v":1,"d":"1.0"}]
[null,"Auxílio educação e transporte\t\t",{"$nulls":4},{"v":1,"d":"1.0"}]
[null,"Participação nos lucros\t\t",{"$nulls":4},{"v":5,"d":"5.0"}]
[null,"Seguro contra acidentes\t\t",{"$nulls":4},{"v":3,"d":"3.0"}]
[null,"Acesso a lazer\t\t",{"$nulls":4},{"v":1,"d":"1.0"}]
[null,"Espaço para cultivo de alimentos \t\t",{"$nulls":4},{"v":3,"d":"3.0"}]
[]
[null,"Resultado",{"$f":"IF(Fórmulas!H108>1,1,Fórmulas!H108)","v":{"v":0.7,"d":"0.70"}},"Adaptação APOIA-NovoRural (Rodrigues et al, 2010)."]
[]
[8,"GESTÃO DO EMPREENDIMENTO"]
[]
[null,null,"Escolha uma opção: 1 (atende satisfatoriamente); 0,5 (parcialmente); 0 (inexistente)\t  \t\t\t         ",null,null,"Fator de ponderação"]
[null,"8.1 Controle administrativo"," Fluxo de caixa (receita/despesa)\t",null,null,{"v":1,"d":"1.0"}]
[null,null," Custo de produção das atividades\t",null,null,{"v":1,"d":"1.0"}]
[null,"8.2 Acesso à assistência técnica (particular ou pública)*\t\t",{"$nulls":3},{"v":1,"d":"1.0"}]
[null,"8.3 Participação - formas associativas - ativa (1) ou passiva (0,5)\t\t",{"$nulls":3},{"v":1,"d":"1.0"}]
[null,"8.4 Regularização ambiental (Uso da água, CAR e Licenciamento)\t\t",{"$nulls":3},{"v":2,"d":"2.0"}]
[null,"8.5 Financiamento\n"," Acessa crédito para investimento\t",null,null,0.4]
[null,null," Acessa crédito para custeio\t",null,null,0.4]
[null,null," Acessa crédito para comercialização\t",null,null,0.2]
[null,"* Não considerar assistência técnica de revendas de insumos."]
[]
[null,"Resultado",{"$f":"((+E198*F198+E199*F199+E200+E201+E202*2+E203*F203+E204*F204+E205*F205)/7)","v":{"v":0,"d":"0.00"}},"Referência: Correa (2007)."]
[]
[9,"COMERCIALIZAÇÃO & INOVAÇÃO "]
[]
[null,"9.1 Comercialização",null,null,"Escolha uma opção","Fator de ponderação"]
[null,"Diversificação de compradores, busca de preços, preços pré-venda",{"$nulls":3},0.4]
[null,"Produtos certificados, agrega valor, mercado institucional\t\t",{"$nulls":3},0.4]
[]
[null,"9.2 Inovação",null,null,"Escolha uma opção"]
[null,"Adoção de técnicas inovadoras*\t\t\t",{"$nulls":3},0.3]
[null,"Descrição "]
[null,"Capacidade de inovação ou liderança na comunidade\t\t",{"$nulls":3},0.4]
[null,"Descrição "]
[null,"* Conceito, ideia, prática ou tecnologia, percebidas como nova pelo indivíduo e/ou grupo social. Conhecimento científico e tecnológico transformados em boas práticas.\t\t\t\t\t\t\t\t\t\t\t"]
[]
[null,"9.3 Adoção de práticas regenerativas (opcional)",null,"Escolha uma opção","Caso afirmativo, qual a proporção da área de produção que adota esta prática (%)\t\t\t"]
[null,"Uso de bioinsumos nas áreas de produção agropecuária\t"]
[null,"Uso de plantas de cobertura / arbóreas - sombreamento**"]
[null,"** Estratégias para cobertura permanente do solo; aumentar a biodiversidade e/ou bem estar animal\t\t\t\t\t\t"]
[]
[null,"Resultado",{"$f":"IF(Fórmulas!F128>1,1,Fórmulas!F128)","v":{"v":0,"d":"0.00"}}]
[]
[10,"GERENCIAMENTO DE RESÍDUOS E EFLUENTES GERADOS NO IMÓVEL RURAL"]
[]
[{"$nulls":3},"Escolha uma opção ao clicar no campo abaixo\t",{"$nulls":3},"Fator de ponderação"]
[{"$nulls":3},"Residência rural (1)\t","Outras residências"]
[null,"10.1.Destinação do esgoto residencial",{"$nulls":3},{"$f":"Fórmulas!M144","v":{"$error":"#DIV/0!"}},null,{"v":1,"d":"1.0"}]
[null,"10.2.Destinação do lixo domiciliar e das atividades",{"$nulls":3},{"$f":"Fórmulas!M150","v":{"$error":"#DIV/0!"}},null,{"v":1,"d":"1.0"}]
[]
[null,"Preenchimento obrigatório\t\t\t",{"$nulls":3},"(%)"]
[null,"10.3.Resíduos sólidos orgânicos - compostagem e/ou reaproveitamento no campo\t\t\t",{"$nulls":5},{"v":1,"d":"1.0"}]
[]
[null,"Deixar o campo em branco quando não houver geração de efluentes líquidos e/ou gasosos\t\t\t",{"$nulls":3},"(%)"]
[null,"10.4.Efluentes líquidos (quando existentes) - tratamento / destinação adequada \t\t\t\t\t",{"$nulls":4},{"$f":"IF(ISBLANK(F241),Fórmulas!$K$136,\" \")","v":"Não se aplica"},{"v":1,"d":"1.0"}]
[null,"10.5.Efluentes gasosos (quando existentes) - tratamento / destinação adequada \t\t\t\t\t\t",{"$nulls":4},{"$f":"IF(ISBLANK(F242),Fórmulas!$K$136,\" \")","v":"Não se aplica"},{"v":1,"d":"1.0"}]
[null,"* Estação de tratamento; biodigestor; compostagem; etc."]
[{"$nulls":5},"Escolha uma opção\t\t"]
[null,"10.6 Imóvel rural possui pontos críticos com relação à gestão de resíduos e efluentes*\t\t\t\t\t\t"]
[{"$nulls":3},"*Situação crítica - especificar"]
[]
[null,"Resultado",{"$f":"IF(Fórmulas!H136=0,0.7,+Fórmulas!F137)","v":{"v":0.7,"d":"0.70"}},"Adaptação APOIA-NovoRural (Rodrigues et al, 2010)."]
[]
[11,"SEGURANÇA DO TRABALHO REFERENTE AO USO DE AGROTÓXICOS"]
[]
[{"$nulls":4},"Número de pessoas","Fator de ponderação"]
[null,"Quantas pessoas fazem o manuseio de agrotóxicos\t\t",{"$nulls":3},{"v":1,"d":"1.0"}]
[null,"Quantas pessoas utilizam EPI adequadamente\t\t\t\t",{"$nulls":3},{"v":1,"d":"1.0"}]
[{"$nulls":4},"Escolha uma opção\t"]
[null,"Armazenamento adequado das embalagens\t\t",{"$nulls":3},{"v":1,"d":"1.0"},"Sim"]
[null,"Devolução das embalagens de agrotóxicos\t\t",{"$nulls":3},{"v":1,"d":"1.0"},"Não"]
[]
[null,"Resultado",{"$f":"Fórmulas!G157","v":{"v":0.7,"d":"0.70"}},"Adaptação APOIA-NovoRural (Rodrigues et al, 2010)."]
[]
[12,"QUALIDADE DO SOLO"]
[]
[null,"Descrição do talhão \t"]
[{"$nulls":4},"Resultado "]
[null,"Teor de argila",null,"dag kg-1 (%) Argila",{"$f":"IF(ISBLANK(C265),0,IF(C265<=15,Fórmulas!H162,IF(AND(C265>15,C265<35),Fórmulas!H163,IF(AND(C265>=35,C265<=60),Fórmulas!H164,IF(C265>60,Fórmulas!H165)))))","v":{"v":0,"d":"0.00"}}]
[null,"Matéria Orgânica",null,"(dag kg-1)",{"$f":"IF(Fórmulas!M174>1,1,IF(Fórmulas!M174<0,0,Fórmulas!M174))","v":{"v":0,"d":"0.00"}}]
[null,"P disponível",null,"(mg dm-3) (Mehlich-1)",{"$f":"IF(Fórmulas!F203>1,1,IF(Fórmulas!F203<0,0,Fórmulas!F203))","v":{"v":0,"d":"0.00"}}]
[null,"Ca trocável",null,"(cmolc dm-3)",{"$f":"IF(ISBLANK(C268),0,IF(Fórmulas!I211>1,1,IF(Fórmulas!I211<0,0,Fórmulas!I211)))","v":{"v":0,"d":"0.00"}}]
[null,"Mg trocável",null,"(cmolc dm-3)",{"$f":"IF(ISBLANK(C269),0,IF(Fórmulas!I220>1,1,IF(Fórmulas!I220<0,0,Fórmulas!I220)))","v":{"v":0,"d":"0.00"}}]
[null,"K trocável",null,"(mg dm-3)",{"$f":"IF(ISBLANK(C270),0,IF(Fórmulas!I229>1,1,IF(Fórmulas!I229<0,0,Fórmulas!I229)))","v":{"v":0,"d":"0.00"}}]
[null,"pH em água",null,"Índice",{"$f":"IF(ISBLANK(C271),0,IF(Fórmulas!H238>1,1,IF(Fórmulas!H238<0,0,Fórmulas!H238)))","v":{"v":0,"d":"0.00"}}]
[null,"Al trocável",null,"(cmolc dm-3)",{"$f":"IF(C272>2,0,IF(ISBLANK(C272),0,IF(Fórmulas!H246>1,1,IF(Fórmulas!H246<0,0,Fórmulas!H246))))","v":{"v":0,"d":"0.00"}}]
[null,"CTC",null,"(cmolc dm-3)",{"$f":"IF(ISBLANK(C273),0,Fórmulas!H254)","v":{"v":0,"d":"0.00"}}]
[null,"Saturação por bases",null,"(%)",{"$f":"IF(ISBLANK(C274),0,IF(Fórmulas!H262>0.83,1,IF(Fórmulas!H262<0,0,Fórmulas!H262)))","v":{"v":0,"d":"0.00"}}]
[null,"Resultado Parcial",{"$f":"AVERAGE(E266,E267,E274)","v":{"v":0,"d":"0.00"}},null,"Análise de regressão gerada pelo programa SigmaPlot."]
[]
[null,"Avaliação da biologia do solo - BioAS* (opcional)\t"]
[null,"Arilsulfatase",null,"(mg p-nitrofenol kg-1 h-1)"]
[null,"β-Glicosidase",null,"(mg p-nitrofenol kg-1 h-1)"]
[null,"Matéria orgânica (0-10cm)",null,"(dag kg-1)"]
[null,"IQS Biológico ",null,"Índice"]
[null,"Índice Armaz. Nutrientes",null,"Índice"]
[null,"Índice Sup. Nutrientes",null,"Índice"]
[null,"IQS Químico",null,"Índice"]
[null,"IQS FertBio",null,"Índice"]
[null,"Resultado Parcial",{"$f":"C281","v":{"v":0,"d":"0.00"}}]
[null,"* Bioanálise do Solo (Embrapa)"]
[null,"Produtividade (opcional)"]
[null,"Descrição da atividade",{"$f":"D15","v":0}]
[null,"Unidade  (selecione)\t",{"$f":"D16","v":0}]
[null,"Produtividade do talhão",{"$f":"D17","v":{"v":0,"d":"0.00"}}]
[null,"Produtividade média local",{"$f":"D19","v":{"v":0,"d":"0.00"}},{"$f":"(C291/C292)-1","v":{"$error":"#DIV/0!"}}]
[null,"Resultado Parcial",{"$f":"IF(ISBLANK(C291),\"\",IF(F293>1,1,F293))","v":{"v":1,"d":"1.00"}},null,null,{"$f":"IF(C291>0,(-0.3+0.01*(100+(D292*100))),\"\")","v":""}]
[]
[null,"Resultado",{"$f":"IF(C286>0,(2*C275+C286)/3,C275)","v":{"v":0,"d":"0.00"}},"Adaptação - Sousa, D.M.G.; Lobato, E. (2004) e Ribeiro, A. C. (1999)"]
[]
[13,"QUALIDADE DA ÁGUA"]
[{"$nulls":6},"*Adaptação CALLISTO et al., 2002 - Aplicação de um protocolo de avaliação rápida de habitats em atividades de ensino e pesquisa.\t\n\t"]
[null,"13.1 Avaliação dos ecossistemas aquáticos nos trechos de coleta de amostras de água*"]
[]
[null,null,"Localização ","Escolha uma opção  ",null,null,"Fator de ponderação"]
[null,"Tipo de ocupação das margens do corpo d'água \n","Montante",null,null,{"$f":"SUM((IF('2 Indicadores'!D302=Fórmulas!L289,4,0))+(IF('2 Indicadores'!D302=Fórmulas!L290,2,0)))","v":{"v":0,"d":"0.0"}},{"v":4,"d":"4.0"},{"$f":"'2 Indicadores'!G302*'2 Indicadores'!F302","v":{"v":0,"d":"0.0"}}]
[null,null,"Jusante",null,null,{"$f":"SUM((IF('2 Indicadores'!D303=Fórmulas!L289,4,0))+(IF('2 Indicadores'!D303=Fórmulas!L290,2,0)))","v":{"v":0,"d":"0.0"}},{"v":4,"d":"4.0"},{"$f":"'2 Indicadores'!G303*'2 Indicadores'!F303","v":{"v":0,"d":"0.0"}}]
[null,"Alterações antrópicas\n","Montante",null,null,{"$f":"SUM((IF('2 Indicadores'!D304=Fórmulas!L292,4,0))+(IF('2 Indicadores'!D304=Fórmulas!L293,2,0)))","v":{"v":0,"d":"0.0"}},{"v":2,"d":"2.0"},{"$f":"'2 Indicadores'!G304*'2 Indicadores'!F304","v":{"v":0,"d":"0.0"}}]
[null,null,"Jusante",null,null,{"$f":"SUM((IF('2 Indicadores'!D305=Fórmulas!L292,4,0))+(IF('2 Indicadores'!D305=Fórmulas!L293,2,0)))","v":{"v":0,"d":"0.0"}},{"v":2,"d":"2.0"},{"$f":"'2 Indicadores'!G305*'2 Indicadores'!F305","v":{"v":0,"d":"0.0"}}]
[null,"Sombreamento a partir da cobertura vegetal no leito ","Montante",null,null,{"$f":"SUM((IF('2 Indicadores'!D306=Fórmulas!L295,4,0))+(IF('2 Indicadores'!D306=Fórmulas!L296,2,0)))","v":{"v":0,"d":"0.0"}},{"v":4,"d":"4.0"},{"$f":"'2 Indicadores'!G306*'2 Indicadores'!F306","v":{"v":0,"d":"0.0"}}]
[null,null,"Jusante",null,null,{"$f":"SUM((IF('2 Indicadores'!D307=Fórmulas!L295,4,0))+(IF('2 Indicadores'!D307=Fórmulas!L296,2,0)))","v":{"v":0,"d":"0.0"}},{"v":4,"d":"4.0"},{"$f":"'2 Indicadores'!G307*'2 Indicadores'!F307","v":{"v":0,"d":"0.0"}}]
[null,"Erosão nas margens / assoreamento em seu leito\n","Montante",null,null,{"$f":"SUM((IF('2 Indicadores'!D308=Fórmulas!L298,4,0))+(IF('2 Indicadores'!D308=Fórmulas!L299,2,0)))","v":{"v":0,"d":"0.0"}},{"v":4,"d":"4.0"},{"$f":"'2 Indicadores'!G308*'2 Indicadores'!F308","v":{"v":0,"d":"0.0"}}]
[null,null,"Jusante",null,null,{"$f":"SUM((IF('2 Indicadores'!D309=Fórmulas!L298,4,0))+(IF('2 Indicadores'!D309=Fórmulas!L299,2,0)))","v":{"v":0,"d":"0.0"}},{"v":4,"d":"4.0"},{"$f":"'2 Indicadores'!G309*'2 Indicadores'!F309","v":{"v":0,"d":"0.0"}}]
[null,"Transparência da água\n","Montante",null,null,{"$f":"SUM((IF('2 Indicadores'!D310=Fórmulas!L301,4,0))+(IF('2 Indicadores'!D310=Fórmulas!L302,2,0)))","v":{"v":0,"d":"0.0"}},{"v":3,"d":"3.0"},{"$f":"'2 Indicadores'!G310*'2 Indicadores'!F310","v":{"v":0,"d":"0.0"}}]
[null,null,"Jusante",null,null,{"$f":"SUM((IF('2 Indicadores'!D311=Fórmulas!L301,4,0))+(IF('2 Indicadores'!D311=Fórmulas!L302,2,0)))","v":{"v":0,"d":"0.0"}},{"v":3,"d":"3.0"},{"$f":"'2 Indicadores'!G311*'2 Indicadores'!F311","v":{"v":0,"d":"0.0"}}]
[null,"Odor da água","Montante",null,null,{"$f":"SUM((IF('2 Indicadores'!D312=Fórmulas!L304,4,0))+(IF('2 Indicadores'!D312=Fórmulas!L305,2,0)))","v":{"v":0,"d":"0.0"}},{"v":2,"d":"2.0"},{"$f":"'2 Indicadores'!G312*'2 Indicadores'!F312","v":{"v":0,"d":"0.0"}}]
[null,null,"Jusante",null,null,{"$f":"SUM((IF('2 Indicadores'!D313=Fórmulas!L304,4,0))+(IF('2 Indicadores'!D313=Fórmulas!L305,2,0)))","v":{"v":0,"d":"0.0"}},{"v":2,"d":"2.0"},{"$f":"'2 Indicadores'!G313*'2 Indicadores'!F313","v":{"v":0,"d":"0.0"}}]
[null,"Tipo de fundo do corpo d'água","Montante",null,null,{"$f":"SUM((IF('2 Indicadores'!D314=Fórmulas!L307,4,0))+(IF('2 Indicadores'!D314=Fórmulas!L308,2,0)))","v":{"v":0,"d":"0.0"}},{"v":4,"d":"4.0"},{"$f":"'2 Indicadores'!G314*'2 Indicadores'!F314","v":{"v":0,"d":"0.0"}}]
[null,null,"Jusante",null,null,{"$f":"SUM((IF('2 Indicadores'!D315=Fórmulas!L307,4,0))+(IF('2 Indicadores'!D315=Fórmulas!L308,2,0)))","v":{"v":0,"d":"0.0"}},{"v":4,"d":"4.0"},{"$f":"'2 Indicadores'!G315*'2 Indicadores'!F315","v":{"v":0,"d":"0.0"}}]
[]
[null,"13.2 Avaliação da qualidade da água superficial (opcional)\t\t\t\t"]
[null,"Descrição dos locais das coletas da água"]
[{"$nulls":5},"Resultado ","Fator de ponderação"]
[null,"pH da água","Montante",null,"Unidade",{"$f":"IF(D320>0,Fórmulas!B294,\"\")","v":""},{"v":1,"d":"1.0"}]
[null,null,"Jusante",null,"Unidade",{"$f":"IF(D321>0,Fórmulas!C294,\"\")","v":""},{"v":1,"d":"1.0"}]
[null,"Coliformes Termotolerantes","Montante",null,"(UFC 100 mL-1)",{"$f":"IF(D322=\"\",\"\",Fórmulas!B303)","v":""},{"v":3,"d":"3.0"}]
[null,null,"Jusante",null,"(UFC 100 mL-1)",{"$f":"IF(D323=\"\",\"\",Fórmulas!C303)","v":""},{"v":3,"d":"3.0"}]
[null,"Nitrato Total","Montante",null,"(mg L-1 de NO3)",{"$f":"IF(D324=\"\",\"\",Fórmulas!B320)","v":""},{"v":2,"d":"2.0"}]
[null,null,"Jusante",null,"(mg L-1 de NO3)",{"$f":"IF(D325=\"\",\"\",Fórmulas!C320)","v":""},{"v":2,"d":"2.0"}]
[null,"Turbidez da água","Montante",null,"UNT",{"$f":"IF(D326=\"\",\"\",Fórmulas!B312)","v":""},{"v":4,"d":"4.0"}]
[null,null,"Jusante",null,"UNT",{"$f":"IF(D327=\"\",\"\",Fórmulas!C312)","v":""},{"v":4,"d":"4.0"}]
[]
[null,"Avaliação do Ecossistema Aquático","Montante",{"$f":"(H302+H304+H306+H308+H310+H312+H314)/92","v":{"v":0,"d":"0.00"}},null,null,{"v":4,"d":"4.0"}]
[null,null,"Jusante",{"$f":"(H303+H305+H307+H309+H311+H313+H315)/92","v":{"v":0,"d":"0.00"}},null,null,{"v":4,"d":"4.0"}]
[]
[null,"Resultado Parcial Qualidade água superficial","Montante",{"$f":"+Fórmulas!L324","v":{"v":0,"d":"0.00"}}]
[null,null,"Jusante",{"$f":"+Fórmulas!L325","v":{"v":0,"d":"0.00"}}]
[]
[null,"13.3 Avaliação da qualidade da água subterrânea / consumo humano (opcional)\t\t\t\t\t"]
[null,"Descrição do local da coleta da amostra da água\t"]
[{"$nulls":5},"Resultado ","Fator de ponderação"]
[null,"pH da água",null,null,"Unit",{"$f":"IF(D338>0,Fórmulas!B336,\"\")","v":""},{"v":1,"d":"1.0"}]
[null,"Coliformes Termotolerantes",null,null,"(UFC 100 mL-1)",{"$f":"IF(D339=\"\",\"\",Fórmulas!B343)","v":""},{"v":1,"d":"1.0"}]
[null,"Nitrato Total",null,null,"(mg L-1 de NO3)",{"$f":"IF(D340=\"\",\"\",Fórmulas!B350)","v":""},{"v":1,"d":"1.0"}]
[null,"Resultado parcial  - Qualidade da água subterrânea\t",null,{"$f":"IF(AND(D338>0),AVERAGE(F338,F339,F340),\"\")","v":""}]
[]
[null,"Resultado",{"$f":"IF(D341=\"\",Fórmulas!F330,(((Fórmulas!F330*2)+D341)/3))","v":{"v":0,"d":"0.00"}}]
[]
[14,"RISCO DE CONTAMINAÇÃO DA ÁGUA POR AGROTÓXICOS"]
[]
[null,"14.1 Potencial de contaminação do produto",{"$nulls":3},"Para incluir mais produtos clique aqui"]
[null,"Nome comercial do produto (selecione)\t"]
[null,"Ingrediente ativo (%) (opcional)"]
[null,"Descrição da cultura \t"]
[null,"Área (ha)\t"]
[null,"Volume aplicado  L/ha ou kg/ha \t"]
[null,"Volume total aplicado por produto\t",null,{"$f":"+D352*D351","v":{"v":0,"d":"0.0"}},{"$f":"+E352*E351","v":{"v":0,"d":"0.0"}},{"$f":"+F352*F351","v":{"v":0,"d":"0.0"}},{"$f":"+G352*G351","v":{"v":0,"d":"0.0"}},{"$f":"+H352*H351","v":{"v":0,"d":"0.0"}}]
[null,"Ingrediente ativo do produto \t",null,{"$f":"IF(D$351>0,(HLOOKUP(D$348,'Base de dados'!$B$5:$AIN$11,$I354,0)),\"\")","v":""},{"$f":"IF(E$351>0,(HLOOKUP(E$348,'Base de dados'!$B$5:$AIN$11,$I354,0)),\"\")","v":""},{"$f":"IF(F$351>0,(HLOOKUP(F$348,'Base de dados'!$B$5:$AIN$11,$I354,0)),\"\")","v":""},{"$f":"IF(G$351>0,(HLOOKUP(G$348,'Base de dados'!$B$5:$AIN$11,$I354,0)),\"\")","v":""},{"$f":"IF(H$351>0,(HLOOKUP(H$348,'Base de dados'!$B$5:$AIN$11,$I354,0)),\"\")","v":""},2]
[null,"Toxicidade para peixes - 96h LC50 (mg L-1)\t",null,{"$f":"IF(D$351>0,(HLOOKUP(D$348,'Base de dados'!$B$5:$AIN$11,$I355,0)),\"\")","v":""},{"$f":"IF(E$351>0,(HLOOKUP(E$348,'Base de dados'!$B$5:$AIN$11,$I355,0)),\"\")","v":""},{"$f":"IF(F$351>0,(HLOOKUP(F$348,'Base de dados'!$B$5:$AIN$11,$I355,0)),\"\")","v":""},{"$f":"IF(G$351>0,(HLOOKUP(G$348,'Base de dados'!$B$5:$AIN$11,$I355,0)),\"\")","v":""},{"$f":"IF(H$351>0,(HLOOKUP(H$348,'Base de dados'!$B$5:$AIN$11,$I355,0)),\"\")","v":""},3]
[null,"Toxicidade (mg kg-1 day-1)",null,{"$f":"IF(D$351>0,(HLOOKUP(D$348,'Base de dados'!$B$5:$AIN$11,$I356,0)),\"\")","v":""},{"$f":"IF(E$351>0,(HLOOKUP(E$348,'Base de dados'!$B$5:$AIN$11,$I356,0)),\"\")","v":""},{"$f":"IF(F$351>0,(HLOOKUP(F$348,'Base de dados'!$B$5:$AIN$11,$I356,0)),\"\")","v":""},{"$f":"IF(G$351>0,(HLOOKUP(G$348,'Base de dados'!$B$5:$AIN$11,$I356,0)),\"\")","v":""},{"$f":"IF(H$351>0,(HLOOKUP(H$348,'Base de dados'!$B$5:$AIN$11,$I356,0)),\"\")","v":""},4]
[null,"Índice para toxicidade do produto\t",null,{"$f":"IF(D$351>0,(HLOOKUP(D$348,'Base de dados'!$B$5:$AIN$11,$I357,0)),\"\")","v":""},{"$f":"IF(E$351>0,(HLOOKUP(E$348,'Base de dados'!$B$5:$AIN$11,$I357,0)),\"\")","v":""},{"$f":"IF(F$351>0,(HLOOKUP(F$348,'Base de dados'!$B$5:$AIN$11,$I357,0)),\"\")","v":""},{"$f":"IF(G$351>0,(HLOOKUP(G$348,'Base de dados'!$B$5:$AIN$11,$I357,0)),\"\")","v":""},{"$f":"IF(H$351>0,(HLOOKUP(H$348,'Base de dados'!$B$5:$AIN$11,$I357,0)),\"\")","v":""},5]
[null,"Koc",null,{"$f":"IF(D$351>0,(HLOOKUP(D$348,'Base de dados'!$B$5:$AIN$11,$I358,0)),\"\")","v":""},{"$f":"IF(E$351>0,(HLOOKUP(E$348,'Base de dados'!$B$5:$AIN$11,$I358,0)),\"\")","v":""},{"$f":"IF(F$351>0,(HLOOKUP(F$348,'Base de dados'!$B$5:$AIN$11,$I358,0)),\"\")","v":""},{"$f":"IF(G$351>0,(HLOOKUP(G$348,'Base de dados'!$B$5:$AIN$11,$I358,0)),\"\")","v":""},{"$f":"IF(H$351>0,(HLOOKUP(H$348,'Base de dados'!$B$5:$AIN$11,$I358,0)),\"\")","v":""},6]
[null,"t1/2 (DT50)",null,{"$f":"IF(D$351>0,(HLOOKUP(D$348,'Base de dados'!$B$5:$AIN$11,$I359,0)),\"\")","v":""},{"$f":"IF(E$351>0,(HLOOKUP(E$348,'Base de dados'!$B$5:$AIN$11,$I359,0)),\"\")","v":""},{"$f":"IF(F$351>0,(HLOOKUP(F$348,'Base de dados'!$B$5:$AIN$11,$I359,0)),\"\")","v":""},{"$f":"IF(G$351>0,(HLOOKUP(G$348,'Base de dados'!$B$5:$AIN$11,$I359,0)),\"\")","v":""},{"$f":"IF(H$351>0,(HLOOKUP(H$348,'Base de dados'!$B$5:$AIN$11,$I359,0)),\"\")","v":""},7]
[null,"Índice de vulnerabilidade águas subterrâneas (GUS)\t",null,{"$f":"IF(D351=0,\"\",IF(LOG10(D359)*(4-LOG10(D358))<=0,0,IF(OR(LOG10(D359)*(4-LOG10(D358))>0,),(LOG10(D359)*(4-LOG10(D358))),IF((LOG10(D359)*(4-LOG10(D358))>0),(LOG10(D359)*(4-LOG10(D358)))))))","v":""},{"$f":"IF(E351=0,\"\",IF(LOG10(E359)*(4-LOG10(E358))<=0,0,IF(OR(LOG10(E359)*(4-LOG10(E358))>0,),(LOG10(E359)*(4-LOG10(E358))),IF((LOG10(E359)*(4-LOG10(E358))>0),(LOG10(E359)*(4-LOG10(E358)))))))","v":""},{"$f":"IF(F351=0,\"\",IF(LOG10(F359)*(4-LOG10(F358))<=0,0,IF(OR(LOG10(F359)*(4-LOG10(F358))>0,),(LOG10(F359)*(4-LOG10(F358))),IF((LOG10(F359)*(4-LOG10(F358))>0),(LOG10(F359)*(4-LOG10(F358)))))))","v":""},{"$f":"IF(G351=0,\"\",IF(LOG10(G359)*(4-LOG10(G358))<=0,0,IF(OR(LOG10(G359)*(4-LOG10(G358))>0,),(LOG10(G359)*(4-LOG10(G358))),IF((LOG10(G359)*(4-LOG10(G358))>0),(LOG10(G359)*(4-LOG10(G358)))))))","v":""},{"$f":"IF(H351=0,\"\",IF(LOG10(H359)*(4-LOG10(H358))<=0,0,IF(OR(LOG10(H359)*(4-LOG10(H358))>0,),(LOG10(H359)*(4-LOG10(H358))),IF((LOG10(H359)*(4-LOG10(H358))>0),(LOG10(H359)*(4-LOG10(H358)))))))","v":""}]
[null,"Potencial de contaminação (1, 2 or 3)",null,{"$f":"IF(D351>0,(IF(OR(Fórmulas!C367=0.83,Fórmulas!C367<0.83),1,IF(OR(AND(0.83<Fórmulas!C367,Fórmulas!C367<=1.66)),2,IF(Fórmulas!C367>1.66,3,\"\")))),\"\")","v":""},{"$f":"IF(E351>0,(IF(OR(Fórmulas!D367=0.83,Fórmulas!D367<0.83),1,IF(OR(AND(0.83<Fórmulas!D367,Fórmulas!D367<=1.66)),2,IF(Fórmulas!D367>1.66,3,\"\")))),\"\")","v":""},{"$f":"IF(F351>0,(IF(OR(Fórmulas!E367=0.83,Fórmulas!E367<0.83),1,IF(OR(AND(0.83<Fórmulas!E367,Fórmulas!E367<=1.66)),2,IF(Fórmulas!E367>1.66,3,\"\")))),\"\")","v":""},{"$f":"IF(G351>0,(IF(OR(Fórmulas!F367=0.83,Fórmulas!F367<0.83),1,IF(OR(AND(0.83<Fórmulas!F367,Fórmulas!F367<=1.66)),2,IF(Fórmulas!F367>1.66,3,\"\")))),\"\")","v":""},{"$f":"IF(H351>0,(IF(OR(Fórmulas!G367=0.83,Fórmulas!G367<0.83),1,IF(OR(AND(0.83<Fórmulas!G367,Fórmulas!G367<=1.66)),2,IF(Fórmulas!G367>1.66,3,\"\")))),\"\")","v":""}]
[null,"EIQ Impacto ao trabalhador rural (<  80; 80 - 128; > 128)",null,{"$f":"IF(D$351>0,(HLOOKUP(D$348,'Base de dados'!$B$5:$AIN$18,$I362,0)),\"\")","v":""},{"$f":"IF(E$351>0,(HLOOKUP(E$348,'Base de dados'!$B$5:$AIN$18,$I362,0)),\"\")","v":""},{"$f":"IF(F$351>0,(HLOOKUP(F$348,'Base de dados'!$B$5:$AIN$18,$I362,0)),\"\")","v":""},null,null,12]
[null,"EIQ Impacto ao consumidor (< 20,5; 20,5 - 36,25; > 36,25)",null,{"$f":"IF(D$351>0,(HLOOKUP(D$348,'Base de dados'!$B$5:$AIN$18,$I363,0)),\"\")","v":""},{"$f":"IF(E$351>0,(HLOOKUP(E$348,'Base de dados'!$B$5:$AIN$18,$I363,0)),\"\")","v":""},{"$f":"IF(F$351>0,(HLOOKUP(F$348,'Base de dados'!$B$5:$AIN$18,$I363,0)),\"\")","v":""},null,null,13]
[null,"EIQ Impacto ao meio ambiente (< 75; 75 - 136,5; > 136,5)",null,{"$f":"IF(D$351>0,(HLOOKUP(D$348,'Base de dados'!$B$5:$AIN$18,$I364,0)),\"\")","v":""},{"$f":"IF(E$351>0,(HLOOKUP(E$348,'Base de dados'!$B$5:$AIN$18,$I364,0)),\"\")","v":""},{"$f":"IF(F$351>0,(HLOOKUP(F$348,'Base de dados'!$B$5:$AIN$18,$I364,0)),\"\")","v":""},null,null,14]
[null,"Environmental Impact Quotient (EIQ) (<58,33; 58,33 - 94,46; > 94,46)",null,{"$f":"IF(D$351>0,(HLOOKUP(D$348,'Base de dados'!$B$5:$AIN$18,$I365,0)),\"\")","v":""},{"$f":"IF(E$351>0,(HLOOKUP(E$348,'Base de dados'!$B$5:$AIN$18,$I365,0)),\"\")","v":""},{"$f":"IF(F$351>0,(HLOOKUP(F$348,'Base de dados'!$B$5:$AIN$18,$I365,0)),\"\")","v":""},null,null,11]
[null,"Pesticidas banidos na União Européia - EU (2022) (X)",null,{"$f":"IF(D$351>0,(HLOOKUP(D$348,'Base de dados'!$B$5:$AIN$19,$I366,0)),\"\")","v":""},{"$f":"IF(E$351>0,(HLOOKUP(E$348,'Base de dados'!$B$5:$AIN$19,$I366,0)),\"\")","v":""},{"$f":"IF(F$351>0,(HLOOKUP(F$348,'Base de dados'!$B$5:$AIN$19,$I366,0)),\"\")","v":""},null,null,15]
[]
[null,"14.2 Vulnerabilidade ambiental do talhão",null,"Escolha uma opção (1, 2 or 3)\t"]
[null,"Teor de argila no solo                                                              > 60% (1); 30% - 60% (2); <30% (3)\t"]
[null,"Distância do curso d'água (a partir da borda do talhão)                          >1.000m (1);  300 - 1.000m (2);  <300m (3)\t"]
[null,"Tipo de manejo do solo: Sistema plantio direto (1); Cultivo mínimo (2); Revolvimento do solo (3)\t"]
[null,"Vulnerabilidade do talhão (1, 2 ou 3)\t",null,{"$f":"IF(D352>0,(IF(OR(AND(1<=Fórmulas!C368,Fórmulas!C368<=3)),1,IF(OR(AND(3<Fórmulas!C368,Fórmulas!C368<=9)),2,IF(Fórmulas!C368>9,3)))),\"\")","v":""},{"$f":"IF(E352>0,(IF(OR(AND(1<=Fórmulas!D368,Fórmulas!D368<=3)),1,IF(OR(AND(3<Fórmulas!D368,Fórmulas!D368<=9)),2,IF(Fórmulas!D368>9,3)))),\"\")","v":""},{"$f":"IF(F352>0,(IF(OR(AND(1<=Fórmulas!E368,Fórmulas!E368<=3)),1,IF(OR(AND(3<Fórmulas!E368,Fórmulas!E368<=9)),2,IF(Fórmulas!E368>9,3)))),\"\")","v":""},{"$f":"IF(G352>0,(IF(OR(AND(1<=Fórmulas!F368,Fórmulas!F368<=3)),1,IF(OR(AND(3<Fórmulas!F368,Fórmulas!F368<=9)),2,IF(Fórmulas!F368>9,3)))),\"\")","v":""},{"$f":"IF(H352>0,(IF(OR(AND(1<=Fórmulas!G368,Fórmulas!G368<=3)),1,IF(OR(AND(3<Fórmulas!G368,Fórmulas!G368<=9)),2,IF(Fórmulas!G368>9,3)))),\"\")","v":""}]
[null,"Risco de contaminação (1 (baixo), 2 (médio) or 3 (alto)",null,{"$f":"IF(D352>0,(IF(OR(AND(1<=Fórmulas!C370,Fórmulas!C370<=2)),1,IF(OR(AND(2<Fórmulas!C370,Fórmulas!C370<=4)),2,IF(Fórmulas!C370>4,3)))),\"\")","v":""},{"$f":"IF(E352>0,(IF(OR(AND(1<=Fórmulas!D370,Fórmulas!D370<=2)),1,IF(OR(AND(2<Fórmulas!D370,Fórmulas!D370<=4)),2,IF(Fórmulas!D370>4,3)))),\"\")","v":""},{"$f":"IF(F352>0,(IF(OR(AND(1<=Fórmulas!E370,Fórmulas!E370<=2)),1,IF(OR(AND(2<Fórmulas!E370,Fórmulas!E370<=4)),2,IF(Fórmulas!E370>4,3)))),\"\")","v":""},{"$f":"IF(G352>0,(IF(OR(AND(1<=Fórmulas!F370,Fórmulas!F370<=2)),1,IF(OR(AND(2<Fórmulas!F370,Fórmulas!F370<=4)),2,IF(Fórmulas!F370>4,3)))),\"\")","v":""},{"$f":"IF(H352>0,(IF(OR(AND(1<=Fórmulas!G370,Fórmulas!G370<=2)),1,IF(OR(AND(2<Fórmulas!G370,Fórmulas!G370<=4)),2,IF(Fórmulas!G370>4,3)))),\"\")","v":""}]
[]
[null,"14.3 Contamination Risk"]
[null,"Descrição do cultivo\t",null,{"$f":"D350","v":0}]
[null,"Área (ha)",null,{"$f":"D351","v":{"v":0,"d":"0.0"}}]
[null,"Risco máximo identificado (1 - baixo), (2 - médio) or (3 - alto)",null,{"$f":"MAX(D373:F373,Fórmulas!D417:L417,Fórmulas!D446:L446,Fórmulas!D474:I474)","v":0}]
[null,"Resultado",{"$f":"IF(D351=0,1,Fórmulas!D479)","v":{"v":1,"d":"1.00"}},"Referència: Chaves (2010); Kovach et al. (1992)"]
[]
[15,"EROSÃO DO SOLO"]
[]
[{"$nulls":3},"Escolha uma opção  ","Área (ha)","Proporção (%) área total","Fator de ponderação"]
[null,"15.1 Intensidade do estágio de degradação*\t",{"$nulls":3},{"$f":"IF(E384>0,E384/Fórmulas!$I$509,\" \")","v":" "},{"v":1,"d":"1.0"},"Inicial"]
[null,"* Evidências de erosão: Inicial - redução de infiltração de água, raízes expostas; Intermediário - remoção do horizonte superficial, presença de sulcos rasos localizados; Avançado - sulcos profundos e disseminados na área, voçorocas, movimento de massa (deslocamento de um volume de solo).\t\t\t\t\t",{"$nulls":4},0.8,"Intermediário"]
[{"$nulls":6},0.5,"Avançado"]
[null,"15.2 Tendência de comportamento do processo\t",null,null,"Escolha uma opção  "]
[null,"** Adoção de medidas de recuperação ou mitigação como terraceamentos, barreiras físicas, barramentos, revegetação, etc.\t\t\t\t"]
[]
[null,"Resultado",{"$f":"IF(Fórmulas!E497>0,(Fórmulas!E497*Fórmulas!E498*1.2)+(Fórmulas!E497*Fórmulas!F498)+(Fórmulas!E497*Fórmulas!G498*0.8),0.7)","v":{"v":0.7,"d":"0.70"}},"Adaptação APOIA-NovoRural (Rodrigues et al, 2003); Fidalski (1997)."]
[]
[16,"GRAU DE ADOÇÃO DE PRÁTICAS CONSERVACIONISTAS"]
[]
[null,null,"Área (ha)","Lavoura Permanente                ","Lavoura temporária","Pastagens","Silvicultura","Fator de ponderação"]
[{"$nulls":3},{"$f":"+'1 Questionário'!D86","v":0},{"$f":"+'1 Questionário'!D87","v":0},{"$f":"+'1 Questionário'!D88","v":0},{"$f":"+'1 Questionário'!D89","v":0}]
[null,"16.1 Grau de adoção de práticas para a conservação dos solos\n","Adequado",{"$nulls":4},0.9]
[null,null,"Médio",{"$nulls":4},0.6]
[null,null,"Baixo",{"$nulls":4},0.3]
[null,null,"Situação crítica*",{"$nulls":4},0.1]
[null,"*Situação crítica (solo/água) - especificar"]
[{"$nulls":5},"Verificação (Uso da terra) =>",null,{"$f":"SUM(D396:G399)/('1 Questionário'!D86+'1 Questionário'!D87+'1 Questionário'!D88+'1 Questionário'!D89)","v":{"$error":"#DIV/0!"}}]
[{"$nulls":3},"Escolha uma opção  ","Fator de ponderação"]
[null,"16.2 Estratégias conservação/reservação - águas \t\n",null,null,{"v":1,"d":"1.0"},"Suficiente"]
[{"$nulls":4},0.4,"Insuficiente"]
[{"$nulls":4},0.1,"Situação crítica"]
[]
[null,"Resultado",{"$f":"IF(Fórmulas!F512=0,\"\",(((Fórmulas!E512*2)+Fórmulas!F512)/3))","v":""},"Adaptação APOIA-NovoRural (Rodrigues et al, 2010)."]
[]
[17,"ESTADO DE CONSERVAÇÃO DAS ESTRADAS "]
[]
[{"$nulls":3},"Estradas (%)",null,"Fator de ponderação"]
[null,"17.1 Avaliação do estado de conservação e drenagem \n\n","Presença abaulamento das estradas\t",null,null,{"v":1,"d":"1.0"}]
[null,null,"Presença de lombadas - desvio de enxurrada\t",null,null,{"v":1,"d":"1.0"},{"$f":"IF(ISBLANK(E413),Fórmulas!M517,\" \")","v":"Não se aplica"}]
[null,null,"Presença de caixas de infiltração\t",null,null,{"v":1,"d":"1.0"},{"$f":"IF(ISBLANK(E414),Fórmulas!M517,\" \")","v":"Não se aplica"}]
[]
[{"$nulls":3},"Estradas (%)"]
[null,"17.2 Conservação das estradas","Presença de buracos nas estradas\t",null,null,{"v":1,"d":"1.0"},"Fator de ponderação"]
[null,null,"Presença de sulcos de erosão nas estradas\t\t",null,null,{"v":1,"d":"1.0"},{"v":2,"d":"2.0"},{"v":1,"d":"1.0"}]
[]
[{"$nulls":4},"Escolha uma opção  "]
[null,"17.3 O imóvel rural possui algum ponto crítico nas estradas* \t\t",{"$nulls":3},{"v":1,"d":"1.0"}]
[null,null,"*Situação crítica - especificar"]
[]
[null,"Resultado",{"$f":"IF(AND(E417=\"\",E412=\"\"),0,Fórmulas!J518)","v":{"v":0,"d":"0.00"}}]
[]
[18,"VEGETAÇÃO NATIVA - FITOFISIONOMIAS E ESTADO DE CONSERVAÇÃO"]
[{"$nulls":7},"Fator de ponderação"]
[null,null,"Fitofisionomias (selecione)"]
[null,"18.1 Estágios sucessionais da vegetação nativa\n\n","Estágio avançado (área ha)",{"$nulls":4},{"v":1,"d":"1.0"}]
[null,null,"Estágio médio (área ha)",{"$nulls":4},0.9]
[null,null,"Estágio inicial (área ha)",{"$nulls":4},0.7]
[null,"Resultado parcial",{"$f":"IF('1 Questionário'!I93=0,0,Fórmulas!C530)","v":{"v":0,"d":"0.00"}},"Área vegetação nativa",{"$f":"+'1 Questionário'!I93","v":{"v":0,"d":"0.00"}},null,"                                       Verificação  =>",{"$f":"SUM(Fórmulas!F527:F529)","v":{"v":0,"d":"0.0%"}}]
[{"$nulls":6},"Fator de ponderação","Fator de ponderação"]
[{"$nulls":5},"Unidade"]
[null,"18.2 Nº de fragmentos com vegetação nativa (no imóvel rural) \t\t\t",{"$nulls":5},{"v":1,"d":"1.0"}]
[null,"Resultado parcial",{"$f":"IF(F435=\"\",\"\",(Fórmulas!D538))","v":""}]
[{"$nulls":5},"Escolha uma opção  "]
[null,"18.3 Fragmento(s) tem conexão com a vegetação nativa de imóveis rurais vizinhos \t\t\t\t\t\t"]
[]
[{"$nulls":5},"Escolha uma opção  "]
[null,"18.4 Fragmento(s) protegidos do pastoreio e do fogo (aceiros com manutenção anual) \t\t\t\t\t\t"]
[]
[null,"Resultado",{"$f":"IF(H432=0,0,(Fórmulas!B533))","v":{"v":0,"d":"0.00"}},"Adaptação APOIA-NovoRural (Rodrigues et al, 2010)."]
[]
[19,"ADEQUAÇÃO DAS ÁREAS DE PRESERVAÇÃO PERMANENTE (APPs)",{"$nulls":5},"Fator de ponderação"]
[]
[{"$nulls":6},"Unidade (ha)"]
[null,"19.1 Uso e ocupação do solo nas APPs","Área antropizada com uso consolidado passível de ser explorada + vegetação nativa\t\t\t\t",{"$nulls":3},{"$f":"+'1 Questionário'!I99","v":{"v":0,"d":"0.00"}},0.7]
[null,null,"Área com supressão vegetal com obrigação de recomposição da veg. nativa\t\t\t\t\t",{"$nulls":3},{"$f":"'1 Questionário'!D100","v":{"v":0,"d":"0.00"}},0.1]
[{"$nulls":5},"Soma =>",{"$f":"+G448+G449","v":{"v":0,"d":"0.00"}}]
[]
[null,"19.2 Proporção das APPs efetivamente protegidas e com bom estado de conservação (%) \t\t\t\t",{"$nulls":5}," Unidade (%)"]
[]
[null,"Resultado",{"$f":"IF(G452=\"\",0,Fórmulas!F554)","v":{"v":0,"d":"0.00"}},"Adaptação APOIA-NovoRural (Rodrigues et al, 2010)."]
[]
[20,"ADEQUAÇÃO DA RESERVA LEGAL (RL)"]
[]
[null,"Área de Reserva Legal (ha)  =>\t",null,{"$f":"Fórmulas!M570","v":{"v":0,"d":"0.00"}},{"$f":"'1 Questionário'!E105","v":{"v":0,"d":"0%"}}]
[null,"Áreas de/para RL que necessitam de recomposição\t",null,{"$f":"+Fórmulas!L574","v":{"v":0,"d":"0.00"}}]
[]
[null,{"$f":"'1 Questionário'!C106","v":{"v":0,"d":"0.00"}},{"$f":"'1 Questionário'!D106","v":{"v":0,"d":"0.00"}},{"$f":"'1 Questionário'!E106","v":{"v":0,"d":"0.00"}},null,"Unidade (ha)","Fator de ponderação"]
[null,"20.1 Adequação da RL \n\n","Vegetação nativa excedente à RL\t\t",null,null,{"$f":"+'1 Questionário'!E106","v":{"v":0,"d":"0.00"}},{"v":1,"d":"1.0"}]
[null,null,"Área de RL fora do imóvel rural*\t\t",{"$nulls":3},0.7]
[null,null,"Áreas de/para RL não passíveis de recomposição\t\t",null,null,{"$f":"IF('1 Questionário'!F72<4,'2 Indicadores'!D458,'1 Questionário'!D93)","v":{"v":0,"d":"0.00"}},0.7]
[null,null,"Áreas de/para RL que necessitam de recomposição\t\t\t",null,null,{"$f":"IF((D458-F462-F464)<0,0,(D458-F464-F462))","v":{"v":0,"d":"0.00"}},0.1]
[{"$nulls":4},"Verificação =>",{"$f":"(F463+F464+F465)/D458","v":{"$error":"#DIV/0!"}}]
[]
[null,"Resultado",{"$f":"IF(F466<0.99,\"\",Fórmulas!F564)","v":{"$error":"#DIV/0!"}},"Adaptação APOIA-NovoRural (Rodrigues et al, 2010)."]
[]
[21,"DIVERSIFICAÇÃO DA PAISAGEM RURAL"]
[]
[null,null,"Area (ha)","Lavoura Permanente                ","Lavoura temporária","Pastagens","Silvicultura","Fator de ponderação"]
[{"$nulls":3},{"$f":"+D395","v":0},{"$f":"+E395","v":0},{"$f":"+F395","v":0},{"$f":"+G395","v":0}]
[null,"21.1 Grau de adoção de práticas que auxiliam na biodiversidade*\n\n","Adequado",{"$nulls":4},0.9]
[null,null,"Médio",{"$nulls":4},0.6]
[null,null,"Baixo",{"$nulls":4},0.3]
[null,null,"Situação crítica**",{"$nulls":4},0.1]
[null,"Situação crítica (biodiversidade) - especificar"]
[null,"*Culturas intercalares, consórcio, rotações, integração, adubação verde; barreiras vegetais; arborização\t\t\t\t",{"$nulls":3},"Verification (Land Use) =>",null,{"$f":"SUM(D474:G477)/('1 Questionário'!D86+'1 Questionário'!D87+'1 Questionário'!D88+'1 Questionário'!D89)","v":{"$error":"#DIV/0!"}}]
[null,"** Uso de fogo em pastagens ou nas palhadas; áreas sem nenhuma cobertura vegetal; sucessões com a mesma cultura.\t\t\t\t\t\t"]
[null,"Resultado parcial",{"$f":"(Fórmulas!M581*Fórmulas!C581)+(Fórmulas!M582*Fórmulas!C582)+(Fórmulas!M583*Fórmulas!C583)+(Fórmulas!M584*Fórmulas!C584)","v":{"$error":"#DIV/0!"}}]
[]
[null,"21.2 Índice Shannon (áreas produtivas e vegetação nativa)\t\t\t",null,null,{"$f":"Fórmulas!L601","v":{"$error":"#DIV/0!"}}]
[null,"Resultado parcial",{"$f":"Fórmulas!F596*(1-EXP((-Fórmulas!F597)*(E483*100)))","v":{"$error":"#DIV/0!"}}]
[{"$nulls":6},"Escolha uma opção  "]
[null,"21.3 Ocorrência de uma alta proporção (> 70% do perímetro) de monoculturas limítrofes ao imóvel rural  \t\t\t\t\t\t\t"]
[]
[null,"Resultado",{"$f":"IF(G486=\"Sim\",((((C481*3)+(C484*2))/5)*0.9),(((C481*3)+(C484*2))/5))","v":{"$error":"#DIV/0!"}},"Adaptação APOIA-NovoRural (Rodrigues et al, 2010)."]

{"sheet":"3 Relatório","index":3,"n_rows":89,"n_cols":20,"rows_kept":89,"merged":[[0,0,1,2],[0,3,1,4],[64,16,64,18],[68,12,76,12],[77,12,88,12]]}
["ISA",null,null,"RELATÓRIO"]
[]
[{"$nulls":5},"Data de aplicação",null,{"$f":"IF('1 Questionário'!C34=\"\",\"\",'1 Questionário'!C34)","v":""}]
[null,"ÍNDICE FINAL",null,{"$f":"'3 Relatório'!Q68","v":""},null,"Descrição do Imóvel rural",null,{"$f":"'1 Questionário'!D70","v":0}]
[null,"Desvio padrão",null,{"$f":"STDEV(Q69:Q89)","v":{"$error":"#DIV/0!"}},null,"Área (ha)",null,{"$f":"'1 Questionário'!D72","v":{"v":0,"d":"0.0"}}]
{"$rows_empty":17}
[null,null,"Uso e ocupação do solo",{"$nulls":4},"Uso e ocupação do solo"]
[{"$nulls":7},"APPs (% área total)",null,null,{"$f":"'1 Questionário'!E99","v":{"v":0,"d":"0.0%"}}]
[{"$nulls":7},"Área a ser recuperada - APPs (% área total)",null,null,{"$f":"Fórmulas!G576","v":{"$error":"#DIV/0!"}}]
[{"$nulls":7},"Área a ser recuperada - APPs (ha)",null,null,{"$f":"'1 Questionário'!D100","v":0}]
[{"$nulls":7},"Área com vegetação nativa excedente a RL(ha)",null,null,{"$f":"'1 Questionário'!E106","v":0}]
[{"$nulls":7},"Nº de fragmentos com vegetação nativa",null,null,{"$f":"+'2 Indicadores'!F435","v":0}]
[{"$nulls":7},"Nº de cursos d'água",null,null,{"$f":"'1 Questionário'!E110","v":0}]
[{"$nulls":7},"Nº de nascentes",null,null,{"$f":"'1 Questionário'!E111","v":0}]
[{"$nulls":7},"Nº de lagos e lagoas naturais",null,null,{"$f":"'1 Questionário'!E112","v":0}]
[{"$nulls":7},"Nº de represas",null,null,{"$f":"'1 Questionário'!E113","v":0}]
[{"$nulls":7},"Área com irrigação (ha)",null,null,{"$f":"+'2 Indicadores'!C81","v":0}]
[]
[{"$nulls":7},"Problemas com abastecimento de água",null,null,{"$f":"IF('1 Questionário'!E121=\"x\",\"Sim\",\"Não\")","v":"Não"}]
[]
[]
[null,"Fertilidade do solo",{"$nulls":5},"Gestão"]
[null,"Matéria orgânica do solo (dag kg-1)",null,null,{"$f":"'2 Indicadores'!C266","v":{"v":0,"d":"0.0"}},null,null,"Renda bruta (R$/ano)",null,null,{"$f":"+K42/('1 Questionário'!D72+'1 Questionário'!D81)","v":{"$error":"#DIV/0!"}}]
[null,"Fósforo (mg dm-3)",null,null,{"$f":"'2 Indicadores'!C267","v":{"v":0,"d":"0.0"}},null,null,"Débitos / estimativa patrimonial",null,null,{"$f":"'2 Indicadores'!E121","v":{"$error":"#DIV/0!"}}]
[null,"Cálcio (cmolc dm-3)",null,null,{"$f":"'2 Indicadores'!C268","v":{"v":0,"d":"0.0"}},null,null,"Receita bruta anual / estimativa patrimonial",null,null,{"$f":"K42/'2 Indicadores'!C102","v":{"$error":"#DIV/0!"}}]
[null,"Magnésio (cmolc dm-3)",null,null,{"$f":"'2 Indicadores'!C269","v":{"v":0,"d":"0.0"}},null,null,"Receita bruta (R$/ano)",null,null,{"$f":"SUM('2 Indicadores'!D9:D11)+SUM('2 Indicadores'!D29:E31)","v":{"$error":"#DIV/0!"}}]
[null,"Potássio (mg dm-3)",null,null,{"$f":"'2 Indicadores'!C270","v":{"v":0,"d":"0.0"}},null,null,"Proporção principal atividade / receita bruta",null,null,{"$f":"+'2 Indicadores'!E9","v":{"$error":"#DIV/0!"}}]
[null,"Acidez ativa (pH)",null,null,{"$f":"'2 Indicadores'!C271","v":{"v":0,"d":"0.0"}}]
[null,"Alumínio (cmolc dm-3)",null,null,{"$f":"'2 Indicadores'!C272","v":{"v":0,"d":"0.0"}},null,null,"Média anual evolução patrimonial total (%)",null,null,{"$f":"'2 Indicadores'!F112","v":{"$error":"#DIV/0!"}}]
[null,"CTC (cmolc dm-3)",null,null,{"$f":"'2 Indicadores'!C273","v":{"v":0,"d":"0.0"}},null,null,"Média anual evol. Pat. (s/ valor. da terra) (%)",null,null,{"$f":"'2 Indicadores'!F113","v":{"$error":"#DIV/0!"}}]
[null,"Saturação por bases (%)",null,null,{"$f":"'2 Indicadores'!C274","v":{"v":0,"d":"0.0"}}]
[null,"K/CTC (%) (referência 3 - 5%)",null,null,{"$f":"IF(E43>0,((E43/1000*2.5577)/E46*100),\"\")","v":""},null,null,"Participação da mulher na gestão",null,null,{"$f":"'1 Questionário'!D66","v":{"v":0,"d":"0.0%"}}]
[null,"Ca/CTC (%) (referência 40 - 60%)",null,null,{"$f":"IF(E41>0,E41/E46*100,\"\")","v":""},null,null,"Processo sucessório",null,null,{"$f":"'1 Questionário'!D64","v":{"v":0,"d":"0.0%"}}]
[null,"Mg/CTC (%) (referência 10 - 20%)",null,null,{"$f":"IF(E42>0,E42/E46*100,\"\")","v":""}]
[{"$nulls":7},"Qte de agrotóxicos / área cultivada (L/ha/ano)",null,null,{"$f":"Fórmulas!D483","v":""}]
[null,"Produtividade",{"$nulls":5},"Volume anual de pesticidas (L)\t",null,null,{"$f":"Fórmulas!D480","v":""}]
[null,"Descrição da cultura",null,null,{"$f":"'2 Indicadores'!D15","v":{"v":0,"d":"0.0%"}},null,null,"Índice Final EIQ cumulativo (agrotóxicos)",null,null,{"$f":"SUM('2 Indicadores'!D365:F365,Fórmulas!D409:L409,Fórmulas!D438:L438,Fórmulas!D466:I466)","v":0}]
[null,"Unidade",null,null,{"$f":"'2 Indicadores'!D16","v":0}]
[null,"Produtividade",null,null,{"$f":"'2 Indicadores'!D17","v":0},null,null,"Biologia do solo"]
[{"$nulls":7},"Arilsulfatase (mg p-nitrofenol kg-1 h-1)",null,null,{"$f":"IF('2 Indicadores'!C278=\"\",\"\",'2 Indicadores'!C278)","v":""}]
[null,"Erosão do solo",{"$nulls":5},"ß-glicosidase (mg p-nitrofenol kg-1 h-1)",null,null,{"$f":"IF('2 Indicadores'!C279=\"\",\"\",'2 Indicadores'!C279)","v":""}]
[null,"Erosão do solo - área",null,null,{"$f":"'2 Indicadores'!E384","v":0},null,null,"IQS biológico",null,null,{"$f":"IF('2 Indicadores'!C281=\"\",\"\",'2 Indicadores'!C281)","v":""}]
[null,"Erosão do solo - intensidade",null,null,{"$f":"'2 Indicadores'!D384","v":0},null,null,"IQS química do solo",null,null,{"$f":"IF('2 Indicadores'!C284=\"\",\"\",'2 Indicadores'!C284)","v":""}]
[null,"Erosão do solo - comportamento (tendência)",null,null,{"$f":"'2 Indicadores'!D387","v":0},null,null,"IQS Fertbio",null,null,{"$f":"IF('2 Indicadores'!C285=\"\",\"\",'2 Indicadores'!C285)","v":""}]
[]
[null,"Descrição técnicas inovadoras adotadas",null,null,{"$f":"IF('2 Indicadores'!E218=\"\",\"\",'2 Indicadores'!E218)","v":""}]
[]
[]
[{"$nulls":16},"DATA"]
[{"$nulls":16},{"$f":"H3","v":""}]
[{"$nulls":13},"Desvio Padrão",null,{"$f":"STDEV(Q69:Q79,Q80:Q89)","v":{"$error":"#DIV/0!"}},"Atual","Histórico I","Histórico II"]
[{"$nulls":13},"Índice de sustentabilidade",null,null,{"$f":"IF(Q69>0,AVERAGE(Q69:Q89),\"\")","v":""},{"$f":"IF(R69>0,AVERAGE(R69:R89),\"\")","v":""},{"$f":"IF(S69>0,AVERAGE(S69:S89),\"\")","v":""}]
[{"$nulls":12},"Aspectos socioeconômicos","1.Produtividade & preço de venda",null,null,{"$f":"'2 Indicadores'!C23","v":{"v":0,"d":"0.00"}},null,null,0.7]
[{"$nulls":13},"2.Diversificação da renda",null,null,{"$f":"'2 Indicadores'!C46","v":{"$error":"#DIV/0!"}},null,null,0.7]
[{"$nulls":13},"3.Evolução patrimonial",null,null,{"$f":"'2 Indicadores'!C115","v":{"$error":"#DIV/0!"}},null,null,0.7]
[{"$nulls":13},"4.Grau de endividamento",null,null,{"$f":"'2 Indicadores'!C123","v":{"$error":"#DIV/0!"}},null,null,0.7]
[{"$nulls":13},"5.Serviços básicos",null,null,{"$f":"'2 Indicadores'!C149","v":{"v":0,"d":"0.00"}},null,null,0.7]
[{"$nulls":13},"6.Escolaridade & Cursos",null,null,{"$f":"'2 Indicadores'!C171","v":{"$error":"#DIV/0!"}},null,null,0.7]
[{"$nulls":13},"7.Emprego",null,null,{"$f":"'2 Indicadores'!C193","v":{"v":0.7,"d":"0.70"}},null,null,0.7]
[{"$nulls":13},"8.Gestão ",null,null,{"$f":"'2 Indicadores'!C208","v":{"v":0,"d":"0.00"}},null,null,0.7]
[{"$nulls":13},"9.Comercialização & Inovação",null,null,{"$f":"'2 Indicadores'!C228","v":{"v":0,"d":"0.00"}},null,null,0.7]
[{"$nulls":12},"Aspectos ambientais","10.Gerenciamento de resíduos",null,null,{"$f":"'2 Indicadores'!C248","v":{"v":0.7,"d":"0.70"}},null,null,0.7]
[{"$nulls":13},"11.Segurança do trabalho",null,null,{"$f":"'2 Indicadores'!C259","v":{"v":0.7,"d":"0.70"}},null,null,0.7]
[{"$nulls":13},"12. Qualidade do solo",null,null,{"$f":"'2 Indicadores'!C295","v":{"v":0,"d":"0.00"}},null,null,0.7]
[{"$nulls":13},"13. Qualidade da água",null,null,{"$f":"'2 Indicadores'!C343","v":{"v":0,"d":"0.00"}},null,null,0.7]
[{"$nulls":13},"14.Risco de contaminação - água",null,null,{"$f":"'2 Indicadores'!C379","v":{"v":1,"d":"1.00"}},null,null,0.7]
[{"$nulls":13},"15. Erosão do solo",null,null,{"$f":"'2 Indicadores'!C390","v":{"v":0.7,"d":"0.70"}},null,null,0.7]
[{"$nulls":13},"16.Conservação solo e água",null,null,{"$f":"'2 Indicadores'!C407","v":""},null,null,0.7]
[{"$nulls":13},"17.Conservação estradas",null,null,{"$f":"'2 Indicadores'!C424","v":{"v":0,"d":"0.00"}},null,null,0.7]
[{"$nulls":13},"18.Vegetação nativa",null,null,{"$f":"'2 Indicadores'!C443","v":{"v":0,"d":"0.00"}},null,null,0.7]
[{"$nulls":13},"19. APPs",null,null,{"$f":"'2 Indicadores'!C454","v":{"v":0,"d":"0.00"}},null,null,0.7]
[{"$nulls":13},"20. Reserva Legal",null,null,{"$f":"'2 Indicadores'!C468","v":{"$error":"#DIV/0!"}},null,null,0.7]
[{"$nulls":13},"21.Conservação biodiversidade",null,null,{"$f":"'2 Indicadores'!C488","v":{"$error":"#DIV/0!"}},null,null,0.7]

{"sheet":"4 Plano de adequação","index":4,"n_rows":34,"n_cols":5,"rows_kept":34,"merged":[[0,3,1,3]]}
[{"$nulls":3},"PLANO DE ADEQUAÇÃO"]
[null,"ISA"]
[]
[]
[null,"PRODUTOR(A)",null,{"$f":"IF('1 Questionário'!C44=\"\",\"\",'1 Questionário'!C44)","v":""}]
[null,"MUNICÍPIO",null,{"$f":"IF('1 Questionário'!C54=\"\",\"\",'1 Questionário'!C54)","v":""}]
[null,"DATA DA APLICAÇÃO",null,{"$f":"IF('1 Questionário'!C34=\"\",\"\",'1 Questionário'!C34)","v":""}]
[]
[null,"TECHNICAL REGISTRATION",null,{"$f":"IF('1 Questionário'!C38=\"\",\"\",'1 Questionário'!C38)","v":""}]
[]
[null,"ITEM","ÍNDICE","PROPOSIÇÕES","PERÍODO DE EXECUÇÃO"]
[null,{"$f":"'3 Relatório'!N69","v":"1.Produtividade & preço de venda"},{"$f":"'3 Relatório'!Q69","v":{"v":0,"d":"0.00"}}]
[null,{"$f":"'3 Relatório'!N78","v":"10.Gerenciamento de resíduos"},{"$f":"'3 Relatório'!Q78","v":{"v":0.7,"d":"0.70"}}]
[null,{"$f":"'3 Relatório'!N79","v":"11.Segurança do trabalho"},{"$f":"'3 Relatório'!Q79","v":{"v":0.7,"d":"0.70"}}]
[null,{"$f":"'3 Relatório'!N80","v":"12. Qualidade do solo"},{"$f":"'3 Relatório'!Q80","v":{"v":0,"d":"0.00"}}]
[null,{"$f":"'3 Relatório'!N81","v":"13. Qualidade da água"},{"$f":"'3 Relatório'!Q81","v":{"v":0,"d":"0.00"}}]
[null,{"$f":"'3 Relatório'!N82","v":"14.Risco de contaminação - água"},{"$f":"'3 Relatório'!Q82","v":{"v":1,"d":"1.00"}}]
[null,{"$f":"'3 Relatório'!N83","v":"15. Erosão do solo"},{"$f":"'3 Relatório'!Q83","v":{"v":0.7,"d":"0.70"}}]
[null,{"$f":"'3 Relatório'!N84","v":"16.Conservação solo e água"},{"$f":"'3 Relatório'!Q84","v":""}]
[null,{"$f":"'3 Relatório'!N85","v":"17.Conservação estradas"},{"$f":"'3 Relatório'!Q85","v":{"v":0,"d":"0.00"}}]
[null,{"$f":"'3 Relatório'!N86","v":"18.Vegetação nativa"},{"$f":"'3 Relatório'!Q86","v":{"v":0,"d":"0.00"}}]
[null,{"$f":"'3 Relatório'!N87","v":"19. APPs"},{"$f":"'3 Relatório'!Q87","v":{"v":0,"d":"0.00"}}]
[null,{"$f":"'3 Relatório'!N70","v":"2.Diversificação da renda"},{"$f":"'3 Relatório'!Q70","v":{"$error":"#DIV/0!"}}]
[null,{"$f":"'3 Relatório'!N88","v":"20. Reserva Legal"},{"$f":"'3 Relatório'!Q88","v":{"$error":"#DIV/0!"}}]
[null,{"$f":"'3 Relatório'!N89","v":"21.Conservação biodiversidade"},{"$f":"'3 Relatório'!Q89","v":{"$error":"#DIV/0!"}}]
[null,{"$f":"'3 Relatório'!N71","v":"3.Evolução patrimonial"},{"$f":"'3 Relatório'!Q71","v":{"$error":"#DIV/0!"}}]
[null,{"$f":"'3 Relatório'!N72","v":"4.Grau de endividamento"},{"$f":"'3 Relatório'!Q72","v":{"$error":"#DIV/0!"}}]
[null,{"$f":"'3 Relatório'!N73","v":"5.Serviços básicos"},{"$f":"'3 Relatório'!Q73","v":{"v":0,"d":"0.00"}}]
[null,{"$f":"'3 Relatório'!N74","v":"6.Escolaridade & Cursos"},{"$f":"'3 Relatório'!Q74","v":{"$error":"#DIV/0!"}}]
[null,{"$f":"'3 Relatório'!N75","v":"7.Emprego"},{"$f":"'3 Relatório'!Q75","v":{"v":0.7,"d":"0.70"}}]
[null,{"$f":"'3 Relatório'!N76","v":"8.Gestão "},{"$f":"'3 Relatório'!Q76","v":{"v":0,"d":"0.00"}}]
[null,{"$f":"'3 Relatório'!N77","v":"9.Comercialização & Inovação"},{"$f":"'3 Relatório'!Q77","v":{"v":0,"d":"0.00"}}]
[null,"Regularização ambiental do empreendimento",{"$f":"'1 Questionário'!E129","v":{"v":0,"d":"0.00"}}]
[null,"Regularização do uso da água",{"$f":"'1 Questionário'!E127","v":{"v":0,"d":"0.00"}}]

{"sheet":"Plan1","index":5,"n_rows":0,"n_cols":0,"rows_kept":0,"hidden":true}

{"sheet":"Sheet3","index":6,"n_rows":0,"n_cols":0,"rows_kept":0,"hidden":true}

{"sheet":"Sheet4","index":7,"n_rows":0,"n_cols":0,"rows_kept":0,"hidden":true}

{"sheet":"Sheet5","index":8,"n_rows":0,"n_cols":0,"rows_kept":0,"hidden":true}

{"sheet":"Sheet6","index":9,"n_rows":0,"n_cols":0,"rows_kept":0,"hidden":true}

{"sheet":"Relatório de Assist (2)","index":10,"n_rows":48,"n_cols":19,"rows_kept":48,"hidden":true,"merged":[[0,11,0,16],[4,6,4,13],[4,15,4,16],[5,5,5,9],[5,12,5,16],[7,8,7,16],[8,8,8,16],[10,2,37,15],[38,2,38,15],[39,2,39,15],[40,2,40,15],[42,1,42,16],[45,2,45,4],[45,6,45,9],[45,11,45,15],[46,2,46,4],[46,11,46,15]]}
[{"$nulls":11},"RELATÓRIO DE ASSISTÊNCIA   TÉCNICA AO PRODUTOR RURAL ",{"$nulls":5},{"$f":"C9","v":"Visita N°"},{"$f":"D9","v":1}]
[]
[{"$nulls":10}," Formulário atualizado em: UPEC–05/01/2012"]
[]
[null,"  Produtor:",{"$nulls":12},"CPF:"]
[null,"  Município:",{"$nulls":8},"Comunidade:"]
[null,"  Convênio: ",{"$nulls":7}," META:",null," Nº Convênio:"]
[null,"  Nome  do Técnico / Matrícula:"]
[null,null,"Visita N°",1]
[{"$nulls":6},"ORIENTAÇÃO TÉCNICA (Situação Atual, Orientações e Recomendações) "]
{"$rows_empty":32}
[null,"Assinaturas"]
[]
[]
[]
[null,null,"Data",{"$nulls":5},"Técnico Responsável / Nº Conselho",null,null," Produtor"]
[null,"MOD.230-07 E MAPA/EMBRAPA",{"$nulls":9}," Formulário atualizado em: UPEC–13/03/2013"]

{"sheet":"Fórmulas","index":11,"n_rows":601,"n_cols":14,"rows_kept":601,"merged":[[0,1,1,2],[0,3,1,5],[3,1,3,12],[5,1,5,3],[5,5,5,7],[6,1,6,2],[6,5,7,7],[7,1,8,2],[7,3,8,3],[9,1,9,2],[10,1,10,2],[18,7,19,7],[19,1,20,1],[19,2,19,3],[20,2,20,3],[30,1,30,2],[30,5,30,7],[37,1,37,2],[37,5,37,8],[49,1,49,2],[49,4,49,5],[49,8,49,9],[50,1,50,2],[50,4,50,5],[50,8,50,9],[51,1,51,2],[51,4,51,5],[51,8,51,9],[52,1,52,2],[52,4,52,5],[52,8,52,9],[53,1,53,2],[53,4,53,5],[53,8,53,9],[54,1,54,2],[54,4,54,5],[54,8,54,9],[55,4,55,5],[56,1,56,2],[56,4,56,5],[56,9,56,10],[58,9,58,10],[59,9,59,10],[60,9,60,10],[61,9,61,10],[62,9,62,10],[63,9,63,10],[64,9,64,10],[64,11,64,12],[66,1,66,2],[66,5,66,8],[75,1,75,2],[75,5,75,8],[85,1,85,2],[85,5,85,8],[92,1,92,2],[92,5,92,10],[93,5,93,10],[102,1,102,2],[102,5,102,7],[103,5,104,7],[115,1,115,2],[126,1,126,2],[126,5,126,7],[134,1,134,2],[134,5,134,8],[153,1,153,2],[153,5,153,7],[154,5,155,7],[159,1,159,5],[160,1,160,4],[160,5,161,5],[160,7,160,9],[161,7,161,8],[162,7,162,8],[163,7,163,8],[164,7,164,8],[168,1,168,10],[169,1,173,1],[169,2,169,3],[169,4,169,5],[169,6,173,6],[169,7,169,8],[169,9,169,10],[174,1,178,1],[174,4,174,5],[174,6,178,6],[174,7,174,8],[174,9,174,10],[181,1,181,5],[182,1,182,4],[182,5,183,5],[191,0,191,13],[192,0,195,0],[192,1,192,2],[192,3,192,4],[192,5,192,6],[192,7,195,7],[192,8,192,9],[192,10,192,11],[192,12,192,13],[196,0,199,0],[196,1,196,2],[196,3,196,4],[196,5,196,6],[196,7,199,7],[196,8,196,9],[196,10,196,11],[196,12,196,13],[204,1,204,2],[204,4,204,10],[205,7,205,8],[205,9,205,10],[214,1,214,2],[214,4,214,10],[215,7,215,8],[215,9,215,10],[223,1,223,2],[223,4,223,10],[224,7,224,8],[224,9,224,10],[232,1,232,2],[232,4,232,8],[240,1,240,2],[240,4,240,8],[248,1,248,2],[248,4,248,8],[256,1,256,2],[256,4,256,8],[257,4,257,5],[257,6,257,8],[288,1,288,5],[288,6,288,9],[289,6,289,7],[289,8,289,9],[290,6,292,7],[290,8,292,9],[297,1,297,5],[297,6,297,9],[298,6,298,7],[298,8,298,9],[299,3,299,5],[299,6,303,7],[299,8,303,9],[306,1,306,5],[306,6,306,9],[307,1,307,2],[307,3,307,4],[307,6,307,7],[307,8,307,9],[308,1,308,2],[308,3,308,4],[308,6,311,7],[308,8,311,9],[309,1,309,2],[309,3,309,4],[314,1,314,5],[314,6,314,9],[315,1,315,2],[315,3,315,4],[315,6,315,7],[315,8,315,9],[316,1,316,2],[316,3,316,4],[316,6,318,7],[316,8,318,9],[317,1,317,2],[317,3,317,4],[321,1,321,5],[322,1,325,5],[327,1,327,3],[328,1,329,3],[331,1,331,2],[331,4,331,7],[332,4,332,7],[333,4,333,7],[338,1,338,2],[338,4,338,7],[339,4,339,5],[339,6,339,7],[340,4,343,5],[340,6,343,7],[345,1,345,2],[345,4,345,7],[346,4,346,5],[346,6,346,7],[347,4,351,5],[347,6,351,7],[353,1,353,3],[353,5,353,11],[354,1,355,3],[354,5,355,11],[357,1,357,2],[359,4,359,12],[364,1,364,13],[390,1,390,2],[391,1,391,2],[392,1,392,2],[393,1,393,2],[394,1,394,2],[395,1,395,2],[397,1,397,2],[398,1,398,2],[399,1,399,2],[400,1,400,2],[401,1,401,2],[402,1,402,2],[403,1,403,2],[404,1,404,2],[405,1,405,2],[406,1,406,2],[407,1,407,2],[408,1,408,2],[411,1,411,2],[412,1,412,2],[413,1,413,2],[414,1,414,2],[416,1,416,2],[419,1,419,2],[420,1,420,2],[421,1,421,2],[422,1,422,2],[423,1,423,2],[424,1,424,2],[426,1,426,2],[427,1,427,2],[428,1,428,2],[429,1,429,2],[430,1,430,2],[431,1,431,2],[432,1,432,2],[433,1,433,2],[434,1,434,2],[435,1,435,2],[436,1,436,2],[437,1,437,2],[440,1,440,2],[441,1,441,2],[442,1,442,2],[443,1,443,2],[445,1,445,2],[447,1,447,2],[448,1,448,2],[449,1,449,2],[450,1,450,2],[451,1,451,2],[452,1,452,2],[454,1,454,2],[455,1,455,2],[456,1,456,2],[457,1,457,2],[458,1,458,2],[459,1,459,2],[460,1,460,2],[461,1,461,2],[462,1,462,2],[463,1,463,2],[464,1,464,2],[465,1,465,2],[468,1,468,2],[469,1,469,2],[470,1,470,2],[471,1,471,2],[473,1,473,2],[475,1,475,2],[476,1,476,2],[477,1,477,2],[478,1,478,2],[479,1,479,2],[480,1,480,2],[481,1,481,2],[482,1,482,2],[486,1,486,2],[486,4,486,5],[499,4,501,11],[503,1,503,2],[503,4,503,8],[507,1,508,1],[507,2,508,2],[508,4,508,7],[515,1,515,2],[515,4,515,9],[523,1,523,6],[523,10,523,13],[524,1,525,6],[524,10,524,12],[525,10,525,12],[526,10,526,12],[529,10,529,13],[530,10,530,12],[531,10,531,12],[532,10,532,12],[533,10,533,12],[534,1,536,1],[534,2,536,2],[534,3,536,5],[534,10,534,12],[535,10,535,12],[536,10,536,12],[538,1,538,2],[540,1,541,11],[542,1,543,11],[544,1,545,11],[547,1,547,3],[547,4,547,5],[548,1,548,3],[548,4,548,5],[551,1,551,3],[551,5,551,8],[552,1,552,2],[553,1,553,2],[556,1,556,5],[559,1,559,3],[559,5,559,8],[560,1,560,2],[561,1,561,2],[562,1,562,2],[563,1,563,2],[564,1,564,3],[565,1,565,4],[572,1,572,4],[572,8,572,10],[573,1,573,4],[573,8,573,10],[574,1,574,4],[575,1,575,4],[576,1,576,4],[579,1,579,2],[585,1,585,2],[589,7,589,8],[590,7,590,11],[592,5,592,6],[593,4,593,6],[597,5,597,6],[600,7,600,8]]}
[null,"ISA",null,"FÓRMULAS"]
[]
[]
[null,"INDICADORES"]
[]
[1,"Fator de Ponderação\t\t",{"$nulls":3},"Fórmulas\t\t\t\t"]
[null,"> 20%",null,0.9,null,"Fórmula (R parcial) = Yo + ax",{"$nulls":3},"UNIDADES I",null,"UNIDADES II"]
[null,"produtividade ou preço de venda = a regional\t\n\t",null,0.7,{"$nulls":5},"Algodão",null,"Sc/ha"]
[{"$nulls":5},"yo",{"v":-0.3,"d":"-0.30"},null,null,"Arroz",null,"Ton./ha"]
[null,"< 20%",null,0.5,null,"a",0.01,null,null,"Avicultura",null,"Kg/ha"]
[null,"< 40%",null,0.3,null,{"$f":"IF(ISBLANK('2 Indicadores'!D17),\"\",(G9+G10*(100+(Fórmulas!E17*100))))","v":""},{"$f":"IF(ISBLANK('2 Indicadores'!E17),\"\",(G9+G10*(100+(Fórmulas!F17*100))))","v":""},{"$f":"IF(ISBLANK('2 Indicadores'!F17),\"\",(G9+G10*(100+(Fórmulas!G17*100))))","v":""},null,"Batata",null," @/ha/ano"]
[{"$nulls":5},{"$f":"IF(ISBLANK('2 Indicadores'!D18),\"\",(G9+G10*(100+(Fórmulas!E18*100))))","v":""},{"$f":"IF(ISBLANK('2 Indicadores'!E18),\"\",(G9+G10*(100+(Fórmulas!F18*100))))","v":""},{"$f":"IF(ISBLANK('2 Indicadores'!F18),\"\",(G9+G10*(100+(Fórmulas!G18*100))))","v":""},null,"Café",null,"L de leite/ha/ano"]
[{"$nulls":9},"Cana de açúcar",null,"L de leite/vaca/dia"]
[{"$nulls":5},{"$f":"AVERAGE(Fórmulas!E20:G21)","v":{"$error":"#DIV/0!"}},{"$nulls":3},"Floricultura",null,"Kg/dia"]
[{"$nulls":5},{"$f":"IF('3 Relatório'!K39<300,Fórmulas!F14*0.7,Fórmulas!F14)","v":{"$error":"#DIV/0!"}},{"$f":"IF(F15<0,0,F15)","v":{"$error":"#DIV/0!"}},null,null,"Fruticultura",null,"Kg de alimento/kg de carne produzida"]
[{"$nulls":9},"Grãos",null,"Leitões comercializados/porca/ano"]
[null,"Variação do item 1.3 em relação ao item 1.5",null,null,{"$f":"IF('2 Indicadores'!D17>0,(('2 Indicadores'!D17/'2 Indicadores'!D19)-1),\"\")","v":""},{"$f":"IF('2 Indicadores'!E17>0,(('2 Indicadores'!E17/'2 Indicadores'!E19)-1),\"\")","v":""},{"$f":"IF('2 Indicadores'!F17>0,(('2 Indicadores'!F17/'2 Indicadores'!F19)-1),\"\")","v":""},{"v":1,"d":"1.0"},null,"Hortaliças",null,"Ovos/galinha/ano"]
[null,"Variação do item 1.4 em relação ao item 1.6",null,null,{"$f":"IF('2 Indicadores'!D18>0,(('2 Indicadores'!D18/'2 Indicadores'!D20)-1),\"\")","v":""},{"$f":"IF('2 Indicadores'!E18>0,(('2 Indicadores'!E18/'2 Indicadores'!E20)-1),\"\")","v":""},{"$f":"IF('2 Indicadores'!F18>0,(('2 Indicadores'!F18/'2 Indicadores'!F20)-1),\"\")","v":""},{"v":1,"d":"1.0"},null,"Milho",null,"Conversão Alimentar/dúzia de ovos"]
[{"$nulls":4},{"v":1,"d":"1.0"},{"v":1,"d":"1.0"},{"v":1,"d":"1.0"},"Matriz de ponderação\t",null,"Óleo de palma",null,"Conversão Alimentar/Kg"]
[null,"Resultado parcial","Produtividade\t",null,{"$f":"IF(ISBLANK('2 Indicadores'!D17),\"\",IF(Fórmulas!F11>1,1,Fórmulas!F11))","v":""},{"$f":"IF(ISBLANK('2 Indicadores'!E17),\"\",IF(Fórmulas!G11>1,1,Fórmulas!G11))","v":""},{"$f":"IF(ISBLANK('2 Indicadores'!F17),\"\",IF(Fórmulas!H11>1,1,Fórmulas!H11))","v":""},null,null,"Outros",null,"Percentagem de postura"]
[null,null,"Preço de venda\t",null,{"$f":"IF(ISBLANK('2 Indicadores'!D18),\"\",IF(Fórmulas!F12>1,1,Fórmulas!F12))","v":""},{"$f":"IF(ISBLANK('2 Indicadores'!E18),\"\",IF(Fórmulas!G12>1,1,Fórmulas!G12))","v":""},{"$f":"IF(ISBLANK('2 Indicadores'!F18),\"\",IF(Fórmulas!H12>1,1,Fórmulas!H12))","v":""},null,null,"Ovos"]
[{"$nulls":9},"Pecuária"]
[{"$nulls":9},"Pecuária de corte"]
[{"$nulls":9},"Pecuária de leite"]
[{"$nulls":9},"Pisicultura"]
[{"$nulls":9},"Silvicultura"]
[{"$nulls":9},"Soja"]
[{"$nulls":9},"Suínocultura"]
[{"$nulls":9},"Trigo"]
[]
[2,"Fator de Ponderação\t\t",{"$nulls":3},"Fórmulas\t\t\t\t",{"$nulls":4},0.3]
[null,"item 2.3","1 - (F362 *0,3)",null,null,{"$f":"1-(('2 Indicadores'!F40^2*Fórmulas!K31)+('2 Indicadores'!F41^2*Fórmulas!K32)+('2 Indicadores'!F42^2*Fórmulas!K33)+('2 Indicadores'!F43^2*Fórmulas!K34))","v":{"$error":"#DIV/0!"}},{"$f":"IF(AND('2 Indicadores'!F40>80%,'2 Indicadores'!F44=\"sim\"),F32-10%,F32)","v":{"$error":"#DIV/0!"}},{"$f":"IF(Fórmulas!G32<0.1,0.1,Fórmulas!G32)","v":{"$error":"#DIV/0!"}},null,null,0.3]
[null,"item 2.3","1 - (F372 *0,3)",{"$nulls":7},{"v":1,"d":"1.0"}]
[null,"item 2.3","1 - (F382 *1)",{"$nulls":7},{"v":2,"d":"2.0"}]
[null,"item 2.3","1 - (F392 *2)"]
[]
[]
[3,"Fator de Ponderação\t\t",{"$nulls":3},"Fórmulas",{"$nulls":4},{"$f":"+Fórmulas!M38","v":{"$error":"#DIV/0!"}},null,{"$f":"(+(Fórmulas!E57-Fórmulas!J57)/('2 Indicadores'!C102-'2 Indicadores'!D102))","v":{"$error":"#DIV/0!"}}]
[null,"item 3.1",0.67,null,null,{"$f":"(Fórmulas!M38*'2 Indicadores'!G107+Fórmulas!M39*'2 Indicadores'!G108+Fórmulas!M40*'2 Indicadores'!G109+Fórmulas!M41*'2 Indicadores'!G110+Fórmulas!M42*'2 Indicadores'!G111)","v":{"$error":"#DIV/0!"}},{"$f":"IF('2 Indicadores'!F113>26%,F39*((1+('2 Indicadores'!F113-0.26))),F39)","v":{"$error":"#DIV/0!"}},{"$f":"IF('2 Indicadores'!F112>0,G39,1-(0.3-10*'2 Indicadores'!F112))","v":{"$error":"#DIV/0!"}},{"$f":"IF(H39<0,0,H39)","v":{"$error":"#DIV/0!"}},null,{"$f":"+Fórmulas!M39","v":{"$error":"#DIV/0!"}},null,{"$f":"('2 Indicadores'!$D$61-'2 Indicadores'!$E$61)/('2 Indicadores'!$C$102-'2 Indicadores'!$D$102)","v":{"$error":"#DIV/0!"}}]
[null,"item 3.2",{"v":1,"d":"1.00"},{"$nulls":7},{"$f":"+Fórmulas!M40","v":{"$error":"#DIV/0!"}},null,{"$f":"('2 Indicadores'!$D$71-'2 Indicadores'!$E$71)/('2 Indicadores'!$C$102-'2 Indicadores'!$D$102)","v":{"$error":"#DIV/0!"}}]
[null,"item 3.3",{"v":1,"d":"1.00"},{"$nulls":7},{"$f":"+Fórmulas!M41","v":{"$error":"#DIV/0!"}},null,{"$f":"('2 Indicadores'!$D$77-'2 Indicadores'!$F$77)/('2 Indicadores'!$C$102-'2 Indicadores'!$D$102)","v":{"$error":"#DIV/0!"}}]
[null,"item 3.4",{"v":1,"d":"1.00"}]
[null,"UNIDADES III",{"$nulls":10},{"$f":"M42+M41+M40+M39+M38","v":{"$error":"#DIV/0!"}}]
[null,"Aspersão",{"$nulls":7},"Verificação",{"$f":"SUM(Fórmulas!M38:M42)","v":{"$error":"#DIV/0!"}}]
[null,"Gotejamento/microaspersão"]
[null,"Pivô central"]
[null,"Outras categorias",null,"Item 3.2"]
[null,"Diversos tipos de irrigação",null,"Fórmula - VR(valor residual) = (1-T)N x VI, em que: T = taxa de depreciação; N = tempo (nº de anos); e VI = valor inicial"]
[{"$nulls":12},"UNIDADES IV"]
[null,"Categorias\t",null,"Ponderação","Valor total atual\t",null,"Área total","Ponderação","Valor histórico\t",null,"Área total (%)",null,"Estoque de grãos"]
[null,"Vegetação nativa e outros\t",null,{"v":1,"d":"1.00"},{"$f":"('2 Indicadores'!C98*D51)*G51*('3 Relatório'!$H$5)","v":{"$error":"#DIV/0!"}},null,{"$f":"'1 Questionário'!E90+'1 Questionário'!E91+'1 Questionário'!E92+'1 Questionário'!E93+'1 Questionário'!E94","v":{"$error":"#DIV/0!"}},{"$f":"+D51","v":{"v":1,"d":"1.00"}},{"$f":"(K51*H51)*'3 Relatório'!H5*'2 Indicadores'!D98","v":{"$error":"#DIV/0!"}},null,{"$f":"+('2 Indicadores'!D90+'2 Indicadores'!D89+'2 Indicadores'!D91+'2 Indicadores'!D92+'2 Indicadores'!D93)/'2 Indicadores'!D94","v":{"$error":"#DIV/0!"}},null,"Bovinos"]
[null,"Pastagens\t",null,{"v":1,"d":"1.00"},{"$f":"('2 Indicadores'!C98*D52)*G52*('3 Relatório'!$H$5)","v":{"$error":"#DIV/0!"}},null,{"$f":"'1 Questionário'!E88","v":{"$error":"#DIV/0!"}},{"$f":"+D52","v":{"v":1,"d":"1.00"}},{"$f":"(K52*H52)*'3 Relatório'!H5*'2 Indicadores'!D98","v":{"$error":"#DIV/0!"}},null,{"$f":"+'2 Indicadores'!D87/'2 Indicadores'!D94","v":{"$error":"#DIV/0!"}},null,"Equinos/Moares"]
[null,"Lavoura temporária\t",null,{"v":1,"d":"1.00"},{"$f":"('2 Indicadores'!C98*D53)*G53*('3 Relatório'!$H$5)","v":{"$error":"#DIV/0!"}},null,{"$f":"'1 Questionário'!E87","v":{"$error":"#DIV/0!"}},{"$f":"+D53","v":{"v":1,"d":"1.00"}},{"$f":"K53*'3 Relatório'!H5*('2 Indicadores'!D98*H53)","v":{"$error":"#DIV/0!"}},null,{"$f":"+'2 Indicadores'!D86/'2 Indicadores'!D94","v":{"$error":"#DIV/0!"}},null,"Suínos"]
[null,"Irrigação  (R$1.000,00/ha)",null,{"v":5000,"d":"5,000.00"},{"$f":"+'3 Relatório'!H5*G54*D54","v":{"$error":"#DIV/0!"}},null,{"$f":"'2 Indicadores'!C81/'3 Relatório'!H5","v":{"$error":"#DIV/0!"}},{"$f":"+D54","v":{"v":5000,"d":"5,000.00"}},{"$f":"+'3 Relatório'!H5*K54*H54","v":{"$error":"#DIV/0!"}},null,{"$f":"+'2 Indicadores'!D81/'3 Relatório'!H5","v":{"$error":"#DIV/0!"}},null,"Caprinos/Ovinos"]
[null,"Lav. perene/silvicutura\t",null,{"v":1,"d":"1.00"},{"$f":"('2 Indicadores'!C98*D55)*G55*('3 Relatório'!$H$5)","v":{"$error":"#DIV/0!"}},null,{"$f":"'1 Questionário'!E86+'1 Questionário'!E89","v":{"$error":"#DIV/0!"}},{"$f":"+D55","v":{"v":1,"d":"1.00"}},{"$f":"K55*'3 Relatório'!H5*('2 Indicadores'!D98*H55)","v":{"$error":"#DIV/0!"}},null,{"$f":"+('2 Indicadores'!D85+'2 Indicadores'!D88)/'2 Indicadores'!D94","v":{"$error":"#DIV/0!"}},null,"Aves"]
[{"$nulls":6},{"$f":"+G55+G53+G52+G51","v":{"$error":"#DIV/0!"}},null,null,"Histórico ",{"$f":"+K55+K53+K52+K51","v":{"$error":"#DIV/0!"}},null,"Outros"]
[null,"Valor Total da terra\t",null,null,{"$f":"E51+E52+E53+E54+E55","v":{"$error":"#DIV/0!"}},null,null,"",null,{"$f":"I51+I52+I53+I54+I55","v":{"$error":"#DIV/0!"}}]
[]
[null,"Evolução decorrente da modificação do uso do solo",{"$nulls":5},{"$f":"J59/'2 Indicadores'!C102","v":{"$error":"#DIV/0!"}},null,{"$f":"(((Fórmulas!G53-Fórmulas!K53)*'3 Relatório'!H5*'2 Indicadores'!C98*1.1)+((Fórmulas!G54-Fórmulas!K54)*'3 Relatório'!H5*('2 Indicadores'!C98+1000))+((Fórmulas!G55-Fórmulas!K55)*'3 Relatório'!H5*'2 Indicadores'!C98*1.3))","v":{"$error":"#DIV/0!"}}]
[{"$nulls":9},{"$f":"('2 Indicadores'!$C$98*Fórmulas!D51)*Fórmulas!K51*'3 Relatório'!$H$5","v":{"$error":"#DIV/0!"}}]
[null,"Evolução patrimonial (sem a valorização do preço da terra)",{"$nulls":5},{"$f":"IF('2 Indicadores'!D102>0,('2 Indicadores'!C102/L65-1),\"\")","v":{"$error":"#DIV/0!"}},null,{"$f":"('2 Indicadores'!$C$98*Fórmulas!D52)*Fórmulas!K52*'3 Relatório'!$H$5","v":{"$error":"#DIV/0!"}}]
[{"$nulls":9},{"$f":"('2 Indicadores'!$C$98*Fórmulas!D53)*Fórmulas!K53*'3 Relatório'!$H$5","v":{"$error":"#DIV/0!"}}]
[null,"Evolução patrimonial total ",{"$nulls":5},{"$f":"IF('2 Indicadores'!C102>0,('2 Indicadores'!C102/'2 Indicadores'!D102-1),\"\")","v":{"$error":"#DIV/0!"}},null,{"$f":"Fórmulas!I54","v":{"$error":"#DIV/0!"}}]
[{"$nulls":9},{"$f":"('2 Indicadores'!$C$98*Fórmulas!D55)*Fórmulas!K55*'3 Relatório'!$H$5","v":{"$error":"#DIV/0!"}}]
[{"$nulls":9},{"$f":"SUM(J60:K64)","v":{"$error":"#DIV/0!"}},null,{"$f":"+J65+'2 Indicadores'!E61+'2 Indicadores'!E71+'2 Indicadores'!F77","v":{"$error":"#DIV/0!"}}]
[]
[4,"Fator de Ponderação\t",{"$nulls":3},"Fórmulas"]
[null,{"v":0,"d":"0%"},0.7,null,null,{"$f":"IF('2 Indicadores'!E121=0,0.7,0)","v":{"$error":"#DIV/0!"}},{"$f":"SUM(F68:F71)","v":{"$error":"#DIV/0!"}}]
[null,"0-7,5%","y = 0,04x + 0,7",null,null,{"$f":"IF('2 Indicadores'!E121>0,G69,0)","v":{"$error":"#DIV/0!"}},{"$f":"IF('2 Indicadores'!E121>=0.075,0,H69)","v":{"$error":"#DIV/0!"}},{"$f":"0.04*('2 Indicadores'!E121*100)+0.7","v":{"$error":"#DIV/0!"}}]
[null,"7,5-30%","y = -0,04x + 1,3",null,null,{"$f":"IF('2 Indicadores'!E121>=0.075,G70,0)","v":{"$error":"#DIV/0!"}},{"$f":"IF('2 Indicadores'!E121>0.3,0,H70)","v":{"$error":"#DIV/0!"}},{"$f":"-0.04*('2 Indicadores'!E121*100)+1.3","v":{"$error":"#DIV/0!"}}]
[null,"15-30%","y = -0,4x + 1,29",null,null,{"$f":"IF('2 Indicadores'!E121>0.3,0.1,0)","v":{"$error":"#DIV/0!"}}]
[null,">30%",0.1]
[null,">25%",0.1]
[]
[]
[5,"Fator de Ponderação\t\t",{"$nulls":3},"Fórmulas"]
[null,"Água",{"v":1,"d":"1.0"},null,null,{"$f":"IF(G77>0,1,0)","v":0},{"$f":"+'2 Indicadores'!D137+'2 Indicadores'!D134+'2 Indicadores'!D133+'2 Indicadores'!D132+'2 Indicadores'!D131*I77+'2 Indicadores'!D138+'2 Indicadores'!D135+'2 Indicadores'!D136","v":0},{"$f":"(('2 Indicadores'!D131*I77+'2 Indicadores'!D132+'2 Indicadores'!D133+'2 Indicadores'!D134+'2 Indicadores'!D135+'2 Indicadores'!D136+'2 Indicadores'!D137+'2 Indicadores'!D138)+('2 Indicadores'!E131*I77+'2 Indicadores'!E132+'2 Indicadores'!E133+'2 Indicadores'!E134+'2 Indicadores'!E135+'2 Indicadores'!E136+'2 Indicadores'!E137+'2 Indicadores'!E138))/H79","v":0},1,null,1]
[null,"Eletricidade",{"v":1,"d":"1.0"},null,null,{"$f":"IF(G78>0,1,0)","v":0},{"$f":"+'2 Indicadores'!E137+'2 Indicadores'!E134+'2 Indicadores'!E133+'2 Indicadores'!E132+'2 Indicadores'!E131*I77+'2 Indicadores'!E138+'2 Indicadores'!E135+'2 Indicadores'!E136","v":0},{"$f":"+F80+F79+F78+F77","v":0},null,null,0.5]
[null,"Estrada",{"v":1,"d":"1.0"},{"$nulls":4},{"$f":"IF(H78=0,1,H78)","v":{"v":1,"d":"1.00"}},null,null,0]
[null,"Saúde",{"v":1,"d":"1.0"}]
[null,"Transporte",{"v":1,"d":"1.0"}]
[null,"Segurança",{"v":1,"d":"1.0"}]
[null,"Internet\t",{"v":1,"d":"1.0"}]
[null,"Coleta de lixo",{"v":1,"d":"1.0"}]
[]
[null,"Fator de Ponderação\t\t",{"$nulls":3},"Fórmulas"]
[null,"Hortaliças",{"v":1,"d":"1.0"},null,null,{"$f":"IF(G87>0,1,0)","v":0},{"$f":"'2 Indicadores'!D144+'2 Indicadores'!D145+'2 Indicadores'!D146","v":0}]
[null,"Pomar",{"v":1,"d":"1.0"},null,null,{"$f":"IF(G88>0,1,0)","v":0},{"$f":"'2 Indicadores'!E144+'2 Indicadores'!E145+'2 Indicadores'!E146","v":0}]
[null,"Leite, ovos, carne",{"v":1,"d":"1.0"},null,null,{"$f":"IF(('2 Indicadores'!D144+'2 Indicadores'!D145+'2 Indicadores'!D146)=0,0,(('2 Indicadores'!D144+'2 Indicadores'!D145+'2 Indicadores'!D146)+('2 Indicadores'!E144+'2 Indicadores'!E145+'2 Indicadores'!E146))/F90)","v":0}]
[{"$nulls":5},{"$f":"SUM(F87:F88)","v":0}]
[]
[]
[6,"Fator de Ponderação\t\t",{"$nulls":3},"Fórmulas"]
[null,{"$f":"+'2 Indicadores'!B155:C155","v":"Menos de 9 anos de estudo\t"},0.7,null,null,"Fórmula: limiar de sustentabilidade (0,7) => adultos com no mínimo 5 anos de escolaridade (equivalente a 4 anos na grade escolar antiga) e crianças na rede de ensino. Cursos de capacitação direcionados para a atividade e mão de obra qualificada => acréscimo máx. 0,3 nota final\t\t\t\t\t\n\t\t\t\t\t\n\t\t\t\t\t\n\t\t\t\t\t\t\n\t\t"]
[null,{"$f":"+'2 Indicadores'!B156:C156","v":"Ensino Fundamental completo\t"},{"v":1,"d":"1.0"},null,null,{"$f":"IF('2 Indicadores'!D154>0,((('2 Indicadores'!D155*'2 Indicadores'!F155+'2 Indicadores'!D156*'2 Indicadores'!F156+'2 Indicadores'!D157*'2 Indicadores'!F157+'2 Indicadores'!D158*'2 Indicadores'!F158))*0.7),0)","v":0},{"$f":"IF('2 Indicadores'!D154>0,(('2 Indicadores'!D162*'2 Indicadores'!F162+'2 Indicadores'!D163*'2 Indicadores'!F163))*0.3,0)","v":0},{"$f":"+'2 Indicadores'!D154+'2 Indicadores'!E154","v":0},{"$f":"IF('2 Indicadores'!D168>0,(('2 Indicadores'!D169*'2 Indicadores'!F169)*0.7),0)","v":0},null,{"$f":"I97+G97","v":{"$error":"#DIV/0!"}}]
[null,{"$f":"+'2 Indicadores'!B157:C157","v":"Ensino Médio completo\t"},1.2,null,null,{"$f":"IF('2 Indicadores'!E154>0,((('2 Indicadores'!E155*'2 Indicadores'!F155+'2 Indicadores'!E156*'2 Indicadores'!F156+'2 Indicadores'!E157*'2 Indicadores'!F157+'2 Indicadores'!E158*'2 Indicadores'!F158))*0.7),0)","v":0},{"$f":"IF('2 Indicadores'!E154>0,(('2 Indicadores'!E162*'2 Indicadores'!F162+'2 Indicadores'!E163*'2 Indicadores'!F163))*0.3,0)","v":0},{"$f":"+'2 Indicadores'!D168+'2 Indicadores'!E168","v":0},{"$f":"IF('2 Indicadores'!E168>0,(('2 Indicadores'!E169*'2 Indicadores'!F169))*0.7,0)","v":0},null,{"$f":"K95","v":{"$error":"#DIV/0!"}}]
[null,{"$f":"+'2 Indicadores'!B158:C158","v":"Curso superior\t"},1.5,null,null,{"$f":"(F95+F96)/H95","v":{"$error":"#DIV/0!"}},{"$f":"(G95+G96)/H95","v":{"$error":"#DIV/0!"}},{"$f":"(I95+I96)/H96","v":{"$error":"#DIV/0!"}},{"$f":"IF(OR('2 Indicadores'!D168>0,'2 Indicadores'!E168>0),((H97+F97)/2),F97)","v":{"$error":"#DIV/0!"}}]
[null,{"$f":"+'2 Indicadores'!B162:C162","v":"Capacitação curta temporada\t"},0.5]
[null,{"$f":"+'2 Indicadores'!B163:C163","v":"Capacitação longa temporada"},0.8]
[null,{"$f":"+'2 Indicadores'!B169:C169","v":"Frequenta rede de ensino \t"},{"v":1,"d":"1.0"}]
[]
[]
[7,"Fator de Ponderação\t\t",{"$nulls":3},"Formulas"]
[null,{"$f":"+'2 Indicadores'!B178:D178","v":"Registro de funcionários (carteira de trabalho)\t\t"},{"v":1,"d":"1.0"},null,null,"Fórmula: = 0,7 se houver o cumprimento da lei referente ao registro e pagamento de hora extra de todos os funcionários; auxílios e benefícios acréscimo - máx.0,3 \t\t\n\t\t"]
[null,{"$f":"+'2 Indicadores'!B179:D179","v":"Pagamento de hora extra / banco de horas / ausência de hora extra\t\t\t\t"},{"v":1,"d":"1.0"}]
[null,{"$f":"+'2 Indicadores'!B184:D184","v":"Acima de 1 salário mínimo\t\t"},{"v":1,"d":"1.0"},null,null,{"$f":"IF('2 Indicadores'!E177>0,((('2 Indicadores'!E178*'2 Indicadores'!$G$178+'2 Indicadores'!E179*'2 Indicadores'!$G$179)/('2 Indicadores'!E177*2))*0.7),0.7)","v":{"v":0.7,"d":"0.70"}},{"$f":"IF('2 Indicadores'!E177>0,(('2 Indicadores'!E184*'2 Indicadores'!$G$184+'2 Indicadores'!E185*'2 Indicadores'!$G$185+'2 Indicadores'!E186*'2 Indicadores'!$G$186+'2 Indicadores'!E187*'2 Indicadores'!$G$187+'2 Indicadores'!E188*'2 Indicadores'!$G$188+'2 Indicadores'!E189*'2 Indicadores'!$G$189+'2 Indicadores'!E190*'2 Indicadores'!$G$190+'2 Indicadores'!E191*'2 Indicadores'!$G$191)/('2 Indicadores'!E177*8)*0.3),0)","v":0},{"$f":"(F106+G106)","v":{"v":0.7,"d":"0.70"}}]
[null,{"$f":"+'2 Indicadores'!B185:D185","v":"Auxílio alimentação\t\t"},{"v":1,"d":"1.0"},null,null,{"$f":"IF('2 Indicadores'!F177>0,((('2 Indicadores'!F178*'2 Indicadores'!$G$178+'2 Indicadores'!F179*'2 Indicadores'!$G$179)/('2 Indicadores'!F177*2))*0.7),0.7)","v":{"v":0.7,"d":"0.70"}},{"$f":"IF('2 Indicadores'!F177>0,(('2 Indicadores'!F184*'2 Indicadores'!$G$184+'2 Indicadores'!F185*'2 Indicadores'!$G$185+'2 Indicadores'!F186*'2 Indicadores'!$G$186+'2 Indicadores'!F187*'2 Indicadores'!$G$187+'2 Indicadores'!F188*'2 Indicadores'!$G$188+'2 Indicadores'!F189*'2 Indicadores'!$G$189+'2 Indicadores'!F190*'2 Indicadores'!$G$190+'2 Indicadores'!F191*'2 Indicadores'!$G$191)/('2 Indicadores'!F177*8)*0.3),0)","v":0},{"$f":"(F107+G107)","v":{"v":0.7,"d":"0.70"}}]
[null,{"$f":"+'2 Indicadores'!B186:D186","v":"Auxílio moradia\t\t"},{"v":1,"d":"1.0"},null,null,{"$f":"+H106","v":{"v":0.7,"d":"0.70"}},{"$f":"IF('2 Indicadores'!F177>0,(H107+F108)/2,F108)","v":{"v":0.7,"d":"0.70"}},{"$f":"IF(SUM('2 Indicadores'!E177:F177)=0,0.7,Fórmulas!G108)","v":{"v":0.7,"d":"0.70"}}]
[null,{"$f":"+'2 Indicadores'!B187:D187","v":"Auxílio educação e transporte\t\t"},{"v":1,"d":"1.0"}]
[null,{"$f":"+'2 Indicadores'!B188:D188","v":"Participação nos lucros\t\t"},{"v":5,"d":"5.0"}]
[null,{"$f":"+'2 Indicadores'!B189:D189","v":"Seguro contra acidentes\t\t"},{"v":3,"d":"3.0"}]
[null,{"$f":"+'2 Indicadores'!B190:D190","v":"Acesso a lazer\t\t"},{"v":1,"d":"1.0"}]
[null,{"$f":"+'2 Indicadores'!B191:D191","v":"Espaço para cultivo de alimentos \t\t"},{"v":3,"d":"3.0"}]
[]
[]
[8,"Fator de Ponderação\t\t"]
[null,"Fluxi de caixa",0.5]
[null,"Custo de produção",0.5]
[null,"Assistência Técnica",{"v":1,"d":"1.0"}]
[null,"Associação",{"v":1,"d":"1.0"}]
[null,"Regularização ambiental",{"v":1,"d":"1.0"}]
[null,"Crédito investimento",0.4]
[null,"Crédito custeio",0.4]
[null,"Crédito comercialização",0.2]
[]
[]
[9,"Fator de Ponderação\t\t",{"$nulls":3},"Fórmulas"]
[null,{"$f":"+'2 Indicadores'!B213:D213","v":"Diversificação de compradores, busca de preços, preços pré-venda"},0.4,null,null,{"$f":"(G128*C128+G129*C129+G130*C130+G131*C131)","v":{"v":0,"d":"0.00"}},{"$f":"IF('2 Indicadores'!E213=\"Sim\",1,0)","v":0}]
[null,{"$f":"+'2 Indicadores'!B214:D214","v":"Produtos certificados, agrega valor, mercado institucional\t\t"},0.4,{"$nulls":3},{"$f":"IF('2 Indicadores'!E214=\"Sim\",1,0)","v":0}]
[null,{"$f":"+'2 Indicadores'!B217:D217","v":"Adoção de técnicas inovadoras*\t\t\t"},0.3,{"$nulls":3},{"$f":"IF('2 Indicadores'!E217=\"Sim\",1,0)","v":0}]
[null,{"$f":"+'2 Indicadores'!B219:D219","v":"Capacidade de inovação ou liderança na comunidade\t\t"},0.4,{"$nulls":3},{"$f":"IF('2 Indicadores'!E219=\"Sim\",1,0)","v":0}]
[]
[]
[]
[10,"Fator de Ponderação\t\t",{"$nulls":3},"Fórmulas"]
[null,"Esgoto residências",{"v":1,"d":"1.0"},null,null,{"$f":"IF(G136>1,1,G136)","v":{"$error":"#DIV/0!"}},{"$f":"IF(H136>0,I136/H136,I136)","v":{"$error":"#DIV/0!"}},{"$f":"COUNTIF('2 Indicadores'!F234:G242,\">=0\")","v":0},{"$f":"'2 Indicadores'!F234+'2 Indicadores'!F235+'2 Indicadores'!F238+'2 Indicadores'!F241+'2 Indicadores'!F242","v":{"$error":"#DIV/0!"}},null,"Não se aplica"]
[null,"Lixo",{"v":1,"d":"1.0"},null,null,{"$f":"IF('2 Indicadores'!F245=\"Sim\",Fórmulas!F136*0.7,Fórmulas!F136)","v":{"$error":"#DIV/0!"}}]
[null,"Resíduo orgânico",{"v":1,"d":"1.0"}]
[null,"Efluentes líquidos",{"v":1,"d":"1.0"}]
[null,"Efluentes gasosos",{"v":1,"d":"1.0"}]
[]
[null,"UNIDADES V",{"$nulls":3},"Fator de ponderação"]
[null,"Ausência de coleta e tratamento de esgoto",{"$nulls":3},{"v":1E-4,"d":"0.00"},{"$f":"IF('2 Indicadores'!$D$234=Fórmulas!B143,1,0)","v":0},{"$f":"G143*F143","v":0},{"$f":"IF('2 Indicadores'!$E$234=Fórmulas!B143,1,0)","v":0},{"$f":"I143*F143","v":0},{"$f":"SUM(G143:G147)","v":0},{"$f":"SUM(I143:I147)","v":0},{"$f":"L143+K143","v":0}]
[null,"Fossa rudimentar; fossa negra sem revestimento\t",{"$nulls":3},0.25,{"$f":"IF('2 Indicadores'!$D$234=Fórmulas!B144,1,0)","v":0},{"$f":"G144*F144","v":0},{"$f":"IF('2 Indicadores'!$E$234=Fórmulas!B144,1,0)","v":0},{"$f":"I144*F144","v":0},{"$f":"SUM(H143:H147)","v":0},{"$f":"SUM(J143:J147)","v":0},{"$f":"SUM(K144:L144)/M143","v":{"$error":"#DIV/0!"}}]
[null,"Fossa, filtro, sumidouro",{"$nulls":3},{"v":0.7,"d":"0.70"},{"$f":"IF('2 Indicadores'!$D$234=Fórmulas!B145,1,0)","v":0},{"$f":"G145*F145","v":0},{"$f":"IF('2 Indicadores'!$E$234=Fórmulas!B145,1,0)","v":0},{"$f":"I145*F145","v":0}]
[null,"Fossa séptica com manutenção",{"$nulls":3},{"v":0.8,"d":"0.80"},{"$f":"IF('2 Indicadores'!$D$234=Fórmulas!B146,1,0)","v":0},{"$f":"G146*F146","v":0},{"$f":"IF('2 Indicadores'!$E$234=Fórmulas!B146,1,0)","v":0},{"$f":"I146*F146","v":0}]
[null,"Fossa Biodigestora, Fossa TEVAP; separação e tratamento águas cinzas\t",{"$nulls":3},{"v":1,"d":"1.00"},{"$f":"IF('2 Indicadores'!$D$234=Fórmulas!B147,1,0)","v":0},{"$f":"G147*F147","v":0},{"$f":"IF('2 Indicadores'!$E$234=Fórmulas!B147,1,0)","v":0},{"$f":"I147*F147","v":0}]
[null,"UNIDADES VI"]
[null,"Queimado/descartado em local inapropriado",{"$nulls":3},{"v":1E-4,"d":"0.00"},{"$f":"IF('2 Indicadores'!$D$235=Fórmulas!B149,1,0)","v":0},{"$f":"G149*F149","v":0},{"$f":"IF('2 Indicadores'!$E$235=Fórmulas!B149,1,0)","v":0},{"$f":"I149*F149","v":0},{"$f":"SUM(G149:G152)","v":0},{"$f":"SUM(I149:I152)","v":0},{"$f":"L149+K149","v":0}]
[null,"Enterrado no imóvel rural",{"$nulls":3},{"v":0.3,"d":"0.30"},{"$f":"IF('2 Indicadores'!$D$235=Fórmulas!B150,1,0)","v":0},{"$f":"G150*F150","v":0},{"$f":"IF('2 Indicadores'!$E$235=Fórmulas!B150,1,0)","v":0},{"$f":"I150*F150","v":0},{"$f":"SUM(H149:H152)","v":0},{"$f":"SUM(J149:J152)","v":0},{"$f":"SUM(K150:L150)/M149","v":{"$error":"#DIV/0!"}}]
[null,"Lixo levado pelo produtor",{"$nulls":3},{"v":0.8,"d":"0.80"},{"$f":"IF('2 Indicadores'!$D$235=Fórmulas!B151,1,0)","v":0},{"$f":"G151*F151","v":0},{"$f":"IF('2 Indicadores'!$E$235=Fórmulas!B151,1,0)","v":0},{"$f":"I151*F151","v":0}]
[null,"Lixo coletado pela prefeitura",{"$nulls":3},{"v":1,"d":"1.00"},{"$f":"IF('2 Indicadores'!$D$235=Fórmulas!B152,1,0)","v":0},{"$f":"G152*F152","v":0},{"$f":"IF('2 Indicadores'!$E$235=Fórmulas!B152,1,0)","v":0},{"$f":"I152*F152","v":0}]
[]
[11,"Fator de Ponderação\t\t",{"$nulls":3},"Fórmulas"]
[null,{"$f":"+'2 Indicadores'!B253:D253","v":"Quantas pessoas fazem o manuseio de agrotóxicos\t\t"},{"v":1,"d":"1.0"},null,null,"Fórmula: 0,7, se atende todas as regras, conforme legislação ambiental vigente (EPI; armazenamento e devolução de embalagens)\t\t\n\t\t"]
[null,{"$f":"+'2 Indicadores'!B254:D254","v":"Quantas pessoas utilizam EPI adequadamente\t\t\t\t"},{"v":1,"d":"1.0"}]
[null,{"$f":"+'2 Indicadores'!B256:D256","v":"Armazenamento adequado das embalagens\t\t"},{"v":1,"d":"1.0"},null,null,{"$f":"IF('2 Indicadores'!E253>0,('2 Indicadores'!E254/'2 Indicadores'!E253),0.7)","v":{"v":0.7,"d":"0.70"}},{"$f":"IF('2 Indicadores'!E253>0,(H157+H158+F157)/3*0.7,0.7)","v":{"v":0.7,"d":"0.70"}},{"$f":"IF('2 Indicadores'!E256=\"Sim\",1,0)","v":0}]
[null,{"$f":"+'2 Indicadores'!B257:D257","v":"Devolução das embalagens de agrotóxicos\t\t"},{"v":1,"d":"1.0"},{"$nulls":4},{"$f":"IF('2 Indicadores'!E257=\"Sim\",1,0)","v":0}]
[]
[12,"MOS - Fator Ponderação\t\t\t\t"]
[null,"Classificação\t\t\t",{"$nulls":3},"Ponderação",null,"Classes de textura (dag kg-1 de argila)"]
[null,"Arenosa","Média\t","Argilosa","Muito Argilosa",null,null,"Arenosa",null,"≤ 15"]
[null,{"v":0,"d":"0.00"},{"v":0,"d":"0.00"},{"v":0,"d":"0.00"},{"v":0,"d":"0.00"},{"v":0.1,"d":"0.10"},null,"Média",null,"16 a 34"]
[null,{"v":0.8,"d":"0.80"},{"v":1.6,"d":"1.60"},{"v":2.4,"d":"2.40"},{"v":2.8,"d":"2.80"},{"v":0.5,"d":"0.50"},null,"Argilosa",null,"35 a 60"]
[null,{"v":1.1,"d":"1.10"},{"v":2.1,"d":"2.10"},{"v":3.1,"d":"3.10"},{"v":3.6,"d":"3.60"},{"v":0.7,"d":"0.70"},null,"Muito argilosa",null,"> 60"]
[null,{"v":1.5,"d":"1.50"},{"v":3,"d":"3.00"},{"v":4.5,"d":"4.50"},{"v":5.2,"d":"5.20"},{"v":1,"d":"1.00"}]
[null,{"v":4.5,"d":"4.50"},{"v":9,"d":"9.00"},{"v":13.5,"d":"13.50"},{"v":15.6,"d":"15.60"},{"v":0.7,"d":"0.70"}]
[]
[null,"MOS - Fórmulas"]
[null,"Arenosa"," Yo + ax + bx2 + cx3 ",null,"Fórmula2 = Yo + ax ",null,"Média"," Yo + ax + bx2 + cx3 ",null,"Fórmula2 = Yo + ax ",null,null,{"$f":"IF(AND('2 Indicadores'!E265=\"Arenosa\"),IF('2 Indicadores'!C266<1.5,Fórmulas!E173,Fórmulas!F173),0)","v":{"v":0,"d":"0.00"}}]
[null,null,"Yo",{"v":0.1,"d":"0.100"},"Yo",1.15,null,"Yo",{"v":0.1,"d":"0.100"},"Yo",1.15,null,{"$f":"IF(AND('2 Indicadores'!E265=\"Média\"),IF('2 Indicadores'!C266<3,Fórmulas!J173,Fórmulas!K173),0)","v":{"v":0,"d":"0.00"}}]
[null,null,"a",{"v":0.3597,"d":"0.360"},"a",{"v":-0.1,"d":"-0.10"},null,"a",{"v":0.0024,"d":"0.002"},"a",-0.05,null,{"$f":"IF(AND('2 Indicadores'!E265=\"Argilosa\"),IF('2 Indicadores'!C266<4.5,Fórmulas!E178,Fórmulas!F178),0)","v":{"v":0,"d":"0.00"}}]
[null,null,"b",{"v":0.1926,"d":"0.193"},{"$f":"D171+D172*'2 Indicadores'!C266+D173*'2 Indicadores'!C266^2+D174*'2 Indicadores'!C266^3","v":{"v":0.1,"d":"0.10"}},{"$f":"F171+F172*'2 Indicadores'!C266","v":1.15},null,"b",{"v":0.2183,"d":"0.218"},{"$f":"I171+I172*'2 Indicadores'!C266+I173*'2 Indicadores'!C266^2+I174*'2 Indicadores'!C266^3","v":{"v":0.1,"d":"0.10"}},{"$f":"K171+K172*'2 Indicadores'!C266","v":1.15},null,{"$f":"IF(AND('2 Indicadores'!E265=\"Muito argilosa\"),IF('2 Indicadores'!C266<5.2,Fórmulas!J178,Fórmulas!K178),0)","v":{"v":0,"d":"0.00"}}]
[null,null,"c",{"v":-0.0216,"d":"-0.022"},{"$nulls":3},"c",{"v":-0.0397,"d":"-0.040"},{"$nulls":3},{"$f":"(M170+M171+M172+M173)","v":{"v":0,"d":"0.00"}}]
[null,"Argilosa"," Yo + ax + bx2 + cx3 ",null,"Fórmula2 = Yo + ax ",null,"Muito argilosa"," Yo + ax + bx2 + cx3 ",null,"Fórmula2 = Yo + ax "]
[null,null,"Yo",{"v":0.1,"d":"0.100"},"Yo",1.15,null,"Yo",{"v":0.1,"d":"0.100"},"Yo",1.15]
[null,null,"a",{"v":-0.0452,"d":"-0.045"},"a",{"v":-0.03333,"d":"-0.03"},null,"a",{"v":-0.0486,"d":"-0.049"},"a",{"v":-0.0288,"d":"-0.03"}]
[null,null,"b",{"v":0.1269,"d":"0.127"},{"$f":"D176+D177*'2 Indicadores'!C266+D178*'2 Indicadores'!C266^2+D179*'2 Indicadores'!C266^3","v":{"v":0.1,"d":"0.10"}},{"$f":"F176+F177*'2 Indicadores'!C266","v":1.15},null,"b",{"v":0.0984,"d":"0.098"},{"$f":"I176+I177*'2 Indicadores'!C266+I178*'2 Indicadores'!C266^2+I179*'2 Indicadores'!C266^3","v":{"v":0.1,"d":"0.10"}},{"$f":"K176+K177*'2 Indicadores'!C266","v":1.15}]
[null,null,"c",{"v":-0.0161,"d":"-0.016"},{"$nulls":3},"c",{"v":-0.0107,"d":"-0.011"}]
[]
[]
[null,"P - Fator Ponderação\t\t\t\t"]
[null,"Classificação\t\t\t",{"$nulls":3},"Ponderação"]
[null,"Arenosa","Média\t","Argilosa","Muito Argilosa"]
[null,{"v":0,"d":"0.00"},{"v":0,"d":"0.00"},{"v":0,"d":"0.00"},{"v":0,"d":"0.00"},{"v":0.1,"d":"0.10"}]
[null,{"v":12.1,"d":"12.10"},{"v":10.1,"d":"10.10"},{"v":5.1,"d":"5.10"},{"v":3.1,"d":"3.10"},0.25]
[null,{"v":18.1,"d":"18.10"},{"v":15.1,"d":"15.10"},{"v":8.1,"d":"8.10"},{"v":4.1,"d":"4.10"},{"v":0.5,"d":"0.50"}]
[null,{"v":25.1,"d":"25.10"},{"v":20.1,"d":"20.10"},{"v":12.1,"d":"12.10"},{"v":6.1,"d":"6.10"},{"v":0.7,"d":"0.70"}]
[null,{"v":40,"d":"40.00"},{"v":30,"d":"30.00"},{"v":18,"d":"18.00"},{"v":9,"d":"9.00"},{"v":1,"d":"1.00"}]
[null,{"v":400,"d":"400.00"},{"v":300,"d":"300.00"},{"v":180,"d":"180.00"},{"v":90,"d":"90.00"},{"v":0.7,"d":"0.70"}]
[]
["P - Fórmulas"]
["Arenosa"," Yo + ax ",null,"F2 = Yo + ax + bx2 ",null,"F3 = Yo + ax ",null,"Média","F1 = Yo + ax + bx2 ",null,"F2 = Yo + ax + bx2 ",null,"F3 = Yo + ax "]
[null,"Yo",{"v":0.1,"d":"0.10"},"Yo",{"v":-0.4748,"d":"-0.47"},"Yo",{"v":1.0233,"d":"1.02"},null,"Yo",{"v":0.1,"d":"0.10"},"Yo",{"v":-0.3015,"d":"-0.30"},"Yo",{"v":1.0333,"d":"1.03"}]
[null,"a",{"v":0.0124,"d":"0.01"},"a",{"v":0.0721,"d":"0.07"},"a",{"v":-0.0008,"d":"-0.00"},null,"a",{"v":-0.0087,"d":"-0.01"},"a",{"v":0.0639,"d":"0.06"},"a",{"v":-0.0011,"d":"-0.00"}]
[{"$nulls":3},"b",{"v":-1E-3,"d":"-0.00"},{"$nulls":3},"b",{"v":2.3E-3,"d":"0.00"},"b",{"v":-0.0007,"d":"-0.00"}]
["Argilosa","F1 = Yo + ax + bx2 ",null,"F2 = Yo + ax + bx2 ",null,"F3 = Yo + ax ",null,"Muito argilosa","F1 = Yo + ax + bx2 ",null,"F2 = Yo + ax + bx2 ",null,"F3 = Yo + ax "]
[null,"Yo",{"v":0.1,"d":"0.10"},"Yo",{"v":0.1034,"d":"0.10"},"Yo",{"v":1.04333,"d":"1.04"},null,"Yo",{"v":0.1,"d":"0.10"},"Yo",{"v":0.1076,"d":"0.11"},"Yo",{"v":1.0333,"d":"1.03"}]
[null,"a",{"v":-0.0045,"d":"-0.00"},"a",{"v":0.0483,"d":"0.05"},"a",{"v":-1.9E-3,"d":"-0.00"},null,"a",{"v":-0.1041,"d":"-0.10"},"a",{"v":0.0928,"d":"0.09"},"a",{"v":-0.0037,"d":"-0.00"}]
[null,"b",{"v":0.0067,"d":"0.01"},"b",{"v":8.56e-05,"d":"0.00"},{"$nulls":3},"b",{"v":0.0492,"d":"0.05"},"b",{"v":0.0007,"d":"0.00"}]
[null,{"$f":"C194+C195*'2 Indicadores'!C267","v":{"v":0.1,"d":"0.10"}},{"$f":"E194+E195*'2 Indicadores'!C267+E196*'2 Indicadores'!C267^2","v":{"v":-0.4748,"d":"-0.47"}},{"$f":"0.1946+0.0201*'2 Indicadores'!C267","v":{"v":0.1946,"d":"0.19"}},{"$f":"G194+G195*'2 Indicadores'!C267","v":{"v":1.0233,"d":"1.02"}},{"$f":"IF('2 Indicadores'!C267<=12.1,B201,IF(AND('2 Indicadores'!C267>12.1,'2 Indicadores'!C267<25.1),C201,IF('2 Indicadores'!C267>40,E201,D201)))","v":{"v":0.1,"d":"0.10"}},{"$nulls":3},{"$f":"J194+J195*'2 Indicadores'!C267+J196*'2 Indicadores'!C267^2","v":{"v":0.1,"d":"0.10"}},{"$f":"L194+L195*'2 Indicadores'!C267+L196*'2 Indicadores'!C267^2","v":{"v":-0.3015,"d":"-0.30"}},{"$f":"N194+N195*'2 Indicadores'!C267","v":{"v":1.0333,"d":"1.03"}},{"$f":"IF(AND('2 Indicadores'!C267>15.1,'2 Indicadores'!C267<30),K201,IF('2 Indicadores'!C267>=30,L201,J201))","v":{"v":0.1,"d":"0.10"}}]
[null,{"$f":"C198+C199*'2 Indicadores'!C267+C200*'2 Indicadores'!C267^2","v":{"v":0.1,"d":"0.10"}},{"$f":"E198+E199*'2 Indicadores'!C267+E200*'2 Indicadores'!C267^2","v":{"v":0.1034,"d":"0.10"}},{"$f":"G198+G199*'2 Indicadores'!C267","v":{"v":1.04333,"d":"1.04"}},{"$f":"IF(AND('2 Indicadores'!C267>8.1,'2 Indicadores'!C267<18),C202,IF('2 Indicadores'!C267>=18,D202,B202))","v":{"v":0.1,"d":"0.10"}},{"$nulls":4},{"$f":"J198+J199*'2 Indicadores'!C267+J200*'2 Indicadores'!C267^2","v":{"v":0.1,"d":"0.10"}},{"$f":"L198+L199*'2 Indicadores'!C267+L200*'2 Indicadores'!C267^2","v":{"v":0.1076,"d":"0.11"}},{"$f":"N198+N199*'2 Indicadores'!C267","v":{"v":1.0333,"d":"1.03"}},{"$f":"IF(AND('2 Indicadores'!C267>4.1,'2 Indicadores'!C267<9),K202,IF('2 Indicadores'!C267>=9,L202,J202))","v":{"v":0.1,"d":"0.10"}}]
[null,{"$f":"IF(AND('2 Indicadores'!E265=\"Arenosa\"),IF('2 Indicadores'!C267<0,0,IF(Fórmulas!F201>1,1,Fórmulas!F201)),0)","v":{"v":0,"d":"0.00"}},{"$f":"IF(AND('2 Indicadores'!E265=\"Média\"),IF('2 Indicadores'!C267<0,0,IF(Fórmulas!M201>1,1,Fórmulas!M201)),0)","v":{"v":0,"d":"0.00"}},{"$f":"IF(AND('2 Indicadores'!E265=\"Argilosa\"),IF('2 Indicadores'!C267<0,0,IF(Fórmulas!E202>1,1,Fórmulas!E202)),0)","v":{"v":0,"d":"0.00"}},{"$f":"IF(AND('2 Indicadores'!E265=\"Muito argilosa\"),IF('2 Indicadores'!C267<0,0,IF(Fórmulas!M202>1,1,Fórmulas!M202)),0)","v":{"v":0,"d":"0.00"}},{"$f":"(B203+C203+D203+E203)","v":{"v":0,"d":"0.00"}}]
[]
[null,"Ca - Fator Ponderação\t",null,null,"Ca - Fórmulas"]
[null,"Classificação"," Ponderação",null,"F1 = Yo + ax + bx2 ",null,null,"F2 = Yo + ax + bx2 ",null,"F3 = Yo + ax "]
[null,{"v":0,"d":"0.00"},{"v":0.1,"d":"0.10"},null,"Yo",{"v":0.1,"d":"0.10"},null,"Yo",{"v":0.3213,"d":"0.32"},"Yo",{"v":1.075,"d":"1.08"}]
[null,0.41,0.25,null,"a",{"v":0.3839,"d":"0.38"},null,"a",{"v":0.1381,"d":"0.14"},"a",{"v":-0.0188,"d":"-0.02"}]
[null,1.21,{"v":0.5,"d":"0.50"},null,"b",{"v":-0.0441,"d":"-0.04"},null,"b",{"v":0.0079,"d":"0.01"}]
[null,2.41,{"v":0.7,"d":"0.70"}]
[null,{"v":4,"d":"4.00"},{"v":1,"d":"1.00"},null,null,{"$f":"F207+F208*'2 Indicadores'!C268+F209*'2 Indicadores'!C268^2","v":{"v":0.1,"d":"0.10"}},{"$f":"I207+I208*'2 Indicadores'!C268+I209*'2 Indicadores'!C268^2","v":{"v":0.3213,"d":"0.32"}},{"$f":"K207+K208*'2 Indicadores'!C268","v":{"v":1.075,"d":"1.08"}},{"$f":"IF(AND('2 Indicadores'!C268>1.21,'2 Indicadores'!C268<4),G211,IF('2 Indicadores'!C268>=4,H211,F211))","v":{"v":0.1,"d":"0.10"}}]
[null,{"v":20,"d":"20.00"},{"v":0.7,"d":"0.70"}]
[]
[]
[null,"Mg - Fator Ponderação\t",null,null,"Mg - Fórmulas"]
[null,"Classificação"," Ponderação",null,"F1 = Yo + ax + bx2 ",null,null,"F2 = Yo + ax + bx2 ",null,"F3 = Yo + ax "]
[null,{"v":0,"d":"0.00"},{"v":0.1,"d":"0.10"},null,"Yo",{"v":0.1,"d":"0.10"},null,"Yo",{"v":0.3213,"d":"0.32"},"Yo",{"v":1.075,"d":"1.08"}]
[null,0.16,0.25,null,"a",{"v":0.9737,"d":"0.97"},null,"a",{"v":0.3601,"d":"0.36"},"a",-0.05]
[null,0.46,{"v":0.5,"d":"0.50"},null,"b",{"v":-0.2264,"d":"-0.23"},null,"b",{"v":0.0616,"d":"0.06"}]
[null,0.91,{"v":0.7,"d":"0.70"},null,null,{"$f":"F217+F218*'2 Indicadores'!C269+F219*'2 Indicadores'!C269^2","v":{"v":0.1,"d":"0.10"}},{"$f":"I217+I218*'2 Indicadores'!C269+I219*'2 Indicadores'!C269^2","v":{"v":0.3213,"d":"0.32"}},{"$f":"K217+K218*'2 Indicadores'!C269","v":{"v":1.075,"d":"1.08"}},{"$f":"IF(AND('2 Indicadores'!C269>0.46,'2 Indicadores'!C269<1.5),G220,IF('2 Indicadores'!C269>=1.5,H220,F220))","v":{"v":0.1,"d":"0.10"}}]
[null,{"v":1.5,"d":"1.50"},{"v":1,"d":"1.00"}]
[null,{"v":7.5,"d":"7.50"},{"v":0.7,"d":"0.70"}]
[]
[null,"K - Fator Ponderação\t",null,null,"K - Fórmulas"]
[null,"Classificação"," Ponderação",null,"F1 = Yo + ax + bx2 ",null,null,"F2 = Yo + ax + bx2 ",null,"F3 = Yo + ax "]
[null,{"v":0,"d":"0.00"},{"v":0.1,"d":"0.10"},null,"Yo",{"v":0.1,"d":"0.10"},null,"Yo",{"v":0.2066,"d":"0.21"},"Yo",{"v":1.075,"d":"1.08"}]
[null,{"v":16,"d":"16.00"},0.25,null,"a",{"v":0.0091,"d":"0.01"},null,"a",{"v":0.0074,"d":"0.01"},"a",{"v":-6.2E-4,"d":"-0.00"}]
[null,{"v":41,"d":"41.00"},{"v":0.5,"d":"0.50"},null,"b",{"v":1.5244E-5,"d":"0.00"},null,"b",{"v":-6.8888E-6,"d":"-0.00"}]
[null,{"v":71,"d":"71.00"},{"v":0.7,"d":"0.70"},null,null,{"$f":"F226+F227*'2 Indicadores'!C270+F228*'2 Indicadores'!C270^2","v":{"v":0.1,"d":"0.10"}},{"$f":"I226+I227*'2 Indicadores'!C270+I228*'2 Indicadores'!C270^2","v":{"v":0.2066,"d":"0.21"}},{"$f":"K226+K227*'2 Indicadores'!C270","v":{"v":1.075,"d":"1.08"}},{"$f":"IF(AND('2 Indicadores'!C270>41,'2 Indicadores'!C270<120),G229,IF('2 Indicadores'!C270>=120,H229,F229))","v":{"v":0.1,"d":"0.10"}}]
[null,{"v":120,"d":"120.00"},{"v":1,"d":"1.00"}]
[null,{"v":600,"d":"600.00"},{"v":0.7,"d":"0.70"}]
[]
[null,"pH - Fator Ponderação\t",null,null,"pH em água - Fórmulas"]
[null,"Classificação"," Ponderação",null,"F1 = Yo + ax + bx2 ",null,null,"F2 = Yo + ax + bx2 "]
[null,{"v":5.1,"d":"5.10"},{"v":0.3,"d":"0.30"},null,"Yo",{"v":-19.1,"d":"-19.10"},null,"Yo",{"v":-42.5,"d":"-42.50"}]
[null,{"v":5.2,"d":"5.20"},{"v":0.4,"d":"0.40"},null,"a",6.35,null,"a",14.75]
[null,{"v":5.5,"d":"5.50"},{"v":0.7,"d":"0.70"},null,"b",{"v":-0.5,"d":"-0.50"},null,"b",-1.25]
[null,{"v":6,"d":"6.00"},{"v":1,"d":"1.00"},null,{"$f":"-4.8+(1*'2 Indicadores'!C271)","v":{"v":-4.8,"d":"-4.80"}},{"$f":"F235+F236*'2 Indicadores'!C271+F237*'2 Indicadores'!C271^2","v":{"v":-19.1,"d":"-19.10"}},{"$f":"I235+I236*'2 Indicadores'!C271+I237*'2 Indicadores'!C271^2","v":{"v":-42.5,"d":"-42.50"}},{"$f":"IF('2 Indicadores'!C271>=6.6,I238,IF(AND('2 Indicadores'!C271>=6,'2 Indicadores'!C271<6.6),G238,IF(AND('2 Indicadores'!C271>5.2,'2 Indicadores'!C271<6),F238,E238)))","v":{"v":-4.8,"d":"-4.80"}}]
[null,{"v":6.4,"d":"6.40"},{"v":0.7,"d":"0.70"}]
[]
[null,"Al - Fator Ponderação\t",null,null,"Al - Fórmulas"]
[null,"Classificação"," Ponderação",null,"F1 = Yo + ax + bx2 ",null,null,"F2 = Yo + ax + bx2 "]
[null,{"v":0,"d":"0.00"},{"v":0.7,"d":"0.70"},null,"Yo",{"v":0.7,"d":"0.70"},null,"Yo",{"v":0.8406,"d":"0.84"}]
[null,0.21,{"v":0.6,"d":"0.60"},null,"a",{"v":-0.535,"d":"-0.54"},null,"a",{"v":-0.7525,"d":"-0.75"}]
[null,0.51,{"v":0.5,"d":"0.50"},null,"b",{"v":0.2801,"d":"0.28"},null,"b",{"v":0.1661,"d":"0.17"}]
[null,1.01,0.25,null,null,{"$f":"F243+F244*'2 Indicadores'!C272+F245*'2 Indicadores'!C272^2","v":{"v":0.7,"d":"0.70"}},{"$f":"I243+I244*'2 Indicadores'!C272+I245*'2 Indicadores'!C272^2","v":{"v":0.8406,"d":"0.84"}},{"$f":"IF('2 Indicadores'!C272>=0.51,G246,F246)","v":{"v":0.7,"d":"0.70"}}]
[null,{"v":2,"d":"2.00"},{"v":0,"d":"0.00"}]
[]
[null,"CTC - Fator Ponderação\t",null,null,"CTC - Fórmulas"]
[null,"Classificação"," Ponderação",null,"F1 = Yo + ax"]
[null,{"v":0,"d":"0.00"},{"v":0.1,"d":"0.10"},null,"Yo",0.1654]
[null,{"v":1.6,"d":"1.60"},0.25,null,"a",{"v":0.0584,"d":"0.06"}]
[null,{"v":4.3,"d":"4.30"},{"v":0.5,"d":"0.50"}]
[null,{"v":8.6,"d":"8.60"},{"v":0.7,"d":"0.70"},null,null,{"$f":"F251+F252*'2 Indicadores'!C273","v":{"v":0.1654,"d":"0.17"}},{"$f":"IF(F254>1,1,F254)","v":{"v":0.1654,"d":"0.17"}},{"$f":"G254","v":{"v":0.1654,"d":"0.17"}}]
[null,{"v":15,"d":"15.00"},{"v":1,"d":"1.00"}]
[]
[null,"V - Fator Ponderação\t",null,null,"V - Fórmulas"]
[null,"Classificação"," Ponderação",null,"Fórmula1 = Yo + ax ",null,"Fórmula2 = Yo + ax+bx2 "]
[null,{"v":0,"d":"0.00"},{"v":0.1,"d":"0.10"},null,"Yo",{"v":0.3,"d":"0.30"},null,"Yo",{"v":0.1,"d":"0.10"}]
[null,{"v":15,"d":"15.00"},0.25,null,"a",{"v":0.0067,"d":"0.01"},null,"a",{"v":0.0067,"d":"0.01"}]
[null,{"v":30,"d":"30.00"},{"v":0.5,"d":"0.50"},{"$nulls":4},"b",{"v":0.0002,"d":"0.00"}]
[null,{"v":60,"d":"60.00"},{"v":0.7,"d":"0.70"},null,null,{"$f":"F259+F260*'2 Indicadores'!C274","v":{"v":0.3,"d":"0.30"}},{"$f":"I259+I260*'2 Indicadores'!C274+I261*'2 Indicadores'!C274^2","v":{"v":0.1,"d":"0.10"}},{"$f":"IF('2 Indicadores'!C274<30,G262,F262)","v":{"v":0.1,"d":"0.10"}}]
[null,{"v":80,"d":"80.00"},{"v":1,"d":"1.00"}]
[]
[null,"CONVERSÃO DE UNIDADES"]
[null,null,"De","Para",null,null,"De","Para",null,"De","Para"]
[null,null,"Unidade","Unidade","Fator de conversão",null,"%; dag/kg","g/dm3; g/kg; g/L",null,"g/dm3; g/kg; g/L","%; dag/kg"]
[null,"Teor de argila","%; dag/kg","g/dm3; g/kg; g/L",10,null,null,{"$f":"G268*10","v":0},null,null,{"$f":"J268/10","v":0}]
[null,"Matéria Orgânica","%; dag/kg","g/dm3; g/kg; g/L",10,null,null,{"$f":"G269*10","v":0},null,null,{"$f":"J269/10","v":0}]
[null,null,"De","Para"]
[null,null,"Unit ","Unit ","Conversion factor"]
[null,"P disponível","mg/dm3; mg/kg; mg/L","ppm",1]
[null,"K trocável","mg/dm3; mg/kg; mg/L","ppm",1]
[null,null,"De","Para",null,null,"De","Para",null,"De","Para"]
[null,null,"Unidade","Unidade","Fator de conversão",null,"cmolc/dm3","mmolc/dm3",null,"mmolc/dm3","cmolc/dm3"]
[null,"Ca trocável","cmolc/dm3; meq/100 cm3; meq/ 100ml; meq/ 100g","mmolc/dm3; mmolc/kg",10,null,null,{"$f":"G276*10","v":0},null,null,{"$f":"J276/10","v":0}]
[null,"Mg trocável","cmolc/dm3. meq/100 cm3; meq/ 100ml; meq/ 100g","mmolc/dm3; mmolc/kg",10,null,null,{"$f":"G277*10","v":0},null,null,{"$f":"J277/10","v":0}]
[null,"Al trocável","cmolc/dm3. meq/100 cm3; meq/ 100ml; meq/ 100g","mmolc/dm3; mmolc/kg",10,null,null,{"$f":"G278*10","v":0},null,null,{"$f":"J278/10","v":0}]
[null,"CTC","cmolc/dm3. meq/100 cm3; meq/ 100ml; meq/ 100g","mmolc/dm3; mmolc/kg",10,null,null,{"$f":"G279*10","v":0},null,null,{"$f":"J279/10","v":0}]
[null,null,"De","Para"]
[null,null,"Unidade","Unidade","Fator de conversão"]
[null,"Macronutrientes","%","g/kg",10]
[null,"Micronutrientes","ppm","mg/kg",1]
[null,"P ","P2O5","P",0.437]
[null,"K ","K2O","K",{"v":0.83,"d":"0.830"}]
[null,"Ca ","CaO","Ca",0.715]
[null,"Mg","MgO","Mg",0.602]
[{"$nulls":11},"UNIDADES VII"]
[13,"Fórmulas",{"$nulls":4},"pH - Padrões Estabelecidos",{"$nulls":4},"Vegetação nativa"]
[null,"Classificação","Ponderação","",null,null," Res. CONAMA 357/05",null,"Portaria 518/04 M.S.*",null,null,"Pastagem; agricultura; reflorestamento"]
[null,"6 - 9,0",0.7,{"$nulls":3},"Entre  6 e 9 para todas as classes\t\n\t\n\t",null,"Entre  6 e 9,5 na distribuição para consumo humano\t\n\t\n\t",null,null,"Residencial"]
[null,"pH < 6 and > 9,0",0.3,{"$nulls":8},"Ausente"]
[{"$nulls":11},"Alterações de origem doméstica (esgoto, lixo)"]
[null,{"$f":"IF(('2 Indicadores'!D320>=6)*OR('2 Indicadores'!D320<=9),0.7,0.3)","v":{"v":0.3,"d":"0.30"}},{"$f":"IF(('2 Indicadores'!D321>=6)*OR('2 Indicadores'!D321<=9),0.7,0.3)","v":{"v":0.3,"d":"0.30"}},{"$nulls":5},"* Ministério da Saúde",null,null,"Industrial; urbana"]
[{"$nulls":11},"Parcial"]
[{"$nulls":11},"Total"]
[{"$nulls":11},"Ausente"]
[null,"Fórmulas",{"$nulls":4},"Coliformes Termotoleranets - Padrões \t\t\t",{"$nulls":4},"Ausente"]
[null,"Classificação","Ponderação",{"$nulls":3}," CONAMA 357/05",null,"518/04 M.S.*",null,null,"Moderada"]
[null,"UFC < 1.000",0.7,{"$nulls":3},"Valor máximo - 1.000 coliformes fecais por  100 mililitros em 80% ou mais de pelo menos 06 amostras\t\n\t\n\t\n\t\n\t",null,"Para abastecimento humano deve haver ausência em amostra de 100 ml (VMP)\t\n\t\n\t\n\t\n\t",null,null,"Acentuada"]
[null,"UFC > 1.000",0.1,{"$nulls":8},"Transparente"]
[{"$nulls":11},"Turva, cor de chá forte"]
[null,{"$f":"IF(('2 Indicadores'!D322<=999),0.7,0.1)","v":{"v":0.7,"d":"0.70"}},{"$f":"IF(('2 Indicadores'!D323<=999),0.7,0.1)","v":{"v":0.7,"d":"0.70"}},{"$nulls":8},"Opaca ou colorida"]
[{"$nulls":11},"Nenhum"]
[{"$nulls":8},"* Ministério da Saúde",null,null,"Esgoto"]
[{"$nulls":11},"Óleo/Industrial"]
[null,"Fórmulas",{"$nulls":4},"Turbidez - Padrões Estabelecidos\t\t\t",{"$nulls":4},"Pedras/ cascalho"]
[null,"Classificação",null,"Fator de ponderação",null,null," CONAMA 357/05",null,"518/04 M.S.*",null,null,"Lama/areia"]
[null,"< 100 UNT",null,0.7,null,null,"Ambiente lêntico até 100 UNT para a classe 2\t\n\t\n\t\n\t",null,"Turbidez - 5 UNT na distribuição para consumo humano\t\n\t\n\t\n\t",null,null,"Cimento/ canalizado"]
[null,"> 100 UNT",null,0.1]
[]
[null,{"$f":"IF(('2 Indicadores'!D326<=100),0.7,0.1)","v":{"v":0.7,"d":"0.70"}},{"$f":"IF(('2 Indicadores'!D327<=100),0.7,0.1)","v":{"v":0.7,"d":"0.70"}}]
[{"$nulls":8},"* Ministério da Saúde"]
[]
[null,"Fórmulas",{"$nulls":4},"Nitrato Total - Padrões Estabelecidos\t\t\t"]
[null,"Classificação",null,"Fator de ponderação",null,null," CONAMA 357/05",null,"518/04 M.S.*"]
[null,"< 10 mg/L N",null,0.7,null,null,"Valor máximo 10 mg/L N\t\n\t\n\t",null,"Valor máximo de NO3- para classe2: 44,3 mg/L \t\n\t\n\t"]
[null,"> 10 mg/L N ",null,0.1]
[]
[null,{"$f":"IF(('2 Indicadores'!D324<=9.99),0.7,0.1)","v":{"v":0.7,"d":"0.70"}},{"$f":"IF(('2 Indicadores'!D325<=9.99),0.7,0.1)","v":{"v":0.7,"d":"0.70"}},{"$nulls":5},"* Ministério da Saúde"]
[]
[null,"Fórmulas"]
[null,"Indicadores do item 31.1: campos marcados a montante e a jusante, multiplicado pelo peso das colunas (esquerda peso 4, do meio peso 2 e da direita 0) e multiplicado pelos fatores de ponderação de cada item. Os valores totais foram transformados no intervalo de 0 a 100f each item. The total values were transformed in the range of 0 to 100"]
[{"$nulls":9},{"$f":"IF('2 Indicadores'!F320=\"\",0,'2 Indicadores'!F320*'2 Indicadores'!G330)+IF('2 Indicadores'!F326=\"\",0,'2 Indicadores'!F326*'2 Indicadores'!G326)+IF('2 Indicadores'!F322=\"\",0,'2 Indicadores'!F322*'2 Indicadores'!G322)+IF('2 Indicadores'!F324=\"\",0,'2 Indicadores'!F324*'2 Indicadores'!G324)+IF('2 Indicadores'!D329=\"\",0,'2 Indicadores'!D329*'2 Indicadores'!G329)","v":{"v":0,"d":"0.00"}},{"$f":"IF('2 Indicadores'!F320=\"\",0,'2 Indicadores'!G330)+IF('2 Indicadores'!F326=\"\",0,'2 Indicadores'!G326)+IF('2 Indicadores'!F322=\"\",0,'2 Indicadores'!G322)+IF('2 Indicadores'!F324=\"\",0,'2 Indicadores'!G324)+IF('2 Indicadores'!D329=\"\",0,'2 Indicadores'!G329)","v":4},{"$f":"+Fórmulas!J324/K324","v":{"v":0,"d":"0.00"}}]
[{"$nulls":9},{"$f":"IF('2 Indicadores'!F321=\"\",0,'2 Indicadores'!F321*'2 Indicadores'!G330)+IF('2 Indicadores'!F327=\"\",0,'2 Indicadores'!F327*'2 Indicadores'!G326)+IF('2 Indicadores'!F323=\"\",0,'2 Indicadores'!F323*'2 Indicadores'!G322)+IF('2 Indicadores'!F325=\"\",0,'2 Indicadores'!F325*'2 Indicadores'!G324)+IF('2 Indicadores'!D330=\"\",0,'2 Indicadores'!D330*'2 Indicadores'!G329)","v":{"v":0,"d":"0.00"}},{"$f":"IF('2 Indicadores'!F321=\"\",0,'2 Indicadores'!G330)+IF('2 Indicadores'!F327=\"\",0,'2 Indicadores'!G326)+IF('2 Indicadores'!F323=\"\",0,'2 Indicadores'!G322)+IF('2 Indicadores'!F325=\"\",0,'2 Indicadores'!G324)+IF('2 Indicadores'!D330=\"\",0,'2 Indicadores'!G329)","v":4},{"$f":"+Fórmulas!J325/K325","v":{"v":0,"d":"0.00"}}]
[]
[]
[null,"Fórmula resultado parcial\t\t"]
[null,"Média dos resultados dos parâmetros do item 13.1 considerando os fatores de ponderação em cada item"]
[{"$nulls":5},{"$f":"IF('2 Indicadores'!D332<'2 Indicadores'!D333,'2 Indicadores'!D332,'2 Indicadores'!D333)","v":{"v":0,"d":"0.00"}}]
[]
[null,"Fórmulas",null,null,"pH "]
[null,"Classificação","Ponderação",null," 518/04 M.S.*"]
[null,"6 - 9,5",0.7,null,"Entre  6 e 9,5 na distribuição para consumo humano"]
[null,"pH < 6 and > 9,5",0.3,null,"* Ministério da Saúde"]
[null,{"$f":"IF(('2 Indicadores'!D338>=6)*OR('2 Indicadores'!D338<=9.5),0.7,0.3)","v":{"v":0.3,"d":"0.30"}}]
[]
[]
[null,"Fórmulas",null,null,"Coliformes termotolerantes"]
[null,"Classificação","Ponderação",null,"CONAMA 396/08",null,"518/04 M.S.*"]
[null,"absent",0.7,null,"Para abastecimento humano - ausência em amostra de 100 mL (VMP); para dessedentação de animais 200/100 mL\t\n\t\n\t\n\t\n\t",null,"Para abastecimento humano deve haver ausência em amostra de 100 mL (VMP)"]
[null,">0",0.1]
[null,{"$f":"IF('2 Indicadores'!D339=0,0.701,0.1)","v":{"v":0.701,"d":"0.70"}}]
[]
[{"$nulls":4},"* Ministério da Saúde"]
[null,"Fórmulas",null,null,"Nitrato Total"]
[null,"Classificação","Ponderação",null,"CONAMA 396/08",null,"518/04 M.S.*"]
[null,"<= 10",0.7,null,"Segundo essa resolução o valor máximo permitido (VMP) para consumo humano é de 10 mg.  L-1 de N)",null,"Valor máximo permitido 10 mg L-1 de N"]
[null,"> 10",0.1]
[null,{"$f":"IF('2 Indicadores'!D340<=10,0.701,0.1)","v":{"v":0.701,"d":"0.70"}}]
[]
[]
[{"$nulls":4},"* Ministério da Saúde"]
[null,"Fórmula resultado parcial\t\t",{"$nulls":3},"Fórmula resultado final"]
[null,"Média dos resultados dos parâmetros do item 13.2 e média dos resultados dos parâmetros do item 12.3",{"$nulls":3},"Fórmula - resultado parcial da qualidade da água superficial x 2 + resultado superficial da qualidade da água subterrânea/3"]
[]
[]
[14,"Fator de Ponderação\t\t"]
[null,"Classificação","Ponderação"]
[null,"não utiliza",{"v":1,"d":"1.0"},null,"Vulnerabilidade do talhão: item 14.1  = 1 a 3 (1); 4 a 9 (2); 12 a 27 (3)\t\t\t\t\t\t\t\t"]
[null,"Rc: 1 a 2",{"v":0.6,"d":"0.60"}]
[null,"Rc: 2 e 4",{"v":0.3,"d":"0.30"}]
[null,"Rc: 6 e 9",{"v":0.1,"d":"0.10"}]
[]
[null,"Fórmulas"]
[null,null,{"$f":"'2 Indicadores'!D348","v":{"v":0,"d":"0.00"}},{"$f":"'2 Indicadores'!E348","v":{"v":0,"d":"0.00"}},{"$f":"'2 Indicadores'!F348","v":{"v":0,"d":"0.00"}},null,null,{"$f":"Fórmulas!D391","v":{"v":0,"d":"0.00"}},{"$f":"Fórmulas!E391","v":{"v":0,"d":"0.00"}},{"$f":"Fórmulas!F391","v":{"v":0,"d":"0.00"}},{"$f":"Fórmulas!G391","v":{"v":0,"d":"0.00"}},{"$f":"Fórmulas!H391","v":{"v":0,"d":"0.00"}},{"$f":"Fórmulas!I391","v":{"v":0,"d":"0.00"}},{"$f":"Fórmulas!J391","v":{"v":0,"d":"0.00"}}]
[null,"Pci",{"$f":"IF('2 Indicadores'!D358>0.001,((1/LOG10('2 Indicadores'!D358))*(LOG10('2 Indicadores'!D359))*'2 Indicadores'!D357),\" \")","v":{"$error":"#VALUE!"}},{"$f":"IF('2 Indicadores'!E358>0.001,((1/LOG10('2 Indicadores'!E358))*(LOG10('2 Indicadores'!E359))*'2 Indicadores'!E357),\" \")","v":{"$error":"#VALUE!"}},{"$f":"IF('2 Indicadores'!F358>0.001,((1/LOG10('2 Indicadores'!F358))*(LOG10('2 Indicadores'!F359))*'2 Indicadores'!F357),\" \")","v":{"$error":"#VALUE!"}},null,null,{"$f":"IF(Fórmulas!D402>0.001,((1/LOG10(Fórmulas!D402))*(LOG10(Fórmulas!D403))*Fórmulas!D401),\" \")","v":{"$error":"#VALUE!"}},{"$f":"IF(Fórmulas!E402>0.001,((1/LOG10(Fórmulas!E402))*(LOG10(Fórmulas!E403))*Fórmulas!E401),\" \")","v":{"$error":"#VALUE!"}},{"$f":"IF(Fórmulas!F402>0.001,((1/LOG10(Fórmulas!F402))*(LOG10(Fórmulas!F403))*Fórmulas!F401),\" \")","v":{"$error":"#VALUE!"}},{"$f":"IF(Fórmulas!G402>0.001,((1/LOG10(Fórmulas!G402))*(LOG10(Fórmulas!G403))*Fórmulas!G401),\" \")","v":{"$error":"#VALUE!"}},{"$f":"IF(Fórmulas!H402>0.001,((1/LOG10(Fórmulas!H402))*(LOG10(Fórmulas!H403))*Fórmulas!H401),\" \")","v":{"$error":"#VALUE!"}},{"$f":"IF(Fórmulas!I402>0.001,((1/LOG10(Fórmulas!I402))*(LOG10(Fórmulas!I403))*Fórmulas!I401),\" \")","v":{"$error":"#VALUE!"}},{"$f":"IF(Fórmulas!J402>0.001,((1/LOG10(Fórmulas!J402))*(LOG10(Fórmulas!J403))*Fórmulas!J401),\" \")","v":{"$error":"#VALUE!"}}]
[null,"Vulnerabilidade",{"$f":"IF('2 Indicadores'!D369>0.001,('2 Indicadores'!D369*'2 Indicadores'!D370*'2 Indicadores'!D371),0)","v":{"v":0,"d":"0.00"}},{"$f":"IF('2 Indicadores'!E369>0.001,('2 Indicadores'!E369*'2 Indicadores'!E370*'2 Indicadores'!E371),0)","v":{"v":0,"d":"0.00"}},{"$f":"IF('2 Indicadores'!F369>0.001,('2 Indicadores'!F369*'2 Indicadores'!F370*'2 Indicadores'!F371),0)","v":{"v":0,"d":"0.00"}},null,null,{"$f":"IF(Fórmulas!D412>0.001,(Fórmulas!D412*Fórmulas!D413*Fórmulas!D414),0)","v":{"v":0,"d":"0.00"}},{"$f":"IF(Fórmulas!E412>0.001,(Fórmulas!E412*Fórmulas!E413*Fórmulas!E414),0)","v":{"v":0,"d":"0.00"}},{"$f":"IF(Fórmulas!F412>0.001,(Fórmulas!F412*Fórmulas!F413*Fórmulas!F414),0)","v":{"v":0,"d":"0.00"}},{"$f":"IF(Fórmulas!G412>0.001,(Fórmulas!G412*Fórmulas!G413*Fórmulas!G414),0)","v":{"v":0,"d":"0.00"}},{"$f":"IF(Fórmulas!H412>0.001,(Fórmulas!H412*Fórmulas!H413*Fórmulas!H414),0)","v":{"v":0,"d":"0.00"}},{"$f":"IF(Fórmulas!I412>0.001,(Fórmulas!I412*Fórmulas!I413*Fórmulas!I414),0)","v":{"v":0,"d":"0.00"}},{"$f":"IF(Fórmulas!J412>0.001,(Fórmulas!J412*Fórmulas!J413*Fórmulas!J414),0)","v":{"v":0,"d":"0.00"}}]
[]
[null,"Risco",{"$f":"IF('2 Indicadores'!D372>0.01,('2 Indicadores'!D372*'2 Indicadores'!D361),\" \")","v":{"$error":"#VALUE!"}},{"$f":"IF('2 Indicadores'!E372>0.01,('2 Indicadores'!E372*'2 Indicadores'!E361),\" \")","v":{"$error":"#VALUE!"}},{"$f":"IF('2 Indicadores'!F372>0.01,('2 Indicadores'!F372*'2 Indicadores'!F361),\" \")","v":{"$error":"#VALUE!"}},null,null,{"$f":"IF(Fórmulas!D415>0.01,(Fórmulas!D415*Fórmulas!D405),\" \")","v":{"$error":"#VALUE!"}},{"$f":"IF(Fórmulas!E415>0.01,(Fórmulas!E415*Fórmulas!E405),\" \")","v":{"$error":"#VALUE!"}},{"$f":"IF(Fórmulas!F415>0.01,(Fórmulas!F415*Fórmulas!F405),\" \")","v":{"$error":"#VALUE!"}},{"$f":"IF(Fórmulas!G415>0.01,(Fórmulas!G415*Fórmulas!G405),\" \")","v":{"$error":"#VALUE!"}},{"$f":"IF(Fórmulas!H415>0.01,(Fórmulas!H415*Fórmulas!H405),\" \")","v":{"$error":"#VALUE!"}},{"$f":"IF(Fórmulas!I415>0.01,(Fórmulas!I415*Fórmulas!I405),\" \")","v":{"$error":"#VALUE!"}},{"$f":"IF(Fórmulas!J415>0.01,(Fórmulas!J415*Fórmulas!J405),\" \")","v":{"$error":"#VALUE!"}}]
[null,{"$f":"IF(C367=B374,C368,IF(D367=B374,D368,IF(E367=B374,E368,IF(F367=B374,F368,IF(G367=B374,G368,IF(H367=B374,H368,IF(I367=B374,I368,IF(J367=B374,J368,IF(K367=B374,K368,IF(L367=B374,L368,IF(M367=B374,M368,IF(N367=B374,N368,IF(Fórmulas!B379=B374,Fórmulas!B380,IF(Fórmulas!C379=B374,Fórmulas!C380,IF('2 Indicadores'!BT352=B374,'2 Indicadores'!BT353,IF(Fórmulas!D379=B374,Fórmulas!D380,IF(Fórmulas!E379=B374,Fórmulas!E380,IF(Fórmulas!F379=B374,Fórmulas!F380,IF(Fórmulas!G379=B374,Fórmulas!G380,IF(Fórmulas!H379=B374,Fórmulas!H380,IF(Fórmulas!I379=B374,Fórmulas!I380,IF(Fórmulas!J379=B374,Fórmulas!J380,IF(Fórmulas!K379=B374,Fórmulas!K380,IF(Fórmulas!L379=B374,Fórmulas!L380,IF(Fórmulas!M379=B374,Fórmulas!M380,IF(Fórmulas!N379=B374,Fórmulas!N380,IF(Fórmulas!B385=B374,Fórmulas!B386,IF(Fórmulas!C385=B374,Fórmulas!C386,IF(Fórmulas!D385=B374,Fórmulas!D386)))))))))))))))))))))))))))))","v":{"$error":"#VALUE!"}}]
[]
[null,"Cálculo do risco"]
[null,{"$f":"MAX(C367:N367)","v":{"$error":"#VALUE!"}}]
[null,{"$f":"IF(OR(B374=0.83,B374<0.83),1,IF(OR(AND(0.83<B374,B374<=1.66)),2,IF(B374>1.66,3,\"\")))","v":{"$error":"#VALUE!"}},{"$f":"B371","v":{"$error":"#VALUE!"}}]
[null,{"$f":"B375*C376","v":{"$error":"#VALUE!"}},{"$f":"IF(OR(AND(1<=C375,C375<=3)),1,IF(OR(AND(3<C375,C375<=9)),2,IF(C375>9,3)))","v":{"$error":"#VALUE!"}}]
[]
[null,{"$f":"Fórmulas!K391","v":{"v":0,"d":"0.00"}},{"$f":"Fórmulas!L391","v":{"v":0,"d":"0.00"}},{"$f":"Fórmulas!D420","v":{"v":0,"d":"0.00"}},{"$f":"Fórmulas!E420","v":{"v":0,"d":"0.00"}},{"$f":"Fórmulas!F420","v":{"v":0,"d":"0.00"}},{"$f":"Fórmulas!G420","v":{"v":0,"d":"0.00"}},{"$f":"Fórmulas!H420","v":{"v":0,"d":"0.00"}},{"$f":"Fórmulas!I420","v":{"v":0,"d":"0.00"}},{"$f":"Fórmulas!J420","v":{"v":0,"d":"0.00"}},{"$f":"Fórmulas!K420","v":{"v":0,"d":"0.00"}},{"$f":"Fórmulas!L420","v":{"v":0,"d":"0.00"}},{"$f":"Fórmulas!D448","v":{"v":0,"d":"0.00"}},{"$f":"Fórmulas!E448","v":{"v":0,"d":"0.00"}}]
[null,{"$f":"IF(Fórmulas!K402>0.001,((1/LOG10(Fórmulas!K402))*(LOG10(Fórmulas!K403))*Fórmulas!K401),\" \")","v":{"$error":"#VALUE!"}},{"$f":"IF(Fórmulas!L402>0.001,((1/LOG10(Fórmulas!L402))*(LOG10(Fórmulas!L403))*Fórmulas!L401),\" \")","v":{"$error":"#VALUE!"}},{"$f":"IF(Fórmulas!D431>0.001,((1/LOG10(Fórmulas!D431))*(LOG10(Fórmulas!D432))*Fórmulas!D430),\" \")","v":{"$error":"#VALUE!"}},{"$f":"IF(Fórmulas!E431>0.001,((1/LOG10(Fórmulas!E431))*(LOG10(Fórmulas!E432))*Fórmulas!E430),\" \")","v":{"$error":"#VALUE!"}},{"$f":"IF(Fórmulas!F431>0.001,((1/LOG10(Fórmulas!F431))*(LOG10(Fórmulas!F432))*Fórmulas!F430),\" \")","v":{"$error":"#VALUE!"}},{"$f":"IF(Fórmulas!G431>0.001,((1/LOG10(Fórmulas!G431))*(LOG10(Fórmulas!G432))*Fórmulas!G430),\" \")","v":{"$error":"#VALUE!"}},{"$f":"IF(Fórmulas!H431>0.001,((1/LOG10(Fórmulas!H431))*(LOG10(Fórmulas!H432))*Fórmulas!H430),\" \")","v":{"$error":"#VALUE!"}},{"$f":"IF(Fórmulas!I431>0.001,((1/LOG10(Fórmulas!I431))*(LOG10(Fórmulas!I432))*Fórmulas!I430),\" \")","v":{"$error":"#VALUE!"}},{"$f":"IF(Fórmulas!J431>0.001,((1/LOG10(Fórmulas!J431))*(LOG10(Fórmulas!J432))*Fórmulas!J430),\" \")","v":{"$error":"#VALUE!"}},{"$f":"IF(Fórmulas!K431>0.001,((1/LOG10(Fórmulas!K431))*(LOG10(Fórmulas!K432))*Fórmulas!K430),\" \")","v":{"$error":"#VALUE!"}},{"$f":"IF(Fórmulas!L431>0.001,((1/LOG10(Fórmulas!L431))*(LOG10(Fórmulas!L432))*Fórmulas!L430),\" \")","v":{"$error":"#VALUE!"}},{"$f":"IF(Fórmulas!D459>0.001,((1/LOG10(Fórmulas!D459))*(LOG10(Fórmulas!D460))*Fórmulas!D458),\" \")","v":{"$error":"#VALUE!"}},{"$f":"IF(Fórmulas!E459>0.001,((1/LOG10(Fórmulas!E459))*(LOG10(Fórmulas!E460))*Fórmulas!E458),\" \")","v":{"$error":"#VALUE!"}}]
[null,{"$f":"IF(Fórmulas!K412>0.001,(Fórmulas!K412*Fórmulas!K413*Fórmulas!K414),0)","v":{"v":0,"d":"0.00"}},{"$f":"IF(Fórmulas!L412>0.001,(Fórmulas!L412*Fórmulas!L413*Fórmulas!L414),0)","v":{"v":0,"d":"0.00"}},{"$f":"IF(Fórmulas!D441>0.001,(Fórmulas!D441*Fórmulas!D442*Fórmulas!D443),0)","v":{"v":0,"d":"0.00"}},{"$f":"IF(Fórmulas!E441>0.001,(Fórmulas!E441*Fórmulas!E442*Fórmulas!E443),0)","v":{"v":0,"d":"0.00"}},{"$f":"IF(Fórmulas!F441>0.001,(Fórmulas!F441*Fórmulas!F442*Fórmulas!F443),0)","v":{"v":0,"d":"0.00"}},{"$f":"IF(Fórmulas!G441>0.001,(Fórmulas!G441*Fórmulas!G442*Fórmulas!G443),0)","v":{"v":0,"d":"0.00"}},{"$f":"IF(Fórmulas!H441>0.001,(Fórmulas!H441*Fórmulas!H442*Fórmulas!H443),0)","v":{"v":0,"d":"0.00"}},{"$f":"IF(Fórmulas!I441>0.001,(Fórmulas!I441*Fórmulas!I442*Fórmulas!I443),0)","v":{"v":0,"d":"0.00"}},{"$f":"IF(Fórmulas!J441>0.001,(Fórmulas!J441*Fórmulas!J442*Fórmulas!J443),0)","v":{"v":0,"d":"0.00"}},{"$f":"IF(Fórmulas!K441>0.001,(Fórmulas!K441*Fórmulas!K442*Fórmulas!K443),0)","v":{"v":0,"d":"0.00"}},{"$f":"IF(Fórmulas!L441>0.001,(Fórmulas!L441*Fórmulas!L442*Fórmulas!L443),0)","v":{"v":0,"d":"0.00"}},{"$f":"IF(Fórmulas!D469>0.001,(Fórmulas!D469*Fórmulas!D470*Fórmulas!D471),0)","v":{"v":0,"d":"0.00"}},{"$f":"IF(Fórmulas!E469>0.001,(Fórmulas!E469*Fórmulas!E470*Fórmulas!E471),0)","v":{"v":0,"d":"0.00"}}]
[]
[null,{"$f":"IF(Fórmulas!K415>0.01,(Fórmulas!K415*Fórmulas!K405),\" \")","v":{"$error":"#VALUE!"}},{"$f":"IF(Fórmulas!L415>0.01,(Fórmulas!L415*Fórmulas!L405),\" \")","v":{"$error":"#VALUE!"}},{"$f":"IF(Fórmulas!D444>0.01,(Fórmulas!D444*Fórmulas!D434),\" \")","v":{"$error":"#VALUE!"}},{"$f":"IF(Fórmulas!E444>0.01,(Fórmulas!E444*Fórmulas!E434),\" \")","v":{"$error":"#VALUE!"}},{"$f":"IF(Fórmulas!F444>0.01,(Fórmulas!F444*Fórmulas!F434),\" \")","v":{"$error":"#VALUE!"}},{"$f":"IF(Fórmulas!G444>0.01,(Fórmulas!G444*Fórmulas!G434),\" \")","v":{"$error":"#VALUE!"}},{"$f":"IF(Fórmulas!H444>0.01,(Fórmulas!H444*Fórmulas!H434),\" \")","v":{"$error":"#VALUE!"}},{"$f":"IF(Fórmulas!I444>0.01,(Fórmulas!I444*Fórmulas!I434),\" \")","v":{"$error":"#VALUE!"}},{"$f":"IF(Fórmulas!J444>0.01,(Fórmulas!J444*Fórmulas!J434),\" \")","v":{"$error":"#VALUE!"}},{"$f":"IF(Fórmulas!K444>0.01,(Fórmulas!K444*Fórmulas!K434),\" \")","v":{"$error":"#VALUE!"}},{"$f":"IF(Fórmulas!L444>0.01,(Fórmulas!L444*Fórmulas!L434),\" \")","v":{"$error":"#VALUE!"}},{"$f":"IF(Fórmulas!D472>0.01,(Fórmulas!D472*Fórmulas!D462),\" \")","v":{"$error":"#VALUE!"}},{"$f":"IF(Fórmulas!E472>0.01,(Fórmulas!E472*Fórmulas!E462),\" \")","v":{"$error":"#VALUE!"}}]
[]
[null,{"$f":"Fórmulas!F448","v":{"v":0,"d":"0.00"}},{"$f":"Fórmulas!G448","v":{"v":0,"d":"0.00"}},{"$f":"Fórmulas!H448","v":{"v":0,"d":"0.00"}}]
[null,{"$f":"IF(Fórmulas!F459>0.001,((1/LOG10(Fórmulas!F459))*(LOG10(Fórmulas!F460))*Fórmulas!F458),\" \")","v":{"$error":"#VALUE!"}},{"$f":"IF(Fórmulas!G459>0.001,((1/LOG10(Fórmulas!G459))*(LOG10(Fórmulas!G460))*Fórmulas!G458),\" \")","v":{"$error":"#VALUE!"}},{"$f":"IF(Fórmulas!H459>0.001,((1/LOG10(Fórmulas!H459))*(LOG10(Fórmulas!H460))*Fórmulas!H458),\" \")","v":{"$error":"#VALUE!"}},{"$f":"IF(Fórmulas!I459>0.001,((1/LOG10(Fórmulas!I459))*(LOG10(Fórmulas!I460))*Fórmulas!I458),\" \")","v":{"$error":"#VALUE!"}}]
[null,{"$f":"IF(Fórmulas!F469>0.001,(Fórmulas!F469*Fórmulas!F470*Fórmulas!F471),0)","v":{"v":0,"d":"0.00"}},{"$f":"IF(Fórmulas!G469>0.001,(Fórmulas!G469*Fórmulas!G470*Fórmulas!G471),0)","v":{"v":0,"d":"0.00"}},{"$f":"IF(Fórmulas!H469>0.001,(Fórmulas!H469*Fórmulas!H470*Fórmulas!H471),0)","v":{"v":0,"d":"0.00"}},{"$f":"IF(Fórmulas!I469>0.001,(Fórmulas!I469*Fórmulas!I470*Fórmulas!I471),0)","v":{"v":0,"d":"0.00"}}]
[]
[null,{"$f":"IF(Fórmulas!F472>0.01,(Fórmulas!F472*Fórmulas!F462),\" \")","v":{"$error":"#VALUE!"}},{"$f":"IF(Fórmulas!G472>0.01,(Fórmulas!G472*Fórmulas!G462),\" \")","v":{"$error":"#VALUE!"}},{"$f":"IF(Fórmulas!H472>0.01,(Fórmulas!H472*Fórmulas!H462),\" \")","v":{"$error":"#VALUE!"}},{"$f":"IF(Fórmulas!I472>0.01,(Fórmulas!I472*Fórmulas!I462),\" \")","v":{"$error":"#VALUE!"}}]
[]
[]
[null,"Nome comercial do produto (selecione)\t",{"$nulls":10},1]
[null,"Ingrediente ativo (%)\t"]
[null,"Descrição da cultura\t",{"$nulls":10},2]
[null,"Área (ha)\t",{"$nulls":10},3]
[null,"Volume aplicado L/ha ou kg/ha \t"]
[null,"Volume total aplicado por produto\t",null,{"$f":"+D395*D394","v":{"v":0,"d":"0.0"}},{"v":0,"d":"0.0"},{"v":0,"d":"0.0"},{"v":0,"d":"0.0"},{"v":0,"d":"0.0"},{"v":0,"d":"0.0"},{"v":0,"d":"0.0"},{"v":0,"d":"0.0"},{"v":0,"d":"0.0"}]
[]
[null,"Ingrediente ativo do produto \t",null,{"$f":"IF(D$394>0,(HLOOKUP(D$391,'Base de dados'!$B$5:$AIN$11,$M398,0)),\"\")","v":""},{"$f":"IF(E$394>0,(HLOOKUP(E$391,'Base de dados'!$B$5:$AIN$11,$M398,0)),\"\")","v":""},{"$f":"IF(F$394>0,(HLOOKUP(F$391,'Base de dados'!$B$5:$AIN$11,$M398,0)),\"\")","v":""},{"$f":"IF(G$394>0,(HLOOKUP(G$391,'Base de dados'!$B$5:$AIN$11,$M398,0)),\"\")","v":""},{"$f":"IF(H$394>0,(HLOOKUP(H$391,'Base de dados'!$B$5:$AIN$11,$M398,0)),\"\")","v":""},{"$f":"IF(I$394>0,(HLOOKUP(I$391,'Base de dados'!$B$5:$AIN$11,$M398,0)),\"\")","v":""},{"$f":"IF(J$394>0,(HLOOKUP(J$391,'Base de dados'!$B$5:$AIN$11,$M398,0)),\"\")","v":""},{"$f":"IF(K$394>0,(HLOOKUP(K$391,'Base de dados'!$B$5:$AIN$11,$M398,0)),\"\")","v":""},{"$f":"IF(L$394>0,(HLOOKUP(L$391,'Base de dados'!$B$5:$AIN$11,$M398,0)),\"\")","v":""},2]
[null,"Toxicidade para peixes - 96h LC50 (mg L-1)\t",null,{"$f":"IF(D$394>0,(HLOOKUP(D$391,'Base de dados'!$B$5:$AIN$11,$M399,0)),\"\")","v":""},{"$f":"IF(E$394>0,(HLOOKUP(E$391,'Base de dados'!$B$5:$AIN$11,$M399,0)),\"\")","v":""},{"$f":"IF(F$394>0,(HLOOKUP(F$391,'Base de dados'!$B$5:$AIN$11,$M399,0)),\"\")","v":""},{"$f":"IF(G$394>0,(HLOOKUP(G$391,'Base de dados'!$B$5:$AIN$11,$M399,0)),\"\")","v":""},{"$f":"IF(H$394>0,(HLOOKUP(H$391,'Base de dados'!$B$5:$AIN$11,$M399,0)),\"\")","v":""},{"$f":"IF(I$394>0,(HLOOKUP(I$391,'Base de dados'!$B$5:$AIN$11,$M399,0)),\"\")","v":""},{"$f":"IF(J$394>0,(HLOOKUP(J$391,'Base de dados'!$B$5:$AIN$11,$M399,0)),\"\")","v":""},{"$f":"IF(K$394>0,(HLOOKUP(K$391,'Base de dados'!$B$5:$AIN$11,$M399,0)),\"\")","v":""},{"$f":"IF(L$394>0,(HLOOKUP(L$391,'Base de dados'!$B$5:$AIN$11,$M399,0)),\"\")","v":""},3]
[null,"Toxicidade (mg kg-1 day-1)",null,{"$f":"IF(D$394>0,(HLOOKUP(D$391,'Base de dados'!$B$5:$AIN$11,$M400,0)),\"\")","v":""},{"$f":"IF(E$394>0,(HLOOKUP(E$391,'Base de dados'!$B$5:$AIN$11,$M400,0)),\"\")","v":""},{"$f":"IF(F$394>0,(HLOOKUP(F$391,'Base de dados'!$B$5:$AIN$11,$M400,0)),\"\")","v":""},{"$f":"IF(G$394>0,(HLOOKUP(G$391,'Base de dados'!$B$5:$AIN$11,$M400,0)),\"\")","v":""},{"$f":"IF(H$394>0,(HLOOKUP(H$391,'Base de dados'!$B$5:$AIN$11,$M400,0)),\"\")","v":""},{"$f":"IF(I$394>0,(HLOOKUP(I$391,'Base de dados'!$B$5:$AIN$11,$M400,0)),\"\")","v":""},{"$f":"IF(J$394>0,(HLOOKUP(J$391,'Base de dados'!$B$5:$AIN$11,$M400,0)),\"\")","v":""},{"$f":"IF(K$394>0,(HLOOKUP(K$391,'Base de dados'!$B$5:$AIN$11,$M400,0)),\"\")","v":""},{"$f":"IF(L$394>0,(HLOOKUP(L$391,'Base de dados'!$B$5:$AIN$11,$M400,0)),\"\")","v":""},4]
[null,"Índice para toxicidade do produto\t",null,{"$f":"IF(D$394>0,(HLOOKUP(D$391,'Base de dados'!$B$5:$AIN$11,$M401,0)),\"\")","v":""},{"$f":"IF(E$394>0,(HLOOKUP(E$391,'Base de dados'!$B$5:$AIN$11,$M401,0)),\"\")","v":""},{"$f":"IF(F$394>0,(HLOOKUP(F$391,'Base de dados'!$B$5:$AIN$11,$M401,0)),\"\")","v":""},{"$f":"IF(G$394>0,(HLOOKUP(G$391,'Base de dados'!$B$5:$AIN$11,$M401,0)),\"\")","v":""},{"$f":"IF(H$394>0,(HLOOKUP(H$391,'Base de dados'!$B$5:$AIN$11,$M401,0)),\"\")","v":""},{"$f":"IF(I$394>0,(HLOOKUP(I$391,'Base de dados'!$B$5:$AIN$11,$M401,0)),\"\")","v":""},{"$f":"IF(J$394>0,(HLOOKUP(J$391,'Base de dados'!$B$5:$AIN$11,$M401,0)),\"\")","v":""},{"$f":"IF(K$394>0,(HLOOKUP(K$391,'Base de dados'!$B$5:$AIN$11,$M401,0)),\"\")","v":""},{"$f":"IF(L$394>0,(HLOOKUP(L$391,'Base de dados'!$B$5:$AIN$11,$M401,0)),\"\")","v":""},5]
[null,"Koc",null,{"$f":"IF(D$394>0,(HLOOKUP(D$391,'Base de dados'!$B$5:$AIN$11,$M402,0)),\"\")","v":""},{"$f":"IF(E$394>0,(HLOOKUP(E$391,'Base de dados'!$B$5:$AIN$11,$M402,0)),\"\")","v":""},{"$f":"IF(F$394>0,(HLOOKUP(F$391,'Base de dados'!$B$5:$AIN$11,$M402,0)),\"\")","v":""},{"$f":"IF(G$394>0,(HLOOKUP(G$391,'Base de dados'!$B$5:$AIN$11,$M402,0)),\"\")","v":""},{"$f":"IF(H$394>0,(HLOOKUP(H$391,'Base de dados'!$B$5:$AIN$11,$M402,0)),\"\")","v":""},{"$f":"IF(I$394>0,(HLOOKUP(I$391,'Base de dados'!$B$5:$AIN$11,$M402,0)),\"\")","v":""},{"$f":"IF(J$394>0,(HLOOKUP(J$391,'Base de dados'!$B$5:$AIN$11,$M402,0)),\"\")","v":""},{"$f":"IF(K$394>0,(HLOOKUP(K$391,'Base de dados'!$B$5:$AIN$11,$M402,0)),\"\")","v":""},{"$f":"IF(L$394>0,(HLOOKUP(L$391,'Base de dados'!$B$5:$AIN$11,$M402,0)),\"\")","v":""},6]
[null,"t1/2 (DT50)",null,{"$f":"IF(D$394>0,(HLOOKUP(D$391,'Base de dados'!$B$5:$AIN$11,$M403,0)),\"\")","v":""},{"$f":"IF(E$394>0,(HLOOKUP(E$391,'Base de dados'!$B$5:$AIN$11,$M403,0)),\"\")","v":""},{"$f":"IF(F$394>0,(HLOOKUP(F$391,'Base de dados'!$B$5:$AIN$11,$M403,0)),\"\")","v":""},{"$f":"IF(G$394>0,(HLOOKUP(G$391,'Base de dados'!$B$5:$AIN$11,$M403,0)),\"\")","v":""},{"$f":"IF(H$394>0,(HLOOKUP(H$391,'Base de dados'!$B$5:$AIN$11,$M403,0)),\"\")","v":""},{"$f":"IF(I$394>0,(HLOOKUP(I$391,'Base de dados'!$B$5:$AIN$11,$M403,0)),\"\")","v":""},{"$f":"IF(J$394>0,(HLOOKUP(J$391,'Base de dados'!$B$5:$AIN$11,$M403,0)),\"\")","v":""},{"$f":"IF(K$394>0,(HLOOKUP(K$391,'Base de dados'!$B$5:$AIN$11,$M403,0)),\"\")","v":""},{"$f":"IF(L$394>0,(HLOOKUP(L$391,'Base de dados'!$B$5:$AIN$11,$M403,0)),\"\")","v":""},7]
[null,"GUS\t",null,{"$f":"IF(D394=0,\"\",IF(LOG10(D403)*(4-LOG10(D402))<=0,0,IF(OR(LOG10(D403)*(4-LOG10(D402))>0,),(LOG10(D403)*(4-LOG10(D402))),IF((LOG10(D403)*(4-LOG10(D402))>0),(LOG10(D403)*(4-LOG10(D402)))))))","v":""},{"$f":"IF(E394=0,\"\",IF(LOG10(E403)*(4-LOG10(E402))<=0,0,IF(OR(LOG10(E403)*(4-LOG10(E402))>0,),(LOG10(E403)*(4-LOG10(E402))),IF((LOG10(E403)*(4-LOG10(E402))>0),(LOG10(E403)*(4-LOG10(E402)))))))","v":""},"","","","","","",""]
[null,"Potencial de contaminação (1, 2 or 3)",null,{"$f":"IF(D394>0,(IF(OR(Fórmulas!H367=0.83,Fórmulas!H367<0.83),1,IF(OR(AND(0.83<Fórmulas!H367,Fórmulas!H367<=1.66)),2,IF(Fórmulas!H367>1.66,3,\"\")))),\"\")","v":""},{"$f":"IF(E394>0,(IF(OR(Fórmulas!I367=0.83,Fórmulas!I367<0.83),1,IF(OR(AND(0.83<Fórmulas!I367,Fórmulas!I367<=1.66)),2,IF(Fórmulas!I367>1.66,3,\"\")))),\"\")","v":""},{"$f":"IF(F394>0,(IF(OR(Fórmulas!J367=0.83,Fórmulas!J367<0.83),1,IF(OR(AND(0.83<Fórmulas!J367,Fórmulas!J367<=1.66)),2,IF(Fórmulas!J367>1.66,3,\"\")))),\"\")","v":""},{"$f":"IF(G394>0,(IF(OR(Fórmulas!K367=0.83,Fórmulas!K367<0.83),1,IF(OR(AND(0.83<Fórmulas!K367,Fórmulas!K367<=1.66)),2,IF(Fórmulas!K367>1.66,3,\"\")))),\"\")","v":""},{"$f":"IF(H394>0,(IF(OR(Fórmulas!L367=0.83,Fórmulas!L367<0.83),1,IF(OR(AND(0.83<Fórmulas!L367,Fórmulas!L367<=1.66)),2,IF(Fórmulas!L367>1.66,3,\"\")))),\"\")","v":""},{"$f":"IF(I394>0,(IF(OR(Fórmulas!M367=0.83,Fórmulas!M367<0.83),1,IF(OR(AND(0.83<Fórmulas!M367,Fórmulas!M367<=1.66)),2,IF(Fórmulas!M367>1.66,3,\"\")))),\"\")","v":""},{"$f":"IF(J394>0,(IF(OR(Fórmulas!N367=0.83,Fórmulas!N367<0.83),1,IF(OR(AND(0.83<Fórmulas!N367,Fórmulas!N367<=1.66)),2,IF(Fórmulas!N367>1.66,3,\"\")))),\"\")","v":""},{"$f":"IF(K394>0,(IF(OR(B379=0.83,B379<0.83),1,IF(OR(AND(0.83<B379,B379<=1.66)),2,IF(B379>1.66,3,\"\")))),\"\")","v":""},{"$f":"IF(L394>0,(IF(OR(C379=0.83,C379<0.83),1,IF(OR(AND(0.83<C379,C379<=1.66)),2,IF(C379>1.66,3,\"\")))),\"\")","v":""}]
[null,"EIQ Impacto ao trabalhador rural",null,{"$f":"IF(D$394>0,(HLOOKUP(D$391,'Base de dados'!$B$5:$AIN$18,$M406,0)),\"\")","v":""},{"$f":"IF(E$394>0,(HLOOKUP(E$391,'Base de dados'!$B$5:$AIN$18,$M406,0)),\"\")","v":""},{"$f":"IF(F$394>0,(HLOOKUP(F$391,'Base de dados'!$B$5:$AIN$18,$M406,0)),\"\")","v":""},{"$f":"IF(G$394>0,(HLOOKUP(G$391,'Base de dados'!$B$5:$AIN$18,$M406,0)),\"\")","v":""},{"$f":"IF(H$394>0,(HLOOKUP(H$391,'Base de dados'!$B$5:$AIN$18,$M406,0)),\"\")","v":""},{"$f":"IF(I$394>0,(HLOOKUP(I$391,'Base de dados'!$B$5:$AIN$18,$M406,0)),\"\")","v":""},{"$f":"IF(J$394>0,(HLOOKUP(J$391,'Base de dados'!$B$5:$AIN$18,$M406,0)),\"\")","v":""},{"$f":"IF(K$394>0,(HLOOKUP(K$391,'Base de dados'!$B$5:$AIN$18,$M406,0)),\"\")","v":""},{"$f":"IF(L$394>0,(HLOOKUP(L$391,'Base de dados'!$B$5:$AIN$18,$M406,0)),\"\")","v":""},12]
[null,"EIQ Impacto ao consumidor",null,{"$f":"IF(D$394>0,(HLOOKUP(D$391,'Base de dados'!$B$5:$AIN$18,$M407,0)),\"\")","v":""},{"$f":"IF(E$394>0,(HLOOKUP(E$391,'Base de dados'!$B$5:$AIN$18,$M407,0)),\"\")","v":""},{"$f":"IF(F$394>0,(HLOOKUP(F$391,'Base de dados'!$B$5:$AIN$18,$M407,0)),\"\")","v":""},{"$f":"IF(G$394>0,(HLOOKUP(G$391,'Base de dados'!$B$5:$AIN$18,$M407,0)),\"\")","v":""},{"$f":"IF(H$394>0,(HLOOKUP(H$391,'Base de dados'!$B$5:$AIN$18,$M407,0)),\"\")","v":""},{"$f":"IF(I$394>0,(HLOOKUP(I$391,'Base de dados'!$B$5:$AIN$18,$M407,0)),\"\")","v":""},{"$f":"IF(J$394>0,(HLOOKUP(J$391,'Base de dados'!$B$5:$AIN$18,$M407,0)),\"\")","v":""},{"$f":"IF(K$394>0,(HLOOKUP(K$391,'Base de dados'!$B$5:$AIN$18,$M407,0)),\"\")","v":""},{"$f":"IF(L$394>0,(HLOOKUP(L$391,'Base de dados'!$B$5:$AIN$18,$M407,0)),\"\")","v":""},13]
[null,"EIQ Impacto ao meio ambiente",null,{"$f":"IF(D$394>0,(HLOOKUP(D$391,'Base de dados'!$B$5:$AIN$18,$M408,0)),\"\")","v":""},{"$f":"IF(E$394>0,(HLOOKUP(E$391,'Base de dados'!$B$5:$AIN$18,$M408,0)),\"\")","v":""},{"$f":"IF(F$394>0,(HLOOKUP(F$391,'Base de dados'!$B$5:$AIN$18,$M408,0)),\"\")","v":""},{"$f":"IF(G$394>0,(HLOOKUP(G$391,'Base de dados'!$B$5:$AIN$18,$M408,0)),\"\")","v":""},{"$f":"IF(H$394>0,(HLOOKUP(H$391,'Base de dados'!$B$5:$AIN$18,$M408,0)),\"\")","v":""},{"$f":"IF(I$394>0,(HLOOKUP(I$391,'Base de dados'!$B$5:$AIN$18,$M408,0)),\"\")","v":""},{"$f":"IF(J$394>0,(HLOOKUP(J$391,'Base de dados'!$B$5:$AIN$18,$M408,0)),\"\")","v":""},{"$f":"IF(K$394>0,(HLOOKUP(K$391,'Base de dados'!$B$5:$AIN$18,$M408,0)),\"\")","v":""},{"$f":"IF(L$394>0,(HLOOKUP(L$391,'Base de dados'!$B$5:$AIN$18,$M408,0)),\"\")","v":""},14]
[null,"Environmental Impact Quotient (EIQ)",null,{"$f":"IF(D$394>0,(HLOOKUP(D$391,'Base de dados'!$B$5:$AIN$18,$M409,0)),\"\")","v":""},{"$f":"IF(E$394>0,(HLOOKUP(E$391,'Base de dados'!$B$5:$AIN$18,$M409,0)),\"\")","v":""},{"$f":"IF(F$394>0,(HLOOKUP(F$391,'Base de dados'!$B$5:$AIN$18,$M409,0)),\"\")","v":""},{"$f":"IF(G$394>0,(HLOOKUP(G$391,'Base de dados'!$B$5:$AIN$18,$M409,0)),\"\")","v":""},{"$f":"IF(H$394>0,(HLOOKUP(H$391,'Base de dados'!$B$5:$AIN$18,$M409,0)),\"\")","v":""},{"$f":"IF(I$394>0,(HLOOKUP(I$391,'Base de dados'!$B$5:$AIN$18,$M409,0)),\"\")","v":""},{"$f":"IF(J$394>0,(HLOOKUP(J$391,'Base de dados'!$B$5:$AIN$18,$M409,0)),\"\")","v":""},{"$f":"IF(K$394>0,(HLOOKUP(K$391,'Base de dados'!$B$5:$AIN$18,$M409,0)),\"\")","v":""},{"$f":"IF(L$394>0,(HLOOKUP(L$391,'Base de dados'!$B$5:$AIN$18,$M409,0)),\"\")","v":""},11]
[null,"Pesticidas banidos na União Européia",null,{"$f":"IF(D$394>0,(HLOOKUP(D$391,'Base de dados'!$B$5:$AIN$19,$M410,0)),\"\")","v":""},{"$f":"IF(E$394>0,(HLOOKUP(E$391,'Base de dados'!$B$5:$AIN$19,$M410,0)),\"\")","v":""},{"$f":"IF(F$394>0,(HLOOKUP(F$391,'Base de dados'!$B$5:$AIN$19,$M410,0)),\"\")","v":""},{"$f":"IF(G$394>0,(HLOOKUP(G$391,'Base de dados'!$B$5:$AIN$19,$M410,0)),\"\")","v":""},{"$f":"IF(H$394>0,(HLOOKUP(H$391,'Base de dados'!$B$5:$AIN$19,$M410,0)),\"\")","v":""},{"$f":"IF(I$394>0,(HLOOKUP(I$391,'Base de dados'!$B$5:$AIN$19,$M410,0)),\"\")","v":""},{"$f":"IF(J$394>0,(HLOOKUP(J$391,'Base de dados'!$B$5:$AIN$19,$M410,0)),\"\")","v":""},{"$f":"IF(K$394>0,(HLOOKUP(K$391,'Base de dados'!$B$5:$AIN$19,$M410,0)),\"\")","v":""},{"$f":"IF(L$394>0,(HLOOKUP(L$391,'Base de dados'!$B$5:$AIN$19,$M410,0)),\"\")","v":""},15]
[]
[null,"Teor de argila no solo                                                             > 60% (1); 30% - 60% (2); <30% (3)\t"]
[null,"Distância do curso d' água (borda do talhão) >1.000m (1);  300 - 1.000m (2);  <300m (3)\t"]
[null,"Tipo de manejo do solo: Solo protegido (1); Solo sem revolvimento (2); Solo com revolvimento (3)\t"]
[null,"Vulnerabilidade do talhão  (1, 2 ou 3)\t",null,{"$f":"IF(D395>0,(IF(OR(AND(1<=Fórmulas!H368,Fórmulas!H368<=3)),1,IF(OR(AND(3<Fórmulas!H368,Fórmulas!H368<=9)),2,IF(Fórmulas!H368>9,3)))),\"\")","v":""},{"$f":"IF(E395>0,(IF(OR(AND(1<=Fórmulas!I368,Fórmulas!I368<=3)),1,IF(OR(AND(3<Fórmulas!I368,Fórmulas!I368<=9)),2,IF(Fórmulas!I368>9,3)))),\"\")","v":""},{"$f":"IF(F395>0,(IF(OR(AND(1<=Fórmulas!J368,Fórmulas!J368<=3)),1,IF(OR(AND(3<Fórmulas!J368,Fórmulas!J368<=9)),2,IF(Fórmulas!J368>9,3)))),\"\")","v":""},{"$f":"IF(G395>0,(IF(OR(AND(1<=Fórmulas!K368,Fórmulas!K368<=3)),1,IF(OR(AND(3<Fórmulas!K368,Fórmulas!K368<=9)),2,IF(Fórmulas!K368>9,3)))),\"\")","v":""},{"$f":"IF(H395>0,(IF(OR(AND(1<=Fórmulas!L368,Fórmulas!L368<=3)),1,IF(OR(AND(3<Fórmulas!L368,Fórmulas!L368<=9)),2,IF(Fórmulas!L368>9,3)))),\"\")","v":""},{"$f":"IF(I395>0,(IF(OR(AND(1<=Fórmulas!M368,Fórmulas!M368<=3)),1,IF(OR(AND(3<Fórmulas!M368,Fórmulas!M368<=9)),2,IF(Fórmulas!M368>9,3)))),\"\")","v":""},{"$f":"IF(J395>0,(IF(OR(AND(1<=Fórmulas!N368,Fórmulas!N368<=3)),1,IF(OR(AND(3<Fórmulas!N368,Fórmulas!N368<=9)),2,IF(Fórmulas!N368>9,3)))),\"\")","v":""},{"$f":"IF(K395>0,(IF(OR(AND(1<=Fórmulas!B380,Fórmulas!B380<=3)),1,IF(OR(AND(3<Fórmulas!B380,Fórmulas!B380<=9)),2,IF(Fórmulas!B380>9,3)))),\"\")","v":""},{"$f":"IF(L395>0,(IF(OR(AND(1<=Fórmulas!C380,Fórmulas!C380<=3)),1,IF(OR(AND(3<Fórmulas!C380,Fórmulas!C380<=9)),2,IF(Fórmulas!C380>9,3)))),\"\")","v":""}]
[]
[null,"Risco de contaminação (1, 2 ou 3)",null,{"$f":"IF(D395>0,(IF(OR(AND(1<=Fórmulas!H370,Fórmulas!H370<=2)),1,IF(OR(AND(2<Fórmulas!H370,Fórmulas!H370<=4)),2,IF(Fórmulas!H370>4,3)))),\"\")","v":""},{"$f":"IF(E395>0,(IF(OR(AND(1<=Fórmulas!I370,Fórmulas!I370<=2)),1,IF(OR(AND(2<Fórmulas!I370,Fórmulas!I370<=4)),2,IF(Fórmulas!I370>4,3)))),\"\")","v":""},{"$f":"IF(F395>0,(IF(OR(AND(1<=Fórmulas!J370,Fórmulas!J370<=2)),1,IF(OR(AND(2<Fórmulas!J370,Fórmulas!J370<=4)),2,IF(Fórmulas!J370>4,3)))),\"\")","v":""},{"$f":"IF(G395>0,(IF(OR(AND(1<=Fórmulas!K370,Fórmulas!K370<=2)),1,IF(OR(AND(2<Fórmulas!K370,Fórmulas!K370<=4)),2,IF(Fórmulas!K370>4,3)))),\"\")","v":""},{"$f":"IF(H395>0,(IF(OR(AND(1<=Fórmulas!L370,Fórmulas!L370<=2)),1,IF(OR(AND(2<Fórmulas!L370,Fórmulas!L370<=4)),2,IF(Fórmulas!L370>4,3)))),\"\")","v":""},{"$f":"IF(I395>0,(IF(OR(AND(1<=Fórmulas!M370,Fórmulas!M370<=2)),1,IF(OR(AND(2<Fórmulas!M370,Fórmulas!M370<=4)),2,IF(Fórmulas!M370>4,3)))),\"\")","v":""},{"$f":"IF(J395>0,(IF(OR(AND(1<=Fórmulas!N370,Fórmulas!N370<=2)),1,IF(OR(AND(2<Fórmulas!N370,Fórmulas!N370<=4)),2,IF(Fórmulas!N370>4,3)))),\"\")","v":""},{"$f":"IF(K395>0,(IF(OR(AND(1<=Fórmulas!B382,Fórmulas!B382<=2)),1,IF(OR(AND(2<Fórmulas!B382,Fórmulas!B382<=4)),2,IF(Fórmulas!B382>4,3)))),\"\")","v":""},{"$f":"IF(L395>0,(IF(OR(AND(1<=Fórmulas!C382,Fórmulas!C382<=2)),1,IF(OR(AND(2<Fórmulas!C382,Fórmulas!C382<=4)),2,IF(Fórmulas!C382>4,3)))),\"\")","v":""}]
[]
[]
[null,"Nome comercial do produto (selecione)\t"]
[null,"Ingrediente ativo (%)\t"]
[null,"Descrição da cultura\t"]
[null,"Área (ha)\t"]
[null,"Volume aplicado L/ha ou kg/ha \t"]
[null,"Volume total aplicado por produto\t",null,{"$f":"+D424*D423","v":{"v":0,"d":"0.0"}},{"v":0,"d":"0.0"},{"v":0,"d":"0.0"},{"v":0,"d":"0.0"},{"v":0,"d":"0.0"},{"v":0,"d":"0.0"},{"v":0,"d":"0.0"},{"v":0,"d":"0.0"},{"v":0,"d":"0.0"}]
[]
[null,"Ingrediente ativo do produto \t",null,{"$f":"IF(D$423>0,(HLOOKUP(D$420,'Base de dados'!$B$5:$AIN$11,$M427,0)),\"\")","v":""},{"$f":"IF(E$423>0,(HLOOKUP(E$420,'Base de dados'!$B$5:$AIN$11,$M427,0)),\"\")","v":""},{"$f":"IF(F$423>0,(HLOOKUP(F$420,'Base de dados'!$B$5:$AIN$11,$M427,0)),\"\")","v":""},{"$f":"IF(G$423>0,(HLOOKUP(G$420,'Base de dados'!$B$5:$AIN$11,$M427,0)),\"\")","v":""},{"$f":"IF(H$423>0,(HLOOKUP(H$420,'Base de dados'!$B$5:$AIN$11,$M427,0)),\"\")","v":""},{"$f":"IF(I$423>0,(HLOOKUP(I$420,'Base de dados'!$B$5:$AIN$11,$M427,0)),\"\")","v":""},{"$f":"IF(J$423>0,(HLOOKUP(J$420,'Base de dados'!$B$5:$AIN$11,$M427,0)),\"\")","v":""},{"$f":"IF(K$423>0,(HLOOKUP(K$420,'Base de dados'!$B$5:$AIN$11,$M427,0)),\"\")","v":""},{"$f":"IF(L$423>0,(HLOOKUP(L$420,'Base de dados'!$B$5:$AIN$11,$M427,0)),\"\")","v":""},2]
[null,"Toxicidade para peixes - 96h LC50 (mg L-1)\t",null,{"$f":"IF(D$423>0,(HLOOKUP(D$420,'Base de dados'!$B$5:$AIN$11,$M428,0)),\"\")","v":""},{"$f":"IF(E$423>0,(HLOOKUP(E$420,'Base de dados'!$B$5:$AIN$11,$M428,0)),\"\")","v":""},{"$f":"IF(F$423>0,(HLOOKUP(F$420,'Base de dados'!$B$5:$AIN$11,$M428,0)),\"\")","v":""},{"$f":"IF(G$423>0,(HLOOKUP(G$420,'Base de dados'!$B$5:$AIN$11,$M428,0)),\"\")","v":""},{"$f":"IF(H$423>0,(HLOOKUP(H$420,'Base de dados'!$B$5:$AIN$11,$M428,0)),\"\")","v":""},{"$f":"IF(I$423>0,(HLOOKUP(I$420,'Base de dados'!$B$5:$AIN$11,$M428,0)),\"\")","v":""},{"$f":"IF(J$423>0,(HLOOKUP(J$420,'Base de dados'!$B$5:$AIN$11,$M428,0)),\"\")","v":""},{"$f":"IF(K$423>0,(HLOOKUP(K$420,'Base de dados'!$B$5:$AIN$11,$M428,0)),\"\")","v":""},{"$f":"IF(L$423>0,(HLOOKUP(L$420,'Base de dados'!$B$5:$AIN$11,$M428,0)),\"\")","v":""},3]
[null,"Toxicidade (mg kg-1 day-1)",null,{"$f":"IF(D$423>0,(HLOOKUP(D$420,'Base de dados'!$B$5:$AIN$11,$M429,0)),\"\")","v":""},{"$f":"IF(E$423>0,(HLOOKUP(E$420,'Base de dados'!$B$5:$AIN$11,$M429,0)),\"\")","v":""},{"$f":"IF(F$423>0,(HLOOKUP(F$420,'Base de dados'!$B$5:$AIN$11,$M429,0)),\"\")","v":""},{"$f":"IF(G$423>0,(HLOOKUP(G$420,'Base de dados'!$B$5:$AIN$11,$M429,0)),\"\")","v":""},{"$f":"IF(H$423>0,(HLOOKUP(H$420,'Base de dados'!$B$5:$AIN$11,$M429,0)),\"\")","v":""},{"$f":"IF(I$423>0,(HLOOKUP(I$420,'Base de dados'!$B$5:$AIN$11,$M429,0)),\"\")","v":""},{"$f":"IF(J$423>0,(HLOOKUP(J$420,'Base de dados'!$B$5:$AIN$11,$M429,0)),\"\")","v":""},{"$f":"IF(K$423>0,(HLOOKUP(K$420,'Base de dados'!$B$5:$AIN$11,$M429,0)),\"\")","v":""},{"$f":"IF(L$423>0,(HLOOKUP(L$420,'Base de dados'!$B$5:$AIN$11,$M429,0)),\"\")","v":""},4]
[null,"Índice para toxicidade do produto\t",null,{"$f":"IF(D$423>0,(HLOOKUP(D$420,'Base de dados'!$B$5:$AIN$11,$M430,0)),\"\")","v":""},{"$f":"IF(E$423>0,(HLOOKUP(E$420,'Base de dados'!$B$5:$AIN$11,$M430,0)),\"\")","v":""},{"$f":"IF(F$423>0,(HLOOKUP(F$420,'Base de dados'!$B$5:$AIN$11,$M430,0)),\"\")","v":""},{"$f":"IF(G$423>0,(HLOOKUP(G$420,'Base de dados'!$B$5:$AIN$11,$M430,0)),\"\")","v":""},{"$f":"IF(H$423>0,(HLOOKUP(H$420,'Base de dados'!$B$5:$AIN$11,$M430,0)),\"\")","v":""},{"$f":"IF(I$423>0,(HLOOKUP(I$420,'Base de dados'!$B$5:$AIN$11,$M430,0)),\"\")","v":""},{"$f":"IF(J$423>0,(HLOOKUP(J$420,'Base de dados'!$B$5:$AIN$11,$M430,0)),\"\")","v":""},{"$f":"IF(K$423>0,(HLOOKUP(K$420,'Base de dados'!$B$5:$AIN$11,$M430,0)),\"\")","v":""},{"$f":"IF(L$423>0,(HLOOKUP(L$420,'Base de dados'!$B$5:$AIN$11,$M430,0)),\"\")","v":""},5]
[null,"Koc",null,{"$f":"IF(D$423>0,(HLOOKUP(D$420,'Base de dados'!$B$5:$AIN$11,$M431,0)),\"\")","v":""},{"$f":"IF(E$423>0,(HLOOKUP(E$420,'Base de dados'!$B$5:$AIN$11,$M431,0)),\"\")","v":""},{"$f":"IF(F$423>0,(HLOOKUP(F$420,'Base de dados'!$B$5:$AIN$11,$M431,0)),\"\")","v":""},{"$f":"IF(G$423>0,(HLOOKUP(G$420,'Base de dados'!$B$5:$AIN$11,$M431,0)),\"\")","v":""},{"$f":"IF(H$423>0,(HLOOKUP(H$420,'Base de dados'!$B$5:$AIN$11,$M431,0)),\"\")","v":""},{"$f":"IF(I$423>0,(HLOOKUP(I$420,'Base de dados'!$B$5:$AIN$11,$M431,0)),\"\")","v":""},{"$f":"IF(J$423>0,(HLOOKUP(J$420,'Base de dados'!$B$5:$AIN$11,$M431,0)),\"\")","v":""},{"$f":"IF(K$423>0,(HLOOKUP(K$420,'Base de dados'!$B$5:$AIN$11,$M431,0)),\"\")","v":""},{"$f":"IF(L$423>0,(HLOOKUP(L$420,'Base de dados'!$B$5:$AIN$11,$M431,0)),\"\")","v":""},6]
[null,"t1/2 (DT50)",null,{"$f":"IF(D$423>0,(HLOOKUP(D$420,'Base de dados'!$B$5:$AIN$11,$M432,0)),\"\")","v":""},{"$f":"IF(E$423>0,(HLOOKUP(E$420,'Base de dados'!$B$5:$AIN$11,$M432,0)),\"\")","v":""},{"$f":"IF(F$423>0,(HLOOKUP(F$420,'Base de dados'!$B$5:$AIN$11,$M432,0)),\"\")","v":""},{"$f":"IF(G$423>0,(HLOOKUP(G$420,'Base de dados'!$B$5:$AIN$11,$M432,0)),\"\")","v":""},{"$f":"IF(H$423>0,(HLOOKUP(H$420,'Base de dados'!$B$5:$AIN$11,$M432,0)),\"\")","v":""},{"$f":"IF(I$423>0,(HLOOKUP(I$420,'Base de dados'!$B$5:$AIN$11,$M432,0)),\"\")","v":""},{"$f":"IF(J$423>0,(HLOOKUP(J$420,'Base de dados'!$B$5:$AIN$11,$M432,0)),\"\")","v":""},{"$f":"IF(K$423>0,(HLOOKUP(K$420,'Base de dados'!$B$5:$AIN$11,$M432,0)),\"\")","v":""},{"$f":"IF(L$423>0,(HLOOKUP(L$420,'Base de dados'!$B$5:$AIN$11,$M432,0)),\"\")","v":""},7]
[null,"GUS\t",null,{"$f":"IF(D423=0,\"\",IF(LOG10(D432)*(4-LOG10(D431))<=0,0,IF(OR(LOG10(D432)*(4-LOG10(D431))>0,),(LOG10(D432)*(4-LOG10(D431))),IF((LOG10(D432)*(4-LOG10(D431))>0),(LOG10(D432)*(4-LOG10(D431)))))))","v":""},{"$f":"IF(E423=0,\"\",IF(LOG10(E432)*(4-LOG10(E431))<=0,0,IF(OR(LOG10(E432)*(4-LOG10(E431))>0,),(LOG10(E432)*(4-LOG10(E431))),IF((LOG10(E432)*(4-LOG10(E431))>0),(LOG10(E432)*(4-LOG10(E431)))))))","v":""},"","","","","","",""]
[null,"Potencial de contaminação (1, 2 or 3)",null,{"$f":"IF(D423>0,(IF(OR(D379=0.83,D379<0.83),1,IF(OR(AND(0.83<D379,D379<=1.66)),2,IF(D379>1.66,3,\"\")))),\"\")","v":""},{"$f":"IF(E423>0,(IF(OR(E379=0.83,E379<0.83),1,IF(OR(AND(0.83<E379,E379<=1.66)),2,IF(E379>1.66,3,\"\")))),\"\")","v":""},"","","","","","",""]
[null,"EIQ Impacto ao trabalhador rural",null,{"$f":"IF(D$423>0,(HLOOKUP(D$420,'Base de dados'!$B$5:$AIN$18,$M435,0)),\"\")","v":""},{"$f":"IF(E$423>0,(HLOOKUP(E$420,'Base de dados'!$B$5:$AIN$18,$M435,0)),\"\")","v":""},{"$f":"IF(F$423>0,(HLOOKUP(F$420,'Base de dados'!$B$5:$AIN$18,$M435,0)),\"\")","v":""},{"$f":"IF(G$423>0,(HLOOKUP(G$420,'Base de dados'!$B$5:$AIN$18,$M435,0)),\"\")","v":""},{"$f":"IF(H$423>0,(HLOOKUP(H$420,'Base de dados'!$B$5:$AIN$18,$M435,0)),\"\")","v":""},{"$f":"IF(I$423>0,(HLOOKUP(I$420,'Base de dados'!$B$5:$AIN$18,$M435,0)),\"\")","v":""},{"$f":"IF(J$423>0,(HLOOKUP(J$420,'Base de dados'!$B$5:$AIN$18,$M435,0)),\"\")","v":""},{"$f":"IF(K$423>0,(HLOOKUP(K$420,'Base de dados'!$B$5:$AIN$18,$M435,0)),\"\")","v":""},{"$f":"IF(L$423>0,(HLOOKUP(L$420,'Base de dados'!$B$5:$AIN$18,$M435,0)),\"\")","v":""},12]
[null,"EIQ Impacto ao consumidor",null,{"$f":"IF(D$423>0,(HLOOKUP(D$420,'Base de dados'!$B$5:$AIN$18,$M436,0)),\"\")","v":""},{"$f":"IF(E$423>0,(HLOOKUP(E$420,'Base de dados'!$B$5:$AIN$18,$M436,0)),\"\")","v":""},{"$f":"IF(F$423>0,(HLOOKUP(F$420,'Base de dados'!$B$5:$AIN$18,$M436,0)),\"\")","v":""},{"$f":"IF(G$423>0,(HLOOKUP(G$420,'Base de dados'!$B$5:$AIN$18,$M436,0)),\"\")","v":""},{"$f":"IF(H$423>0,(HLOOKUP(H$420,'Base de dados'!$B$5:$AIN$18,$M436,0)),\"\")","v":""},{"$f":"IF(I$423>0,(HLOOKUP(I$420,'Base de dados'!$B$5:$AIN$18,$M436,0)),\"\")","v":""},{"$f":"IF(J$423>0,(HLOOKUP(J$420,'Base de dados'!$B$5:$AIN$18,$M436,0)),\"\")","v":""},{"$f":"IF(K$423>0,(HLOOKUP(K$420,'Base de dados'!$B$5:$AIN$18,$M436,0)),\"\")","v":""},{"$f":"IF(L$423>0,(HLOOKUP(L$420,'Base de dados'!$B$5:$AIN$18,$M436,0)),\"\")","v":""},13]
[null,"EIQ Impacto ao meio ambiente",null,{"$f":"IF(D$423>0,(HLOOKUP(D$420,'Base de dados'!$B$5:$AIN$18,$M437,0)),\"\")","v":""},{"$f":"IF(E$423>0,(HLOOKUP(E$420,'Base de dados'!$B$5:$AIN$18,$M437,0)),\"\")","v":""},{"$f":"IF(F$423>0,(HLOOKUP(F$420,'Base de dados'!$B$5:$AIN$18,$M437,0)),\"\")","v":""},{"$f":"IF(G$423>0,(HLOOKUP(G$420,'Base de dados'!$B$5:$AIN$18,$M437,0)),\"\")","v":""},{"$f":"IF(H$423>0,(HLOOKUP(H$420,'Base de dados'!$B$5:$AIN$18,$M437,0)),\"\")","v":""},{"$f":"IF(I$423>0,(HLOOKUP(I$420,'Base de dados'!$B$5:$AIN$18,$M437,0)),\"\")","v":""},{"$f":"IF(J$423>0,(HLOOKUP(J$420,'Base de dados'!$B$5:$AIN$18,$M437,0)),\"\")","v":""},{"$f":"IF(K$423>0,(HLOOKUP(K$420,'Base de dados'!$B$5:$AIN$18,$M437,0)),\"\")","v":""},{"$f":"IF(L$423>0,(HLOOKUP(L$420,'Base de dados'!$B$5:$AIN$18,$M437,0)),\"\")","v":""},14]
[null,"Environmental Impact Quotient (EIQ)",null,{"$f":"IF(D$423>0,(HLOOKUP(D$420,'Base de dados'!$B$5:$AIN$18,$M438,0)),\"\")","v":""},{"$f":"IF(E$423>0,(HLOOKUP(E$420,'Base de dados'!$B$5:$AIN$18,$M438,0)),\"\")","v":""},{"$f":"IF(F$423>0,(HLOOKUP(F$420,'Base de dados'!$B$5:$AIN$18,$M438,0)),\"\")","v":""},{"$f":"IF(G$423>0,(HLOOKUP(G$420,'Base de dados'!$B$5:$AIN$18,$M438,0)),\"\")","v":""},{"$f":"IF(H$423>0,(HLOOKUP(H$420,'Base de dados'!$B$5:$AIN$18,$M438,0)),\"\")","v":""},{"$f":"IF(I$423>0,(HLOOKUP(I$420,'Base de dados'!$B$5:$AIN$18,$M438,0)),\"\")","v":""},{"$f":"IF(J$423>0,(HLOOKUP(J$420,'Base de dados'!$B$5:$AIN$18,$M438,0)),\"\")","v":""},{"$f":"IF(K$423>0,(HLOOKUP(K$420,'Base de dados'!$B$5:$AIN$18,$M438,0)),\"\")","v":""},{"$f":"IF(L$423>0,(HLOOKUP(L$420,'Base de dados'!$B$5:$AIN$18,$M438,0)),\"\")","v":""},11]
[null,"Pesticidas banidos na União Européia",null,{"$f":"IF(D$423>0,(HLOOKUP(D$420,'Base de dados'!$B$5:$AIN$19,$M439,0)),\"\")","v":""},{"$f":"IF(E$423>0,(HLOOKUP(E$420,'Base de dados'!$B$5:$AIN$19,$M439,0)),\"\")","v":""},{"$f":"IF(F$423>0,(HLOOKUP(F$420,'Base de dados'!$B$5:$AIN$19,$M439,0)),\"\")","v":""},{"$f":"IF(G$423>0,(HLOOKUP(G$420,'Base de dados'!$B$5:$AIN$19,$M439,0)),\"\")","v":""},{"$f":"IF(H$423>0,(HLOOKUP(H$420,'Base de dados'!$B$5:$AIN$19,$M439,0)),\"\")","v":""},{"$f":"IF(I$423>0,(HLOOKUP(I$420,'Base de dados'!$B$5:$AIN$19,$M439,0)),\"\")","v":""},{"$f":"IF(J$423>0,(HLOOKUP(J$420,'Base de dados'!$B$5:$AIN$19,$M439,0)),\"\")","v":""},{"$f":"IF(K$423>0,(HLOOKUP(K$420,'Base de dados'!$B$5:$AIN$19,$M439,0)),\"\")","v":""},{"$f":"IF(L$423>0,(HLOOKUP(L$420,'Base de dados'!$B$5:$AIN$19,$M439,0)),\"\")","v":""},15]
[]
[null,"Teor de argila no solo                                                             > 60% (1); 30% - 60% (2); <30% (3)\t"]
[null,"Distância do curso d' água (borda do talhão) >1.000m (1);  300 - 1.000m (2);  <300m (3)\t"]
[null,"Tipo de manejo do solo: Solo protegido (1); Solo sem revolvimento (2); Solo com revolvimento (3)\t"]
[null,"Vulnerabilidade do talhão  (1, 2 ou 3)\t",null,{"$f":"IF(D424>0,(IF(OR(AND(1<=Fórmulas!D380,Fórmulas!D380<=3)),1,IF(OR(AND(3<Fórmulas!D380,Fórmulas!D380<=9)),2,IF(Fórmulas!D380>9,3)))),\"\")","v":""},{"$f":"IF(E424>0,(IF(OR(AND(1<=Fórmulas!E380,Fórmulas!E380<=3)),1,IF(OR(AND(3<Fórmulas!E380,Fórmulas!E380<=9)),2,IF(Fórmulas!E380>9,3)))),\"\")","v":""},{"$f":"IF(F424>0,(IF(OR(AND(1<=Fórmulas!F380,Fórmulas!F380<=3)),1,IF(OR(AND(3<Fórmulas!F380,Fórmulas!F380<=9)),2,IF(Fórmulas!F380>9,3)))),\"\")","v":""},{"$f":"IF(G424>0,(IF(OR(AND(1<=Fórmulas!G380,Fórmulas!G380<=3)),1,IF(OR(AND(3<Fórmulas!G380,Fórmulas!G380<=9)),2,IF(Fórmulas!G380>9,3)))),\"\")","v":""},{"$f":"IF(H424>0,(IF(OR(AND(1<=Fórmulas!H380,Fórmulas!H380<=3)),1,IF(OR(AND(3<Fórmulas!H380,Fórmulas!H380<=9)),2,IF(Fórmulas!H380>9,3)))),\"\")","v":""},{"$f":"IF(I424>0,(IF(OR(AND(1<=Fórmulas!I380,Fórmulas!I380<=3)),1,IF(OR(AND(3<Fórmulas!I380,Fórmulas!I380<=9)),2,IF(Fórmulas!I380>9,3)))),\"\")","v":""},{"$f":"IF(J424>0,(IF(OR(AND(1<=Fórmulas!J380,Fórmulas!J380<=3)),1,IF(OR(AND(3<Fórmulas!J380,Fórmulas!J380<=9)),2,IF(Fórmulas!J380>9,3)))),\"\")","v":""},{"$f":"IF(K424>0,(IF(OR(AND(1<=Fórmulas!K380,Fórmulas!K380<=3)),1,IF(OR(AND(3<Fórmulas!K380,Fórmulas!K380<=9)),2,IF(Fórmulas!K380>9,3)))),\"\")","v":""},{"$f":"IF(L424>0,(IF(OR(AND(1<=Fórmulas!L380,Fórmulas!L380<=3)),1,IF(OR(AND(3<Fórmulas!L380,Fórmulas!L380<=9)),2,IF(Fórmulas!L380>9,3)))),\"\")","v":""}]
[]
[null,"Risco de contaminação (1, 2 ou 3)",null,{"$f":"IF(D424>0,(IF(OR(AND(1<=Fórmulas!D382,Fórmulas!D382<=2)),1,IF(OR(AND(2<Fórmulas!D382,Fórmulas!D382<=4)),2,IF(Fórmulas!D382>4,3)))),\"\")","v":""},{"$f":"IF(E424>0,(IF(OR(AND(1<=Fórmulas!E382,Fórmulas!E382<=2)),1,IF(OR(AND(2<Fórmulas!E382,Fórmulas!E382<=4)),2,IF(Fórmulas!E382>4,3)))),\"\")","v":""},{"$f":"IF(F424>0,(IF(OR(AND(1<=Fórmulas!F382,Fórmulas!F382<=2)),1,IF(OR(AND(2<Fórmulas!F382,Fórmulas!F382<=4)),2,IF(Fórmulas!F382>4,3)))),\"\")","v":""},{"$f":"IF(G424>0,(IF(OR(AND(1<=Fórmulas!G382,Fórmulas!G382<=2)),1,IF(OR(AND(2<Fórmulas!G382,Fórmulas!G382<=4)),2,IF(Fórmulas!G382>4,3)))),\"\")","v":""},{"$f":"IF(H424>0,(IF(OR(AND(1<=Fórmulas!H382,Fórmulas!H382<=2)),1,IF(OR(AND(2<Fórmulas!H382,Fórmulas!H382<=4)),2,IF(Fórmulas!H382>4,3)))),\"\")","v":""},{"$f":"IF(I424>0,(IF(OR(AND(1<=Fórmulas!I382,Fórmulas!I382<=2)),1,IF(OR(AND(2<Fórmulas!I382,Fórmulas!I382<=4)),2,IF(Fórmulas!I382>4,3)))),\"\")","v":""},{"$f":"IF(J424>0,(IF(OR(AND(1<=Fórmulas!J382,Fórmulas!J382<=2)),1,IF(OR(AND(2<Fórmulas!J382,Fórmulas!J382<=4)),2,IF(Fórmulas!J382>4,3)))),\"\")","v":""},{"$f":"IF(K424>0,(IF(OR(AND(1<=Fórmulas!K382,Fórmulas!K382<=2)),1,IF(OR(AND(2<Fórmulas!K382,Fórmulas!K382<=4)),2,IF(Fórmulas!K382>4,3)))),\"\")","v":""},{"$f":"IF(L424>0,(IF(OR(AND(1<=Fórmulas!L382,Fórmulas!L382<=2)),1,IF(OR(AND(2<Fórmulas!L382,Fórmulas!L382<=4)),2,IF(Fórmulas!L382>4,3)))),\"\")","v":""}]
[]
[null,"Nome comercial do produto (selecione)\t"]
[null,"Ingrediente ativo (%)\t"]
[null,"Descrição da cultura\t"]
[null,"Área (ha)\t"]
[null,"Volume aplicado L/ha ou kg/ha \t"]
[null,"Volume total aplicado por produto\t",null,{"$f":"+D452*D451","v":{"v":0,"d":"0.0"}},{"v":0,"d":"0.0"},{"v":0,"d":"0.0"},{"v":0,"d":"0.0"},{"v":0,"d":"0.0"},{"v":0,"d":"0.0"}]
[]
[null,"Ingrediente ativo do produto \t",null,{"$f":"IF(D$451>0,(HLOOKUP(D$448,'Base de dados'!$B$5:$AIN$11,$J455,0)),\"\")","v":""},{"$f":"IF(E$451>0,(HLOOKUP(E$448,'Base de dados'!$B$5:$AIN$11,$J455,0)),\"\")","v":""},{"$f":"IF(F$451>0,(HLOOKUP(F$448,'Base de dados'!$B$5:$AIN$11,$J455,0)),\"\")","v":""},{"$f":"IF(G$451>0,(HLOOKUP(G$448,'Base de dados'!$B$5:$AIN$11,$J455,0)),\"\")","v":""},{"$f":"IF(H$451>0,(HLOOKUP(H$448,'Base de dados'!$B$5:$AIN$11,$J455,0)),\"\")","v":""},{"$f":"IF(I$451>0,(HLOOKUP(I$448,'Base de dados'!$B$5:$AIN$11,$J455,0)),\"\")","v":""},2]
[null,"Toxicidade para peixes - 96h LC50 (mg L-1)\t",null,{"$f":"IF(D$451>0,(HLOOKUP(D$448,'Base de dados'!$B$5:$AIN$11,$J456,0)),\"\")","v":""},{"$f":"IF(E$451>0,(HLOOKUP(E$448,'Base de dados'!$B$5:$AIN$11,$J456,0)),\"\")","v":""},{"$f":"IF(F$451>0,(HLOOKUP(F$448,'Base de dados'!$B$5:$AIN$11,$J456,0)),\"\")","v":""},{"$f":"IF(G$451>0,(HLOOKUP(G$448,'Base de dados'!$B$5:$AIN$11,$J456,0)),\"\")","v":""},{"$f":"IF(H$451>0,(HLOOKUP(H$448,'Base de dados'!$B$5:$AIN$11,$J456,0)),\"\")","v":""},{"$f":"IF(I$451>0,(HLOOKUP(I$448,'Base de dados'!$B$5:$AIN$11,$J456,0)),\"\")","v":""},3]
[null,"Toxicidade (mg kg-1 day-1)",null,{"$f":"IF(D$451>0,(HLOOKUP(D$448,'Base de dados'!$B$5:$AIN$11,$J457,0)),\"\")","v":""},{"$f":"IF(E$451>0,(HLOOKUP(E$448,'Base de dados'!$B$5:$AIN$11,$J457,0)),\"\")","v":""},{"$f":"IF(F$451>0,(HLOOKUP(F$448,'Base de dados'!$B$5:$AIN$11,$J457,0)),\"\")","v":""},{"$f":"IF(G$451>0,(HLOOKUP(G$448,'Base de dados'!$B$5:$AIN$11,$J457,0)),\"\")","v":""},{"$f":"IF(H$451>0,(HLOOKUP(H$448,'Base de dados'!$B$5:$AIN$11,$J457,0)),\"\")","v":""},{"$f":"IF(I$451>0,(HLOOKUP(I$448,'Base de dados'!$B$5:$AIN$11,$J457,0)),\"\")","v":""},4]
[null,"Índice para toxicidade do produto\t",null,{"$f":"IF(D$451>0,(HLOOKUP(D$448,'Base de dados'!$B$5:$AIN$11,$J458,0)),\"\")","v":""},{"$f":"IF(E$451>0,(HLOOKUP(E$448,'Base de dados'!$B$5:$AIN$11,$J458,0)),\"\")","v":""},{"$f":"IF(F$451>0,(HLOOKUP(F$448,'Base de dados'!$B$5:$AIN$11,$J458,0)),\"\")","v":""},{"$f":"IF(G$451>0,(HLOOKUP(G$448,'Base de dados'!$B$5:$AIN$11,$J458,0)),\"\")","v":""},{"$f":"IF(H$451>0,(HLOOKUP(H$448,'Base de dados'!$B$5:$AIN$11,$J458,0)),\"\")","v":""},{"$f":"IF(I$451>0,(HLOOKUP(I$448,'Base de dados'!$B$5:$AIN$11,$J458,0)),\"\")","v":""},5]
[null,"Koc",null,{"$f":"IF(D$451>0,(HLOOKUP(D$448,'Base de dados'!$B$5:$AIN$11,$J459,0)),\"\")","v":""},{"$f":"IF(E$451>0,(HLOOKUP(E$448,'Base de dados'!$B$5:$AIN$11,$J459,0)),\"\")","v":""},{"$f":"IF(F$451>0,(HLOOKUP(F$448,'Base de dados'!$B$5:$AIN$11,$J459,0)),\"\")","v":""},{"$f":"IF(G$451>0,(HLOOKUP(G$448,'Base de dados'!$B$5:$AIN$11,$J459,0)),\"\")","v":""},{"$f":"IF(H$451>0,(HLOOKUP(H$448,'Base de dados'!$B$5:$AIN$11,$J459,0)),\"\")","v":""},{"$f":"IF(I$451>0,(HLOOKUP(I$448,'Base de dados'!$B$5:$AIN$11,$J459,0)),\"\")","v":""},6]
[null,"t1/2 (DT50)",null,{"$f":"IF(D$451>0,(HLOOKUP(D$448,'Base de dados'!$B$5:$AIN$11,$J460,0)),\"\")","v":""},{"$f":"IF(E$451>0,(HLOOKUP(E$448,'Base de dados'!$B$5:$AIN$11,$J460,0)),\"\")","v":""},{"$f":"IF(F$451>0,(HLOOKUP(F$448,'Base de dados'!$B$5:$AIN$11,$J460,0)),\"\")","v":""},{"$f":"IF(G$451>0,(HLOOKUP(G$448,'Base de dados'!$B$5:$AIN$11,$J460,0)),\"\")","v":""},{"$f":"IF(H$451>0,(HLOOKUP(H$448,'Base de dados'!$B$5:$AIN$11,$J460,0)),\"\")","v":""},{"$f":"IF(I$451>0,(HLOOKUP(I$448,'Base de dados'!$B$5:$AIN$11,$J460,0)),\"\")","v":""},7]
[null,"GUS\t",null,{"$f":"IF(D451=0,\"\",IF(LOG10(D460)*(4-LOG10(D459))<=0,0,IF(OR(LOG10(D460)*(4-LOG10(D459))>0,),(LOG10(D460)*(4-LOG10(D459))),IF((LOG10(D460)*(4-LOG10(D459))>0),(LOG10(D460)*(4-LOG10(D459)))))))","v":""},{"$f":"IF(E451=0,\"\",IF(LOG10(E460)*(4-LOG10(E459))<=0,0,IF(OR(LOG10(E460)*(4-LOG10(E459))>0,),(LOG10(E460)*(4-LOG10(E459))),IF((LOG10(E460)*(4-LOG10(E459))>0),(LOG10(E460)*(4-LOG10(E459)))))))","v":""},{"$f":"IF(F451=0,\"\",IF(LOG10(F460)*(4-LOG10(F459))<=0,0,IF(OR(LOG10(F460)*(4-LOG10(F459))>0,),(LOG10(F460)*(4-LOG10(F459))),IF((LOG10(F460)*(4-LOG10(F459))>0),(LOG10(F460)*(4-LOG10(F459)))))))","v":""},"","",""]
[null,"Potencial de contaminação (1, 2 or 3)",null,{"$f":"IF(D451>0,(IF(OR(M379=0.83,M379<0.83),1,IF(OR(AND(0.83<M379,M379<=1.66)),2,IF(M379>1.66,3,\"\")))),\"\")","v":""},{"$f":"IF(E451>0,(IF(OR(Fórmulas!I418=0.83,Fórmulas!I418<0.83),1,IF(OR(AND(0.83<Fórmulas!I418,Fórmulas!I418<=1.66)),2,IF(Fórmulas!I418>1.66,3,\"\")))),\"\")","v":""},{"$f":"IF(F451>0,(IF(OR(Fórmulas!J418=0.83,Fórmulas!J418<0.83),1,IF(OR(AND(0.83<Fórmulas!J418,Fórmulas!J418<=1.66)),2,IF(Fórmulas!J418>1.66,3,\"\")))),\"\")","v":""},{"$f":"IF(G451>0,(IF(OR(Fórmulas!K418=0.83,Fórmulas!K418<0.83),1,IF(OR(AND(0.83<Fórmulas!K418,Fórmulas!K418<=1.66)),2,IF(Fórmulas!K418>1.66,3,\"\")))),\"\")","v":""},{"$f":"IF(H451>0,(IF(OR(Fórmulas!L418=0.83,Fórmulas!L418<0.83),1,IF(OR(AND(0.83<Fórmulas!L418,Fórmulas!L418<=1.66)),2,IF(Fórmulas!L418>1.66,3,\"\")))),\"\")","v":""},{"$f":"IF(I451>0,(IF(OR(Fórmulas!M418=0.83,Fórmulas!M418<0.83),1,IF(OR(AND(0.83<Fórmulas!M418,Fórmulas!M418<=1.66)),2,IF(Fórmulas!M418>1.66,3,\"\")))),\"\")","v":""}]
[null,"EIQ Impacto ao trabalhador rural",null,{"$f":"IF(D$451>0,(HLOOKUP(D$448,'Base de dados'!$B$5:$AIN$18,$J463,0)),\"\")","v":""},{"$f":"IF(E$451>0,(HLOOKUP(E$448,'Base de dados'!$B$5:$AIN$18,$J463,0)),\"\")","v":""},{"$f":"IF(F$451>0,(HLOOKUP(F$448,'Base de dados'!$B$5:$AIN$18,$J463,0)),\"\")","v":""},{"$f":"IF(G$451>0,(HLOOKUP(G$448,'Base de dados'!$B$5:$AIN$18,$J463,0)),\"\")","v":""},{"$f":"IF(H$451>0,(HLOOKUP(H$448,'Base de dados'!$B$5:$AIN$18,$J463,0)),\"\")","v":""},{"$f":"IF(I$451>0,(HLOOKUP(I$448,'Base de dados'!$B$5:$AIN$18,$J463,0)),\"\")","v":""},12]
[null,"EIQ Impacto ao consumidor",null,{"$f":"IF(D$451>0,(HLOOKUP(D$448,'Base de dados'!$B$5:$AIN$18,$J464,0)),\"\")","v":""},{"$f":"IF(E$451>0,(HLOOKUP(E$448,'Base de dados'!$B$5:$AIN$18,$J464,0)),\"\")","v":""},{"$f":"IF(F$451>0,(HLOOKUP(F$448,'Base de dados'!$B$5:$AIN$18,$J464,0)),\"\")","v":""},{"$f":"IF(G$451>0,(HLOOKUP(G$448,'Base de dados'!$B$5:$AIN$18,$J464,0)),\"\")","v":""},{"$f":"IF(H$451>0,(HLOOKUP(H$448,'Base de dados'!$B$5:$AIN$18,$J464,0)),\"\")","v":""},{"$f":"IF(I$451>0,(HLOOKUP(I$448,'Base de dados'!$B$5:$AIN$18,$J464,0)),\"\")","v":""},13]
[null,"EIQ Impacto ao meio ambiente",null,{"$f":"IF(D$451>0,(HLOOKUP(D$448,'Base de dados'!$B$5:$AIN$18,$J465,0)),\"\")","v":""},{"$f":"IF(E$451>0,(HLOOKUP(E$448,'Base de dados'!$B$5:$AIN$18,$J465,0)),\"\")","v":""},{"$f":"IF(F$451>0,(HLOOKUP(F$448,'Base de dados'!$B$5:$AIN$18,$J465,0)),\"\")","v":""},{"$f":"IF(G$451>0,(HLOOKUP(G$448,'Base de dados'!$B$5:$AIN$18,$J465,0)),\"\")","v":""},{"$f":"IF(H$451>0,(HLOOKUP(H$448,'Base de dados'!$B$5:$AIN$18,$J465,0)),\"\")","v":""},{"$f":"IF(I$451>0,(HLOOKUP(I$448,'Base de dados'!$B$5:$AIN$18,$J465,0)),\"\")","v":""},14]
[null,"Environmental Impact Quotient (EIQ)",null,{"$f":"IF(D$451>0,(HLOOKUP(D$448,'Base de dados'!$B$5:$AIN$18,$J466,0)),\"\")","v":""},{"$f":"IF(E$451>0,(HLOOKUP(E$448,'Base de dados'!$B$5:$AIN$18,$J466,0)),\"\")","v":""},{"$f":"IF(F$451>0,(HLOOKUP(F$448,'Base de dados'!$B$5:$AIN$18,$J466,0)),\"\")","v":""},{"$f":"IF(G$451>0,(HLOOKUP(G$448,'Base de dados'!$B$5:$AIN$18,$J466,0)),\"\")","v":""},{"$f":"IF(H$451>0,(HLOOKUP(H$448,'Base de dados'!$B$5:$AIN$18,$J466,0)),\"\")","v":""},{"$f":"IF(I$451>0,(HLOOKUP(I$448,'Base de dados'!$B$5:$AIN$18,$J466,0)),\"\")","v":""},11]
[null,"Pesticidas banidos na União Européia",null,{"$f":"IF(D$451>0,(HLOOKUP(D$448,'Base de dados'!$B$5:$AIN$19,$J467,0)),\"\")","v":""},{"$f":"IF(E$451>0,(HLOOKUP(E$448,'Base de dados'!$B$5:$AIN$19,$J467,0)),\"\")","v":""},{"$f":"IF(F$451>0,(HLOOKUP(F$448,'Base de dados'!$B$5:$AIN$19,$J467,0)),\"\")","v":""},{"$f":"IF(G$451>0,(HLOOKUP(G$448,'Base de dados'!$B$5:$AIN$19,$J467,0)),\"\")","v":""},{"$f":"IF(H$451>0,(HLOOKUP(H$448,'Base de dados'!$B$5:$AIN$19,$J467,0)),\"\")","v":""},{"$f":"IF(I$451>0,(HLOOKUP(I$448,'Base de dados'!$B$5:$AIN$19,$J467,0)),\"\")","v":""},15,{"$f":"COUNTIF('2 Indicadores'!D366:F366,\"x\")","v":0},{"$f":"COUNTIF(D410:L410,\"x\")","v":0},{"$f":"COUNTIF(D439:L439,\"x\")","v":0},{"$f":"COUNTIF(D467:I467,\"x\")","v":0}]
[{"$nulls":13},{"$f":"SUM(K467:N467)","v":0}]
[null,"Teor de argila no solo                                                             > 60% (1); 30% - 60% (2); <30% (3)\t"]
[null,"Distância do curso d' água (borda do talhão) >1.000m (1);  300 - 1.000m (2);  <300m (3)\t"]
[null,"Tipo de manejo do solo: Solo protegido (1); Solo sem revolvimento (2); Solo com revolvimento (3)\t"]
[null,"Vulnerabilidade do talhão  (1, 2 ou 3)\t",null,{"$f":"IF(D452>0,(IF(OR(AND(1<=Fórmulas!M380,Fórmulas!M380<=3)),1,IF(OR(AND(3<Fórmulas!M380,Fórmulas!M380<=9)),2,IF(Fórmulas!M380>9,3)))),\"\")","v":""},{"$f":"IF(E452>0,(IF(OR(AND(1<=Fórmulas!N380,Fórmulas!N380<=3)),1,IF(OR(AND(3<Fórmulas!N380,Fórmulas!N380<=9)),2,IF(Fórmulas!N380>9,3)))),\"\")","v":""},{"$f":"IF(F452>0,(IF(OR(AND(1<=Fórmulas!B386,Fórmulas!B386<=3)),1,IF(OR(AND(3<Fórmulas!B386,Fórmulas!B386<=9)),2,IF(Fórmulas!B386>9,3)))),\"\")","v":""},{"$f":"IF(G452>0,(IF(OR(AND(1<=Fórmulas!C386,Fórmulas!C386<=3)),1,IF(OR(AND(3<Fórmulas!C386,Fórmulas!C386<=9)),2,IF(Fórmulas!C386>9,3)))),\"\")","v":""},{"$f":"IF(H452>0,(IF(OR(AND(1<=Fórmulas!D386,Fórmulas!D386<=3)),1,IF(OR(AND(3<Fórmulas!D386,Fórmulas!D386<=9)),2,IF(Fórmulas!D386>9,3)))),\"\")","v":""},{"$f":"IF(I452>0,(IF(OR(AND(1<=Fórmulas!E386,Fórmulas!E386<=3)),1,IF(OR(AND(3<Fórmulas!E386,Fórmulas!E386<=9)),2,IF(Fórmulas!E386>9,3)))),\"\")","v":""}]
[]
[null,"Risco de contaminação (1, 2 ou 3)",null,{"$f":"IF(D452>0,(IF(OR(AND(1<=Fórmulas!M382,Fórmulas!M382<=2)),1,IF(OR(AND(2<Fórmulas!M382,Fórmulas!M382<=4)),2,IF(Fórmulas!M382>4,3)))),\"\")","v":""},{"$f":"IF(E452>0,(IF(OR(AND(1<=Fórmulas!N382,Fórmulas!N382<=2)),1,IF(OR(AND(2<Fórmulas!N382,Fórmulas!N382<=4)),2,IF(Fórmulas!N382>4,3)))),\"\")","v":""},{"$f":"IF(F452>0,(IF(OR(AND(1<=Fórmulas!B388,Fórmulas!B388<=2)),1,IF(OR(AND(2<Fórmulas!B388,Fórmulas!B388<=4)),2,IF(Fórmulas!B388>4,3)))),\"\")","v":""},{"$f":"IF(G452>0,(IF(OR(AND(1<=Fórmulas!C388,Fórmulas!C388<=2)),1,IF(OR(AND(2<Fórmulas!C388,Fórmulas!C388<=4)),2,IF(Fórmulas!C388>4,3)))),\"\")","v":""},{"$f":"IF(H452>0,(IF(OR(AND(1<=Fórmulas!D388,Fórmulas!D388<=2)),1,IF(OR(AND(2<Fórmulas!D388,Fórmulas!D388<=4)),2,IF(Fórmulas!D388>4,3)))),\"\")","v":""},{"$f":"IF(I452>0,(IF(OR(AND(1<=Fórmulas!E388,Fórmulas!E388<=2)),1,IF(OR(AND(2<Fórmulas!E388,Fórmulas!E388<=4)),2,IF(Fórmulas!E388>4,3)))),\"\")","v":""}]
[]
[null,"Identificação da cultura\t\t",null,{"$f":"+'2 Indicadores'!D376","v":0},{"$f":"+'2 Indicadores'!E376","v":0},{"$f":"+'2 Indicadores'!F376","v":0},{"$f":"'2 Indicadores'!H376","v":0},{"$f":"+'2 Indicadores'!H376","v":0}]
[null,"Área (ha)\t",null,{"$f":"+'2 Indicadores'!D377","v":0},{"$f":"+'2 Indicadores'!E377","v":0},{"$f":"+'2 Indicadores'!F377","v":0},{"$f":"'2 Indicadores'!H377","v":0},{"$f":"+'2 Indicadores'!H377","v":0}]
[null,"Risco máximo identificado (1 - baixo), (2 - médio) ou (3 - alto)\t",null,{"$f":"+'2 Indicadores'!D378","v":0},{"$f":"+'2 Indicadores'!E378","v":0},{"$f":"+'2 Indicadores'!F378","v":0},{"$f":"'2 Indicadores'!H378","v":0},{"$f":"+'2 Indicadores'!H378","v":0}]
[null,"Média do risco de contaminação\t",null,{"$f":"IF('2 Indicadores'!D352>0,((Fórmulas!E482*'2 Indicadores'!D377+Fórmulas!F482*'2 Indicadores'!E377+Fórmulas!G482*'2 Indicadores'!F377+Fórmulas!H482*'2 Indicadores'!G377+Fórmulas!H483*'2 Indicadores'!H377)/D481),\"\")","v":""},{"$f":"IF(AND('2 Indicadores'!D351>0,D478=1),0.6,\"\")","v":""},{"$f":"IF(AND('2 Indicadores'!D351>0,E478=1),0.6,\"\")","v":""},{"$f":"IF(AND('2 Indicadores'!D351>0,F478=1),0.6,\"\")","v":""},{"$f":"IF(AND('2 Indicadores'!D351>0,G478=1),0.6,\"\")","v":""}]
[null,"Volume total de agrotóxicos utilizados em 1 ano\t",null,{"$f":"IF('2 Indicadores'!D352>0,'2 Indicadores'!D353+'2 Indicadores'!E353+'2 Indicadores'!F353+'2 Indicadores'!G353+'2 Indicadores'!H353+Fórmulas!D396+Fórmulas!E396+Fórmulas!F396+Fórmulas!G396+Fórmulas!H396+Fórmulas!I396+Fórmulas!J396+Fórmulas!K396+Fórmulas!L396+Fórmulas!D425+Fórmulas!E425+Fórmulas!F425+Fórmulas!G425+Fórmulas!H425+Fórmulas!I425+Fórmulas!J425+Fórmulas!K425+Fórmulas!L425+Fórmulas!D453+Fórmulas!E453+Fórmulas!F453+Fórmulas!G453+Fórmulas!H453+Fórmulas!I453,\"\")","v":""},{"$f":"IF(AND('2 Indicadores'!D351>0,D478=2),0.3,\"\")","v":""},{"$f":"IF(AND('2 Indicadores'!D351>0,E478=2),0.3,\"\")","v":""},{"$f":"IF(AND('2 Indicadores'!D351>0,F478=2),0.3,\"\")","v":""},{"$f":"IF(AND('2 Indicadores'!D351>0,G478=2),0.3,\"\")","v":""}]
[null,"Área total de lavoura (incluindo rotações)\t",null,{"$f":"IF('2 Indicadores'!D377>0,(SUM('2 Indicadores'!D377:H377)),\"\")","v":""},{"$f":"IF(AND('2 Indicadores'!D351>0,D478=3),0.1,\"\")","v":""},{"$f":"IF(AND('2 Indicadores'!D351>0,E478=3),0.1,\"\")","v":""},{"$f":"IF(AND('2 Indicadores'!D351>0,F478=3),0.1,\"\")","v":""},{"$f":"IF(AND('2 Indicadores'!D351>0,G478=3),0.1,\"\")","v":""}]
[null,"Volume total / área identificada nos talhões\t",null,{"$f":"IF('2 Indicadores'!D352>0,(D480/D481),\"\")","v":""},{"$f":"SUM(E479:E481)","v":0},{"$f":"SUM(F479:F481)","v":0},{"$f":"SUM(G479:G481)","v":0},{"$f":"SUM(H479:H481)","v":0}]
[null,"Volume total / área com uso agropecuário\t",null,{"$f":"IF('2 Indicadores'!D352>0,D480/('1 Questionário'!D86+'1 Questionário'!D87+'1 Questionário'!D88+'1 Questionário'!D89),\"\")","v":""},{"$f":"IF(AND('2 Indicadores'!D351>0,H478=1),0.6,\"\")","v":""},{"$f":"IF(AND('2 Indicadores'!D351>0,H478=2),0.3,\"\")","v":""},{"$f":"IF(AND('2 Indicadores'!D351>0,H478=2),0.3,\"\")","v":""},{"$f":"SUM(E483:G483)","v":0}]
[null,{"$f":"IF(AND('2 Indicadores'!D351>0,'2 Indicadores'!D378=1),0.6,\"\")","v":""},{"$f":"IF(AND('2 Indicadores'!D351>0,'2 Indicadores'!E378=1),0.6,\"\")","v":""},{"$f":"IF(AND('2 Indicadores'!D351>0,'2 Indicadores'!F378=1),0.6,\"\")","v":""},{"$f":"IF(AND('2 Indicadores'!D351>0,'2 Indicadores'!G378=1),0.6,\"\")","v":""}]
[null,{"$f":"IF(AND('2 Indicadores'!D351>0,'2 Indicadores'!D378=3),0.1,\"\")","v":""},{"$f":"IF(AND('2 Indicadores'!D351>0,'2 Indicadores'!E378=3),0.1,\"\")","v":""},{"$f":"IF(AND('2 Indicadores'!D351>0,'2 Indicadores'!F378=3),0.1,\"\")","v":""},{"$f":"IF(AND('2 Indicadores'!D351>0,'2 Indicadores'!G378=3),0.1,\"\")","v":""}]
[{"$nulls":10},"UNIDADES VIII",null,"UNIDADES IX"]
[15,"Fator de Ponderação\t\t",null,null,"Fórmulas",null,"< 5%","5% - 10%","> 10%",null,"Inicial",null,"Redução"]
[null,"item 15.1","Ponderação",{"$nulls":3},{"$f":"IF(E496>0,1,\" \")","v":" "},{"$f":"IF(G496>0,1,\" \")","v":" "},{"$f":"IF(I496>0,1,\" \")","v":" "},null,"Intermediário",null,"Inalterado"]
[null,"< 5%",0.55,{"$nulls":3},{"$f":"IF(E494>0,1,\" \")","v":" "},{"$f":"IF(G494>0,1,\" \")","v":" "},{"$f":"IF(I494>0,1,\" \")","v":" "},null,"Avançado",null,"Intensificação"]
[null,"5 - 10%",0.45,{"$nulls":3},{"$f":"IF(E492>0,1,\" \")","v":" "},{"$f":"IF(G492>0,1,\" \")","v":" "},{"$f":"IF(I492>0,1,\" \")","v":" "}]
[null,"> 10%",0.35,null,{"$f":"IF('2 Indicadores'!$F$384<0.05,'2 Indicadores'!$E$384,0)","v":0},null,{"$f":"IF('2 Indicadores'!$F$384>=0.05,'2 Indicadores'!$E$384,0)","v":0},null,{"$f":"IF('2 Indicadores'!$F$384>0.1,'2 Indicadores'!$E$384,0)","v":0}]
[null,"item 15.1","Ponderação",null,{"$f":"IF('2 Indicadores'!D384=Fórmulas!K487,Fórmulas!E491,0)","v":0},null,{"$f":"IF(I491>0.99,0,IF('2 Indicadores'!D384=Fórmulas!K487,Fórmulas!G491,0))","v":0},null,{"$f":"IF('2 Indicadores'!D384=Fórmulas!K487,Fórmulas!I491,0)","v":0}]
[null,"Avançado",{"v":0.5,"d":"0.50"},null,{"$f":"IF('2 Indicadores'!$F$384<0.05,'2 Indicadores'!$E$384,0)","v":0},null,{"$f":"IF('2 Indicadores'!$F$384>=0.05,'2 Indicadores'!$E$384,0)","v":0},null,{"$f":"IF('2 Indicadores'!$F$384>0.1,'2 Indicadores'!$E$384,0)","v":0}]
[null,"Intermediário",{"v":0.8,"d":"0.80"},null,{"$f":"IF('2 Indicadores'!D384=Fórmulas!K488,Fórmulas!E493,0)","v":0},null,{"$f":"IF(I493>0.99,0,IF('2 Indicadores'!D384=Fórmulas!K488,Fórmulas!G493,0))","v":0},null,{"$f":"IF('2 Indicadores'!D384=Fórmulas!K488,Fórmulas!I493,0)","v":0},null,{"$f":"+C489","v":0.55}]
[null,"Inicial",1,null,{"$f":"IF('2 Indicadores'!$F$384<0.05,'2 Indicadores'!$E$384,0)","v":0},null,{"$f":"IF('2 Indicadores'!$F$384>=0.05,'2 Indicadores'!$E$384,0)","v":0},null,{"$f":"IF('2 Indicadores'!$F$384>0.1,'2 Indicadores'!$E$384,0)","v":0},null,{"$f":"+C490","v":0.45}]
[null,"item 15.2","Ponderação",null,{"$f":"IF('2 Indicadores'!D384=Fórmulas!K489,Fórmulas!E495,0)","v":0},null,{"$f":"IF(I495>0.99,0,IF('2 Indicadores'!D384=Fórmulas!K489,Fórmulas!G495,0))","v":0},null,{"$f":"IF('2 Indicadores'!D384=Fórmulas!K489,Fórmulas!I495,0)","v":0},null,{"$f":"+C491","v":0.35}]
[null,"Redução",1.2,null,{"$f":"IF(E499>0,E499,0)+IF(F499>0,F499,0)+IF(G499>0,G499,0)","v":{"v":0,"d":"0.00"}}]
[null,"Inalterado",{"v":1,"d":"1.0"},null,{"$f":"IF('2 Indicadores'!D387=M487,1,0)","v":{"v":0,"d":"0.00"}},{"$f":"IF('2 Indicadores'!D387=M488,1,0)","v":{"v":0,"d":"0.00"}},{"$f":"IF('2 Indicadores'!D387=M489,1,0)","v":{"v":0,"d":"0.00"}}]
[null,"Intensificação",0.8,null,{"$f":"IF(E492>0,'2 Indicadores'!G384*Fórmulas!K494,0)+IF(E494>0,'2 Indicadores'!G385*Fórmulas!K494,0)+IF(E496>0,'2 Indicadores'!G386*Fórmulas!K494,0)","v":0},{"$f":"IF(G492>0,'2 Indicadores'!G384*Fórmulas!K495,0)+IF(G494>0,'2 Indicadores'!G385*Fórmulas!K495,0)+IF(G496>0,'2 Indicadores'!G386*Fórmulas!K495,0)","v":0},{"$f":"IF(I492>0,'2 Indicadores'!G384*Fórmulas!K496,0)+IF(I494>0,'2 Indicadores'!G385*Fórmulas!K496,0)+IF(I496>0,'2 Indicadores'!G386*Fórmulas!K496,0)","v":0}]
[{"$nulls":4},"Fórmula - verifica a proporção da área em processo de degradação em relação à área total e ao grau de intensidade do fenômeno. Após o cálculo, multiplica o valor final pelo fator 1,2, se verificada tendência de redução do estádio de degradação ou pelo fator 0,8, se a tendência é de intensificação do estádio de degradação."]
[]
[]
[]
[16,"Fator de Ponderação\t\t",null,null,"Fórmulas",{"$nulls":6},"UNIDADES X"]
[null,"Adequado",0.9,null,{"$f":"'2 Indicadores'!D396/Fórmulas!J509","v":{"$error":"#DIV/0!"}},{"$f":"'2 Indicadores'!E396/Fórmulas!J509","v":{"$error":"#DIV/0!"}},{"$f":"'2 Indicadores'!F396/Fórmulas!J509","v":{"$error":"#DIV/0!"}},{"$f":"'2 Indicadores'!G396/Fórmulas!J509","v":{"$error":"#DIV/0!"}},null,{"$f":"Fórmulas!E505+Fórmulas!F505+Fórmulas!G505+Fórmulas!H505","v":{"$error":"#DIV/0!"}},null,"Suficiente"]
[null,"Médio",0.6,null,{"$f":"'2 Indicadores'!D397/Fórmulas!J509","v":{"$error":"#DIV/0!"}},{"$f":"'2 Indicadores'!E397/Fórmulas!J509","v":{"$error":"#DIV/0!"}},{"$f":"'2 Indicadores'!F397/Fórmulas!J509","v":{"$error":"#DIV/0!"}},{"$f":"'2 Indicadores'!G397/Fórmulas!J509","v":{"$error":"#DIV/0!"}},null,{"$f":"Fórmulas!E506+Fórmulas!F506+Fórmulas!G506+Fórmulas!H506","v":{"$error":"#DIV/0!"}},null,"Insuficiente"]
[null,"Baixo",0.3,null,{"$f":"'2 Indicadores'!D398/Fórmulas!J509","v":{"$error":"#DIV/0!"}},{"$f":"'2 Indicadores'!E398/Fórmulas!J509","v":{"$error":"#DIV/0!"}},{"$f":"'2 Indicadores'!F398/Fórmulas!J509","v":{"$error":"#DIV/0!"}},{"$f":"'2 Indicadores'!G398/Fórmulas!J509","v":{"$error":"#DIV/0!"}},null,{"$f":"Fórmulas!E507+Fórmulas!F507+Fórmulas!G507+Fórmulas!H507","v":{"$error":"#DIV/0!"}},null,"Situação crítica"]
[null,"Situação crítica",0.1,null,{"$f":"'2 Indicadores'!D399/Fórmulas!J509","v":{"$error":"#DIV/0!"}},{"$f":"'2 Indicadores'!E399/Fórmulas!J509","v":{"$error":"#DIV/0!"}},{"$f":"'2 Indicadores'!F399/Fórmulas!J509","v":{"$error":"#DIV/0!"}},{"$f":"'2 Indicadores'!G399/Fórmulas!J509","v":{"$error":"#DIV/0!"}},null,{"$f":"Fórmulas!E508+Fórmulas!F508+Fórmulas!G508+Fórmulas!H508","v":{"$error":"#DIV/0!"}}]
[{"$nulls":4},"Área Total do imóvel rural (ha)=>\t\t\t",{"$nulls":3},{"$f":"+'1 Questionário'!I95","v":0},{"$f":"'2 Indicadores'!D396+'2 Indicadores'!D397+'2 Indicadores'!D398+'2 Indicadores'!D399+'2 Indicadores'!E396+'2 Indicadores'!E397+'2 Indicadores'!E398+'2 Indicadores'!E399+'2 Indicadores'!F396+'2 Indicadores'!F397+'2 Indicadores'!F398+'2 Indicadores'!F399+'2 Indicadores'!G396+'2 Indicadores'!G397+'2 Indicadores'!G398+'2 Indicadores'!G399","v":{"v":0,"d":"0.0"}}]
[]
[null,"Ponderação",{"$nulls":5},{"$f":"IF('2 Indicadores'!D403=\"Suficiente\",Fórmulas!B512,0)","v":0}]
[null,{"$f":"+'2 Indicadores'!E403","v":{"v":1,"d":"1.0"}},null,null,{"$f":"(Fórmulas!J505*Fórmulas!C505)+(J506*C506)+(Fórmulas!J507*Fórmulas!C507)+(Fórmulas!J508*Fórmulas!C508)","v":{"$error":"#DIV/0!"}},{"$f":"SUM(H511:H513)","v":{"v":0,"d":"0.00"}},null,{"$f":"IF('2 Indicadores'!D403=\"Insuficiente\",Fórmulas!B513,0)","v":0}]
[null,{"$f":"+'2 Indicadores'!E404","v":0.4},{"$nulls":5},{"$f":"IF('2 Indicadores'!D403=\"Situação crítica\",Fórmulas!B514,0)","v":0}]
[null,{"$f":"+'2 Indicadores'!E405","v":0.1}]
[]
[17,"Fator de Ponderação\t\t",null,null,"Fórmulas"]
[null,{"$f":"+'2 Indicadores'!C412","v":"Presença abaulamento das estradas\t"},{"v":1,"d":"1.0"},null,{"$f":"IF(F517>1,1,F517)","v":{"v":0,"d":"0.00"}},{"$f":"IF(G517>0,H517/G517,H517)","v":{"v":0,"d":"0.00"}},{"$f":"COUNTIF('2 Indicadores'!E412:E418,\">=0\")","v":0},{"$f":"('2 Indicadores'!E412*0.8+'2 Indicadores'!E413*0.8+'2 Indicadores'!E414*0.8+K517+K519)","v":{"v":0,"d":"0.00"}},{"$f":"IF(E517>0,I518,E518*1.1)","v":{"v":0,"d":"0.00"}},{"$f":"IF(I517>1,1,I517)","v":{"v":0,"d":"0.00"}},{"$f":"IF('2 Indicadores'!E417=\"\",0,1-'2 Indicadores'!E417)","v":{"v":0,"d":"0%"}},{"$f":"IF(ISBLANK('2 Indicadores'!H412),Fórmulas!$M$517,\"\")","v":"Não se aplica"},"Não se aplica"]
[null,{"$f":"+'2 Indicadores'!C413","v":"Presença de lombadas - desvio de enxurrada\t"},{"v":1,"d":"1.0"},null,{"$f":"IF(F518>1,1,F518)","v":{"v":0,"d":"0.00"}},{"$f":"IF(G518>0,H518/G518,H518)","v":{"v":0,"d":"0.00"}},{"$f":"COUNTIF('2 Indicadores'!F415:F418,\">=0\")","v":2},{"$f":"'2 Indicadores'!H412*0.8+'2 Indicadores'!H413*0.8+'2 Indicadores'!H414*0.8+K518+K520","v":{"v":0,"d":"0.00"}},{"$f":"IF(E518=0,E517,((2*E517+E518)/3))","v":{"v":0,"d":"0.00"}},{"$f":"IF(OR('2 Indicadores'!E421=\"Sim\",'2 Indicadores'!H421=\"x\"),Fórmulas!J517*0.7,Fórmulas!J517)","v":{"v":0,"d":"0.00"}},{"$f":"IF('2 Indicadores'!H417=\"\",0,1-'2 Indicadores'!H417)","v":{"v":0,"d":"0%"}},{"$f":"IF(ISBLANK('2 Indicadores'!H413),Fórmulas!$M$517,\"\")","v":"Não se aplica"}]
[null,{"$f":"+'2 Indicadores'!C414","v":"Presença de caixas de infiltração\t"},{"v":1,"d":"1.0"},{"$nulls":7},{"$f":"IF('2 Indicadores'!E418=\"\",0,1-'2 Indicadores'!E418)","v":{"v":0,"d":"0%"}},{"$f":"IF(ISBLANK('2 Indicadores'!H414),Fórmulas!$M$517,\"\")","v":"Não se aplica"}]
[null,{"$f":"+'2 Indicadores'!C417","v":"Presença de buracos nas estradas\t"},{"v":1,"d":"1.0"},{"$nulls":7},{"$f":"IF('2 Indicadores'!H418=\"\",0,1-'2 Indicadores'!H418)","v":{"v":0,"d":"0%"}},{"$f":"IF(ISBLANK('2 Indicadores'!H421),Fórmulas!$M$517,\"\")","v":"Não se aplica"}]
[null,{"$f":"+'2 Indicadores'!C418","v":"Presença de sulcos de erosão nas estradas\t\t"},{"v":1,"d":"1.0"}]
[]
[]
[18,"Fórmulas",{"$nulls":6},"Campo rupestre/altitude",null,"Fator de ponderação\t\t\t"]
[null,"18.1 - Fórmulas: Se a área total com vegetação nativa for superior a 20% da área total do estabelecimento, acréscimo de 10% no resultado final.",{"$nulls":6},"Campo higrófilo de várzea",null,"Estádio avançado\t\t",null,null,{"v":1,"d":"1.0"}]
[{"$nulls":8},"Cerrado ralo",null,"Estádio intermediário",null,null,0.9]
[null,{"$f":"'2 Indicadores'!D429/Fórmulas!E548","v":{"$error":"#DIV/0!"}},{"$f":"'2 Indicadores'!E429/Fórmulas!E548","v":{"$error":"#DIV/0!"}},{"$f":"'2 Indicadores'!F429/Fórmulas!E548","v":{"$error":"#DIV/0!"}},{"$f":"'2 Indicadores'!G429/Fórmulas!E548","v":{"$error":"#DIV/0!"}},{"$f":"IF('1 Questionário'!$I$93=0,\"\",Fórmulas!B527+Fórmulas!C527+Fórmulas!D527+Fórmulas!E527)","v":""},null,null,"Cerrado típico",null,"Estádio inicial\t\t",null,null,0.7]
[null,{"$f":"'2 Indicadores'!D430/Fórmulas!E548","v":{"$error":"#DIV/0!"}},{"$f":"'2 Indicadores'!E430/Fórmulas!E548","v":{"$error":"#DIV/0!"}},{"$f":"'2 Indicadores'!F430/Fórmulas!E548","v":{"$error":"#DIV/0!"}},{"$f":"'2 Indicadores'!G430/Fórmulas!E548","v":{"$error":"#DIV/0!"}},{"$f":"IF('1 Questionário'!$I$93=0,\"\",Fórmulas!B528+Fórmulas!C528+Fórmulas!D528+Fórmulas!E528)","v":""},null,null,"Cerradão"]
[null,{"$f":"'2 Indicadores'!D431/Fórmulas!E548","v":{"$error":"#DIV/0!"}},{"$f":"'2 Indicadores'!E431/Fórmulas!E548","v":{"$error":"#DIV/0!"}},{"$f":"'2 Indicadores'!F431/Fórmulas!E548","v":{"$error":"#DIV/0!"}},{"$f":"'2 Indicadores'!G431/Fórmulas!E548","v":{"$error":"#DIV/0!"}},{"$f":"IF('1 Questionário'!$I$93=0,\"\",Fórmulas!B529+Fórmulas!C529+Fórmulas!D529+Fórmulas!E529)","v":""},null,null,"Mata de galeria"]
[null,{"$f":"IF(Fórmulas!E549>20%,(((Fórmulas!F527*Fórmulas!N525)+(Fórmulas!F528*Fórmulas!N526)+(Fórmulas!F529*Fórmulas!N527))*1.1),(Fórmulas!F527*Fórmulas!N525)+(Fórmulas!F528*Fórmulas!N526)+(Fórmulas!F529*Fórmulas!N527))","v":{"$error":"#DIV/0!"}},{"$f":"IF(B530>1,1,B530)","v":{"$error":"#DIV/0!"}},{"$nulls":5},"Veredas",null,"Fator de ponderação\t\t\t"]
[null,{"$f":"'1 Questionário'!I93","v":{"v":0,"d":"0.00"}},{"$nulls":6},"Mata Atlântica/Mata Seca",null,"Nº de fragmentos\t\t"]
[null,{"$f":"IF('2 Indicadores'!F438=\"Sim\",(('2 Indicadores'!C432+'2 Indicadores'!C436)/2*1.1),(('2 Indicadores'!C436+'2 Indicadores'!C432)/2))","v":{"$error":"#VALUE!"}},{"$f":"IF(B532>1,1,B532)","v":{"$error":"#VALUE!"}},{"$nulls":5},"Vegetação de caatinga",null,1,null,null,{"v":1,"d":"1.0"}]
[null,{"$f":"IF('2 Indicadores'!F441=\"Sim\",Fórmulas!C532,Fórmulas!C532*0.75)","v":{"$error":"#VALUE!"}},{"$nulls":8},2,null,null,0.9]
[{"$nulls":10},3,null,null,0.8]
[null,"Área total vegetação nativa (%)",{"$f":"B531/Fórmulas!I509","v":{"$error":"#DIV/0!"}},"18.2 - Se a área com vegetação nativa < 5% da área total, rebate de 35% no resultado final ",{"$nulls":6},4,null,null,0.7]
[{"$nulls":10},5,null,null,0.6]
[{"$nulls":10},6,null,null,0.5]
[null,{"$f":"1.1-0.1*'2 Indicadores'!F435","v":1.1},{"$f":"IF(C535<5%,B538*0.65,B538)","v":{"$error":"#DIV/0!"}},{"$f":"IF('1 Questionário'!I93=0,0.1,Fórmulas!C538)","v":0.1}]
[null,"18.2 - Formula= 1,1 - 0,1x"]
[]
[null,"Estádio inicial - ausência de estratificação definida/predominância de indivíduos jovens com até 5 m, diâmetro altura do peito de 10 cm; serapilheira fina camada/Embaúba, Esporão de Galo, Assa Peixe, Camará, etc. "]
[]
[null,"Estádio médio - estratificação incipiente - 2 estratos - dossel e sub-bosque; árvores de 5 a 12 m de altura, redução gradativa de arbustos e arboredos; presença marcante de cipós; maior riqueza e abundância de epífitas; serapilheira presente; DAP entre 10 e 20 cm; predomínio de arbóreas."]
[]
[null,"Estádio avançado - três estratos - dossel, subdossel e sub-bosque; dossel superior 1 m de altura com ocorrência frequente de árvores emergentes; sub-bosque menos expressivo em relação ao estádio médio; menor densidade de cipós e arbustos, riqueza de epífitas; trepadeiras lenhosas; DAP superior a 18 cm."]
[]
[]
[null,"Área com vegetação nativa - (ha)\t\t",null,null,{"$f":"'1 Questionário'!I93","v":{"v":0,"d":"0.00"}}]
[null,"Área com vegetação nativa/área total do imóvel rural",null,null,{"$f":"E548/'1 Questionário'!I95","v":{"$error":"#DIV/0!"}}]
[]
[]
[19,"Fator de ponderação\t\t",{"$nulls":3},"Fórmulas"]
[null,"Uso adequado + vegetação nativa  \t",null,0.7,null,null,{"$f":"(((J554*Fórmulas!D553)+(J555*Fórmulas!D554))/100)","v":{"$error":"#DIV/0!"}},{"$f":"G553*('2 Indicadores'!G452)","v":{"$error":"#DIV/0!"}},{"$f":"IF('2 Indicadores'!G452=\"\",Fórmulas!G553,Fórmulas!H553)","v":{"$error":"#DIV/0!"}},"%"]
[null,"Uso inadequado\t",null,0.1,null,{"$f":"IF('1 Questionário'!D99>0,Fórmulas!I554,0.7)","v":{"v":0.7,"d":"0.70"}},null,null,{"$f":"IF(Fórmulas!I553>1,1,Fórmulas!I553)","v":{"$error":"#DIV/0!"}},{"$f":"+'2 Indicadores'!G448/'2 Indicadores'!$G$450*100","v":{"$error":"#DIV/0!"}}]
[{"$nulls":9},{"$f":"+'2 Indicadores'!G449/'2 Indicadores'!$G$450*100","v":{"$error":"#DIV/0!"}}]
[]
[null,"Proporção das APPs em relação a área total (%)  =>\t\t\t\t",{"$nulls":4},{"$f":"('2 Indicadores'!G448+'2 Indicadores'!G449)/Fórmulas!I509","v":{"$error":"#DIV/0!"}}]
[]
[]
[20,"Fator de ponderação\t\t",{"$nulls":3},"Fórmulas"]
[null,"Vegetação nativa excedente à RL\t",null,{"v":1,"d":"1.0"},null,null,{"$f":"IF('2 Indicadores'!F462>0,L565,0)","v":{"v":0,"d":"0.00"}},{"$f":"IF('2 Indicadores'!F463>0,+'2 Indicadores'!F463/'2 Indicadores'!D458*100,0)","v":{"v":0,"d":"0.00"}},{"$f":"IF('2 Indicadores'!F464>0,+'2 Indicadores'!F464/'2 Indicadores'!D458*100,0)","v":{"v":0,"d":"0.00"}},null,{"$f":"'2 Indicadores'!F462/'1 Questionário'!D72","v":{"$error":"#DIV/0!"}},{"$f":"IF(K561>0.2,1,0)","v":{"$error":"#DIV/0!"}}]
[null,"RL fora do imóvel rural\t",null,0.7,null,null,{"$f":"IF('2 Indicadores'!F465>0,+'2 Indicadores'!F465/'2 Indicadores'!D458*100,0)","v":{"v":0,"d":"0.00"}},{"$f":"SUM(F564:F565)","v":{"v":0.7,"d":"0.70"}},{"$nulls":3},{"$f":"IF(AND(K561>=0.1,K561<=0.2),0.67,0)","v":{"$error":"#DIV/0!"}}]
[null,"Áreas de/para RL não passíveis de recomposição\t",null,0.7,null,{"$f":"IF(AND('2 Indicadores'!D461=0,G564=0),0.7,G564)","v":{"v":0.7,"d":"0.70"}},{"$f":"IF('2 Indicadores'!F463>0,I564,F563)","v":{"v":0.7,"d":"0.70"}},{"$f":"Fórmulas!C570","v":0},{"$f":"IF(Fórmulas!G575>20%,0,Fórmulas!C570)","v":{"$error":"#DIV/0!"}},null,null,{"$f":"IF(AND(K561<0.1,K561>0),0.34,0)","v":{"$error":"#DIV/0!"}}]
[null,"Áreas de/para RL que necessitam de recomposição\t",null,0.1,null,{"$f":"IF(G563>1,1,G563)","v":{"v":0.7,"d":"0.70"}},{"$f":"IF('2 Indicadores'!F465=0,((((H561*Fórmulas!D562)+(I561*Fórmulas!D563)+(G562*Fórmulas!D564))/100)+G561*0.3),(((H561*Fórmulas!D562)+(I561*Fórmulas!D563)+(G562*Fórmulas!D564))/100))","v":{"v":0,"d":"0.00"}},null,{"$f":"IF(AND('2 Indicadores'!F464=\"\",'2 Indicadores'!F465=0),0.7,Fórmulas!F563)","v":0.7},null,null,{"$f":"IF(K561=0,0,0)","v":{"$error":"#DIV/0!"}}]
[{"$nulls":11},{"$f":"SUM(L561:L564)","v":{"$error":"#DIV/0!"}}]
[null,"Área correspondente à Reserva Legal (ha)*\t\t\t\t",{"$nulls":3},{"$f":"+Fórmulas!M570","v":{"v":0,"d":"0.00"}}]
[null,"*Para estabelecimentos acima de 4MF (considerando a área total do estabelecimento descrita no CAR, menos a área de Servidão Administrativa)"]
[null,"RL"]
[{"$nulls":12},{"$f":"'3 Relatório'!H5","v":{"v":0,"d":"0.00"}}]
[null,"RL",{"$f":"IF('1 Questionário'!E105>0,'1 Questionário'!D72*'1 Questionário'!E105,0)","v":{"v":0,"d":"0.00"}},{"$nulls":9},{"$f":"+M569*'1 Questionário'!E105","v":0}]
[]
[{"$nulls":5},"Area (ha) ","% (farm area)"]
[null,"Área total cultivada (culturas, silvicultura) + pastagens\t\t\t",{"$nulls":3},{"$f":"+'1 Questionário'!I90","v":{"v":0,"d":"0.00"}},{"$f":"F573/'1 Questionário'!$I$95","v":{"$error":"#DIV/0!"}},null,"Área de Reserva Legal (ha)  =>",null,null,{"$f":"'2 Indicadores'!D458","v":{"v":0,"d":"0.00"}}]
[null,"Área total com Vegetação Nativa\t\t\t",{"$nulls":3},{"$f":"+'1 Questionário'!I93","v":{"v":0,"d":"0.00"}},{"$f":"F574/'1 Questionário'!$I$95","v":{"$error":"#DIV/0!"}},null,"Área necessária de recomposição para RL no imóvel =>",null,null,{"$f":"IF('1 Questionário'!D76=\"Yes\",0,IF('1 Questionário'!E106=0,L573-'1 Questionário'!I93,0))","v":{"v":0,"d":"0.00"}}]
[null,"Área total classificada como APP\t\t\t",{"$nulls":3},{"$f":"'1 Questionário'!D99","v":{"v":0,"d":"0.00"}},{"$f":"F575/'1 Questionário'!$I$95","v":{"$error":"#DIV/0!"}}]
[null,"Total de áreas a serem recuperadas nas APPs\t\t\t",{"$nulls":3},{"$f":"+'1 Questionário'!D100","v":{"v":0,"d":"0.00"}},{"$f":"F576/'1 Questionário'!$I$95","v":{"$error":"#DIV/0!"}}]
[null,"Área de vegetação nativa fora das APPs e RL \t\t\t",{"$nulls":3},{"$f":"F574-L573","v":{"v":0,"d":"0.00"}},{"$f":"F577/'1 Questionário'!$I$95","v":{"$error":"#DIV/0!"}}]
[]
[]
[21,"Fator de Ponderação\t\t",null,null,"21.1","Fórmulas"]
[null,"Adequado",0.9,null,{"$f":"'2 Indicadores'!D474/Fórmulas!M585","v":{"$error":"#DIV/0!"}},{"$f":"'2 Indicadores'!E474/Fórmulas!M585","v":{"$error":"#DIV/0!"}},{"$f":"'2 Indicadores'!F474/Fórmulas!M585","v":{"$error":"#DIV/0!"}},{"$f":"'2 Indicadores'!G474/Fórmulas!M585","v":{"$error":"#DIV/0!"}},{"$nulls":4},{"$f":"Fórmulas!E581+Fórmulas!F581+Fórmulas!G581+Fórmulas!H581","v":{"$error":"#DIV/0!"}}]
[null,"Médio",0.6,null,{"$f":"'2 Indicadores'!D475/Fórmulas!M585","v":{"$error":"#DIV/0!"}},{"$f":"'2 Indicadores'!E475/Fórmulas!M585","v":{"$error":"#DIV/0!"}},{"$f":"'2 Indicadores'!F475/Fórmulas!M585","v":{"$error":"#DIV/0!"}},{"$f":"'2 Indicadores'!G475/Fórmulas!M585","v":{"$error":"#DIV/0!"}},{"$nulls":4},{"$f":"Fórmulas!E582+Fórmulas!F582+Fórmulas!G582+Fórmulas!H582","v":{"$error":"#DIV/0!"}}]
[null,"Baixo",0.3,null,{"$f":"'2 Indicadores'!D476/Fórmulas!M585","v":{"$error":"#DIV/0!"}},{"$f":"'2 Indicadores'!E476/Fórmulas!M585","v":{"$error":"#DIV/0!"}},{"$f":"'2 Indicadores'!F476/Fórmulas!M585","v":{"$error":"#DIV/0!"}},{"$f":"'2 Indicadores'!G476/Fórmulas!M585","v":{"$error":"#DIV/0!"}},{"$nulls":4},{"$f":"Fórmulas!E583+Fórmulas!F583+Fórmulas!G583+Fórmulas!H583","v":{"$error":"#DIV/0!"}}]
[null,"Situação crítica",0.1,null,{"$f":"'2 Indicadores'!D477/Fórmulas!M585","v":{"$error":"#DIV/0!"}},{"$f":"'2 Indicadores'!E477/Fórmulas!M585","v":{"$error":"#DIV/0!"}},{"$f":"'2 Indicadores'!F477/Fórmulas!M585","v":{"$error":"#DIV/0!"}},{"$f":"'2 Indicadores'!G477/Fórmulas!M585","v":{"$error":"#DIV/0!"}},{"$nulls":4},{"$f":"Fórmulas!E584+Fórmulas!F584+Fórmulas!G584+Fórmulas!H584","v":{"$error":"#DIV/0!"}}]
[{"$nulls":12},{"$f":"'2 Indicadores'!D474+'2 Indicadores'!D475+'2 Indicadores'!D476+'2 Indicadores'!D477+'2 Indicadores'!E474+'2 Indicadores'!E475+'2 Indicadores'!E476+'2 Indicadores'!E477+'2 Indicadores'!F474+'2 Indicadores'!F475+'2 Indicadores'!F476+'2 Indicadores'!F477+'2 Indicadores'!G474+'2 Indicadores'!G475+'2 Indicadores'!G476+'2 Indicadores'!G477","v":{"v":0,"d":"0.0"}}]
[null,"Fator de Ponderação\t\t"]
[null,0,{"v":0,"d":"0.0"}]
[null,5,0.1]
[null,10,0.2]
[null,20,0.4,{"$nulls":4},"Uso da terra\t",null,"Área","% relativa","pi*Loge"]
[null,40,0.6,{"$nulls":4},"Índice Shanon - áreas produtivas e habitats naturais\t\t\t\t"]
[null,60,0.7,{"$nulls":4},"Lavoura Permanente\t",null,{"$f":"+'1 Questionário'!D86","v":{"v":0,"d":"0.00"}},{"$f":"J592/$J$601","v":{"$error":"#DIV/0!"}},{"$f":"IF(K592>0,K592*LOG10(K592),0)","v":{"$error":"#DIV/0!"}}]
[null,70,0.8,null,"21.2","Fórmulas",null,"Lavoura temporária\t",null,{"$f":"+'1 Questionário'!D87","v":{"v":0,"d":"0.00"}},{"$error":"#DIV/0!"},{"$error":"#DIV/0!"}]
[null,80,0.9,null,"Fórmula =  y=a(1-exp(-bx))",null,null,"Pastagens\t",null,{"$f":"+'1 Questionário'!D88","v":{"v":0,"d":"0.00"}},{"$error":"#DIV/0!"},{"$error":"#DIV/0!"}]
[null,100,{"v":1,"d":"1.0"},null,"r2",0.9914,null,"Silvicultura\t",null,{"$f":"+'1 Questionário'!D89","v":{"v":0,"d":"0.00"}},{"$error":"#DIV/0!"},{"$error":"#DIV/0!"}]
[{"$nulls":4},"a",{"v":1.168,"d":"1.1680"},null,"Pousio\t",null,{"$f":"+'1 Questionário'!D91","v":{"v":0,"d":"0.00"}},{"$error":"#DIV/0!"},{"$error":"#DIV/0!"}]
[{"$nulls":4},"b",{"v":0.017645063,"d":"0.0176"},null,"Vegetação nativa 1\t",null,{"$f":"SUM('2 Indicadores'!D429:D431)","v":{"v":0,"d":"0.00"}},{"$error":"#DIV/0!"},{"$error":"#DIV/0!"}]
[{"$nulls":4},"x"," - Σpi loge pi",null,"Vegetação nativa 2",null,{"$f":"SUM('2 Indicadores'!E429:E431)","v":{"v":0,"d":"0.00"}},{"$error":"#DIV/0!"},{"$error":"#DIV/0!"}]
[{"$nulls":7},"Vegetação nativa 3\t",null,{"$f":"SUM('2 Indicadores'!F429:F431)","v":{"v":0,"d":"0.00"}},{"$error":"#DIV/0!"},{"$error":"#DIV/0!"}]
[{"$nulls":7},"Vegetação nativa 4\t",null,{"$f":"SUM('2 Indicadores'!G429:G431)","v":{"v":0,"d":"0.00"}},{"$error":"#DIV/0!"},{"$error":"#DIV/0!"}]
[{"$nulls":7},"Soma",null,{"$f":"SUM(J592:J600)","v":{"v":0,"d":"0.00"}},{"$f":"SUM(K592:K600)","v":{"$error":"#DIV/0!"}},{"$f":"-(SUM(L592:L600))","v":{"$error":"#DIV/0!"}}]

{"sheet":"Base de dados","index":12,"n_rows":47,"n_cols":1065,"rows_kept":47}
["ISA",null,"BASE DE DADOS"]
["AGROTÓXICOS",null,{"$f":"COUNTA(C3:ZC3)","v":677},{"$nulls":887}," "]
["Ação",null,"Herbicida","Fungicida","Inseticida","Herbicida","Herbicida","Inseticida","Inseticida","Inseticida","Inseticida","Herbicida","Fungicida","Herbicida","Inseticida","Fungicida","Inseticida","Herbicida","Herbicida","Herbicida","Inseticida","Fungicida","Fungicida","Herbicida","Herbicida","Herbicida","Fungicida","Inseticida","Fungicida","Herbicida","Herbicida","Inseticida","Fungicida","Inseticida","Inseticida","Fungicida","Herbicida","Herbicida","Herbicida","Herbicida","Herbicida","Fungicida","Inseticida","Inseticida","Herbicida","Fungicida","Fungicida","Inseticida","Inseticida","Fungicida","Fungicida","Herbicida","Herbicida","Herbicida","Fungicida","Herbicida","Herbicida","Inseticida","Fungicida","Herbicida","Herbicida","Herbicida","Herbicida","Fungicida","Herbicida","Herbicida","Herbicida","Inseticida","Inseticida","Inseticida","Inseticida","Herbicida","Fungicida","Fungicida","Herbicida","Fungicida","Fungicida","Inseticida","Inseticida","Fungicida","Fungicida","Fungicida","Inseticida","Inseticida","Inseticida","Herbicida","Fungicida","Inseticida","Fungicida","Inseticida","Fungicida","Inseticida","Inseticida","Fungicida","Fungicida","Herbicida","Inseticida","Inseticida","Inseticida","Herbicida","Inseticida","Herbicida","Fungicida","Fungicida","Inseticida","Herbicida","Fungicida","Fungicida","Inseticida","Herbicida","Inseticida","Herbicida","Inseticida","Herbicida","Inseticida","Herbicida","Fungicida","Fungicida","Fungicida","Inseticida","Inseticida","Inseticida","Fungicida","Fungicida","Inseticida","Fungicida","Inseticida","Fungicida","Herbicida","Inseticida","Inseticida","Inseticida","Fungicida","Inseticida","Inseticida","Fungicida","Fungicida","Herbicida","Fungicida","Fungicida","Inseticida","Fungicida","Inseticida","Inseticida","Inseticida","Fungicida","Inseticida","Herbicida","Inseticida","Inseticida","Fungicida","Inseticida","Fungicida","Fungicida","Inseticida","Herbicida","Herbicida","Herbicida","Herbicida","Herbicida","Inseticida","Inseticida","Inseticida","Fungicida","Herbicida","Herbicida","Herbicida","Fungicida","Inseticida","Inseticida","Fungicida","Inseticida","Fungicida","Fungicida","Inseticida","Fungicida","Herbicida","Inseticida","Inseticida","Herbicida","Fungicida","Inseticida","Inseticida","Fungicida","Inseticida","Inseticida","Fungicida","Fungicida","Fungicida","Inseticida","Fungicida","Inseticida","Fungicida","Inseticida","Inseticida","Fungicida","Fungicida","Inseticida","Herbicida","Herbicida","Herbicida","Herbicida","Fungicida","Inseticida","Inseticida","Inseticida","Fungicida","Inseticida","Inseticida","Herbicida","Inseticida","Herbicida","Herbicida","Fungicida","Fungicida","Herbicida","Herbicida","Herbicida","Fungicida","Fungicida","Herbicida","Herbicida","Fungicida","Fungicida","Inseticida","Fungicida","Inseticida","Inseticida","Herbicida","Fungicida","Fungicida","Fungicida","Fungicida","Herbicida","Fungicida","Inseticida","Inseticida","Inseticida","Inseticida","Inseticida","Inseticida","Inseticida","Herbicida","Fungicida","Inseticida","Inseticida","Inseticida","Herbicida","Herbicida","Herbicida","Fungicida","Herbicida","Inseticida","Fungicida","Inseticida","Herbicida","Fungicida","Inseticida","Inseticida","Fungicida","Inseticida","Inseticida","Herbicida","Inseticida","Fungicida","Herbicida","Herbicida","Fungicida","Inseticida","Herbicida","Herbicida","Fungicida","Inseticida","Fungicida","Inseticida","Herbicida","Herbicida","Herbicida","Herbicida","Fungicida","Fungicida","Inseticida","Fungicida","Herbicida","Fungicida","Fungicida","Fungicida","Fungicida","Fungicida","Fungicida","Herbicida","Herbicida","Inseticida","Fungicida","Fungicida","Inseticida","Inseticida","Inseticida","Fungicida","Fungicida","Fungicida","Fungicida","Inseticida","Fungicida","Herbicida","Herbicida","Inseticida","Fungicida","Inseticida","Inseticida","Inseticida","Herbicida","Inseticida","Herbicida","Herbicida","Herbicida","Herbicida","Fungicida","Herbicida","Herbicida","Herbicida","Herbicida","Herbicida","Inseticida","Herbicida","Herbicida","Herbicida","Herbicida","Fungicida","Inseticida","Inseticida","Herbicida","Herbicida","Herbicida","Inseticida","Herbicida","Herbicida","Inseticida","Fungicida","Fungicida","Herbicida","Fungicida","Fungicida","Fungicida","Herbicida","Herbicida","Herbicida","Herbicida","Herbicida","Fungicida","Inseticida","Inseticida","Fungicida","Fungicida","Inseticida","Herbicida","Inseticida","Fungicida","Inseticida","Inseticida","Herbicida","Herbicida","Fungicida","Fungicida","Fungicida","Fungicida","Herbicida","Fungicida","Inseticida","Inseticida","Herbicida","Fungicida","Inseticida","Herbicida","Fungicida","Herbicida","Herbicida","Fungicida","Herbicida","Inseticida","Herbicida","Fungicida","Herbicida","Herbicida","Inseticida","Inseticida","Inseticida","Herbicida","Herbicida","Herbicida","Inseticida","Inseticida","Fungicida","Herbicida","Inseticida","Fungicida","Fungicida","Fungicida","Fungicida","Fungicida","Inseticida","Inseticida","Fungicida","Fungicida","Inseticida","Herbicida","Fungicida","Inseticida","Fungicida","Fungicida","Herbicida","Inseticida","Inseticida","Fungicida","Herbicida","Fungicida","Inseticida","Fungicida","Herbicida","Inseticida","Inseticida","Herbicida","Herbicida","Herbicida","Fungicida","Inseticida","Fungicida","Inseticida","Fungicida","Fungicida","Herbicida","Herbicida","Fungicida","Inseticida","Herbicida","Inseticida","Inseticida","Inseticida","Inseticida","Herbicida","Inseticida","Inseticida","Inseticida","Herbicida","Herbicida","Fungicida","Fungicida","Fungicida","Inseticida","Fungicida","Herbicida","Inseticida","Herbicida","Fungicida","Fungicida","Herbicida","Herbicida","Herbicida","Herbicida","Herbicida","Herbicida","Fungicida","Herbicida","Herbicida","Inseticida","Fungicida","Herbicida","Fungicida","Fungicida","Herbicida","Inseticida","Fungicida","Inseticida","Inseticida","Inseticida","Fungicida","Inseticida","Inseticida","Herbicida","Herbicida","Herbicida","Herbicida","Inseticida","Fungicida","Inseticida","Herbicida","Herbicida","Inseticida","Herbicida","Inseticida","Fungicida","Herbicida","Herbicida","Herbicida","Herbicida","Herbicida","Herbicida","Fungicida","Fungicida","Fungicida","Inseticida","Fungicida","Inseticida","Inseticida","Herbicida","Fungicida","Herbicida","Herbicida","Inseticida","Fungicida","Fungicida","Fungicida","Fungicida","Herbicida","Herbicida","Herbicida","Herbicida","Herbicida","Herbicida","Herbicida","Herbicida","Fungicida","Inseticida","Herbicida","Herbicida","Herbicida","Herbicida","Inseticida","Inseticida","Herbicida","Herbicida","Fungicida","Fungicida","Fungicida","Inseticida","Herbicida","Herbicida","Fungicida","Herbicida","Fungicida","Inseticida","Inseticida","Inseticida","Herbicida","Inseticida","Herbicida","Herbicida","Fungicida","Herbicida","Herbicida","Herbicida","Inseticida","Herbicida","Herbicida","Herbicida","Herbicida","Inseticida","Herbicida","Inseticida","Fungicida","Inseticida","Herbicida","Herbicida","Inseticida","Inseticida","Fungicida","Herbicida","Herbicida","Fungicida","Herbicida","Inseticida","Herbicida","Inseticida","Herbicida","Inseticida","Herbicida","Fungicida","Fungicida","Fungicida","Herbicida","Inseticida","Herbicida","Inseticida","Inseticida","Inseticida","Inseticida","Fungicida","Fungicida","Inseticida","Herbicida","Fungicida","Inseticida","Herbicida","Fungicida","Inseticida","Inseticida","Inseticida","Herbicida","Fungicida","Fungicida","Fungicida","Inseticida","Herbicida","Fungicida","Inseticida","Herbicida","Herbicida","Herbicida","Inseticida","Herbicida","Herbicida","Fungicida","Fungicida","Herbicida","Inseticida","Fungicida","Inseticida","Inseticida","Herbicida","Inseticida","Fungicida","Inseticida","Fungicida","Fungicida","Herbicida","Herbicida","Inseticida","Herbicida","Fungicida","Herbicida","Fungicida","Fungicida","Fungicida","Inseticida","Fungicida","Fungicida","Herbicida","Fungicida","Fungicida","Fungicida","Herbicida","Fungicida","Inseticida","Herbicida","Inseticida","Herbicida","Fungicida","Herbicida","Herbicida","Fungicida","Inseticida","Herbicida","Herbicida","Fungicida","Fungicida","Fungicida","Herbicida","Inseticida","Inseticida","Fungicida","Inseticida","Inseticida","Fungicida","Fungicida","Herbicida","Herbicida","Inseticida","Fungicida","Herbicida","Fungicida","Fungicida","Herbicida","Herbicida","Fungicida","Fungicida","Herbicida","Fungicida","Fungicida","Fungicida",{"$nulls":385},{"$f":"COUNTA(AIP3:ANW3)","v":0}]
["Grupo Químico",null,"Ácido Ariloxialcanóico","Triazol","Avermectina","Sulfonylurea herbicide; Pyrimidinylsulfonylurea herbicide","Sulfoniluréia","Organofosforado","Organofosforado","Organofosforado","Neonicotinóide","Cloracetanilida","Benzotiadiazol","éter difenílico","piretróide","Estrobilurina","Neonicotinoide","Triazolona","Uréia","   Triazolona","ácido tetramico ","Estrobilurina","Dicarboximida","ácido ariloxialcanóico","Cloracetanilida","Cloracetanilida","pirazol carboxamida","Piretroide ","fosfonato","Alquilazina","Sulfoniluréia","Antranilamida","Triazol","Semicarbazona","Piretróide","Pirimidilamina","Triazina","Triazina","triazolinona","Ácido Ariloxialcanóico","ácido piridiniloxialcanóico","Estrobilurina","arilformamidina","Avermectina","Imidazolinonas","Dimetilditiocarbamato","alquilenobis","Benzoiluréia","tiadiazinona","Triazol","estrobilurina","oxima ciclohexanodiona","ácido piridiniloxialcanóico","ácido piridiniloxialcanóico","Triazol","  sulfanililcarbamato","  sulfanililcarbamato","benzoiluréia","Triazol","Triazina","Triazina","Triazina","Triazina","Dicarboximida","oxima ciclohexanodiona","   Triazolona","Uréia","Organofosforado","Oxadiazina","Tetranortriterpenóide","Tetranortriterpenóide","sulfoniluréia","Estrobilurina","Estrobilurina","Benzotiadiazinona","Isotiocianato de metila ","Triazol","metilcarbamato de oxima","Diamida do ácido fitálico","triazol","acilalaninato","Benzimidazóis","Antranilamida","Metilcarbamato de benzofuranila ","Metilcarbamato de benzofuranila ","Benzotiadiazinona","Valinamida carbamato","avermectina","pirazol carboxamida","Piretróide","Composto inorgânico","Piretróide","Piretróide","benzotiazol","Benzotiadiazol","ácido pirimidiniloxibenzóico","Piretróide","benzoiluréia","Éter piridiloxipropílico","éter difenílico","Piretróide","Triazolona","Anilida","Anilida","metilcarbamato de oxima","Uracila","alifático halogenado","triazol","Piretróide","isotiocianato de metila ","tiadiazinona","Uréia","organofosforado","Tricetona","neonicotinóide","ácido piridinocarboxílico","Anilida","Dicarboximida","Dicarboximida","Carbamato","Piretróide","Metilcarbamato de naftila","Benzimidazóis","Benzimidazóis","nicotinóide","Benzimidazóis","metilcarbamato de benzofuranila","carboxanilida","   Triazolona","tiocarbamato","tiocarbamato","Benzoiluréia","antibioótico","Organofosforado","Organofosforado","Triazol","Fenamidona","Oxima ciclohexanodiona","Benzimidazóis","Carbonitrilas","Benzoiluréia","Dicarboximida","Pirazol","piridina azometina","Antranilamida","imidazol","antranilamida","sulfoniluréia","organofosforado","Benzoilacetonitrila","acetamida","Piretróide","Triazol","anilinopirimidina","Triazinamina","     Sulfoniluréia","Oxima ciclohexanodiona","ácido ariloxifenoxipropiônico","isoxazolidinona","sulfonanilida triazolopirimidina","Antranilamida","análogo de pirazol","benzoiluréia","Carbamate fungicide","     Sulfoniluréia","     Sulfoniluréia","     Sulfoniluréia","Carbonitrilas","Organofosforado","Neocotinoide","Estrobilurina","Piretróide","Fenilpiridinilamina","triazol","Neonicotinóide","Composto inorgânico","Imidazolinonas","Éter piridiloxipropílico","organofosforado","Triazina","Triazol","Neonicotinóide","Neonicotinoide","Carbonitrilas","Benzoiluréia","Organofosforado","Carbonitrilas","Carbonitrilas","Carbonitrilas","Piretróide","Isotiocianato de metila ","Piretróide","quinona","Piretróide","Antranilamida","Benzimidazóis","Benzimidazóis","feniltiouréia","Quarternary ammonium herbicide","Ácido Benzóico","Bipiridílio","Sulfonanilida triazolopirimidina","Triazol","Benzoiluréia","Benzoiluréia","organofosforado","morfolina","organofosforado","Benzoiluréia","triazolinona","Neonicotinóide","Amônia Quaternária","Uréia","Alquilenobis (ditiocarbamato)","quinona","Uréia","Ácido Ariloxialcanóico","Benzotiadiazinona","guanidina","guanidina","Éter difenílico","Cloroacetanilida","Triazol","Estrobilurina","Piretróide","Triazol","Neonicotinoide","cetoenol","sulfoniluréia","Composto inorgânico","Triazol","acetamida","oxazolidinadiona ","Sulfoniluréia","anilinopirimidina","Piretróide","espinosinas","espinosinas","cetoenol","cetoenol","Piretróide","difenil oxazoline","sulfoniluréia","éter tiadiazólico","Organofosforado","espinosinas","sulfoxaminas","Triazina","Triazina","ácido quinolinocarboxílico","oxazolidinadiona ","Homoalanina substituída","Piretroide ","Fenamidona","Organophosphate","Aryloxyphenoxypropionat herbicide","Pirazol","pirazol","Piretróide","Morfolina","Piretróide","Piretróide","Homoalanina substituída","Fenilpirazol","Triazol","Sulfoniluréia","Éter difenílico","Estrobilurina","nicotinóide","Arilpicolinato","Ácido ariloxifenoxipropiônico","Fenilpiridinilamina","Diamida do ácido fitálico","fenilpirrol","Benzoiluréia","Sulfonanilida triazolopirimidina","Ciclohexenodicarboximida","Flumioxazin herbicide","Flumioxazin herbicide","Ciclohexenodicarboximida","Benzamida","Butenolida","Triazol","ácido piridiniloxialcanóico","carboxamida","Triazol","Carboxamida","Triazol","Dicarboximida","Dicarboximida","Éter difenílico","Sulfoniluréia","Antranilamida","morfolina","fosfonato","Composto inorgânico","organofosforado","organofosforado","Triazolintiona","Fenilpiridinilamina","Benzimidazóis","Carbonitrilas","Piretróide","Triazol","Éter difenílico","Ácido ariloxifenoxipropiônico","Carbamato","acilalaninato","Éter difenílico","Piretróide","Benzoiluréia","Arilpicolinato","Composto inorgânico","triazina","Triazina","Triazina","sulfoniluréia","Carbonitrilas","Glicina Substituída","Homoalanina substituída","Glicina Substituída","Éter difenílico","Bipiridílio","Organofosforado","sulfoniluréia","ácido piridinocarboxílico","sulfoniluréia","ácido ariloxifenoxipropiônico","imidazol","benzoiluréia","antranilamida","pirimidinadiona","Dinitroanilina","Triazina","Piretróide","Triazinona","Triazinona","iazolidinacarboxamida","Composto inorgânico","Organoestânico","Hussar","Carbonitrilas","Imidazol","Imidazol","Imidazolinonas","Imidazolinonas","Imidazolinonas","Imidazolinonas","imidazolinona","Triazol","Neonicotinóide","organofosforado","Triazol","carboxamida","Benzoiluréia","Alquilazina","Oxadiazina","Carbamate fungicide","Piretróide","Diacilhidrazina","sulfoniluréia","Hussar","Triazol","Dicarboximida","Carbonitrilas","phenyloxoethyl thiophene amida,","Isoxazol herbicide","Triazol","Piretróide","Piretróide","Cloracetanilida","Composto inorgânico","Piretróide","Uréia","antibioótico","Sulfoniluréia","sulfoniluréia","phenyloxoethyl thiophene amida,","Triazolona","Organofosforado","Uracila","Composto inorgânico","Cloracetanilida","Éter difenílico","Piretróide","metilcarbamato de oxima","Carbamato","Uréia","Homoalanina substituída","Uréia","Organofosforado","Benzoiluréia","Imidazol","Triazinona","Organofosforado","Triazol","Alquilenobis (ditiocarbamato)","Alquilenobis (ditiocarbamato)","éter mandelamida","Alquilenobis (ditiocarbamato)","metilcarbamato de benzofuranila","Benzoiluréia","Acilalaninato","fenilpirrol","Neonicotinóide","ácido ariloxialcanóico","triazol","Piretróide","Dicarboximida","Organoestânico","Tricetona","Semicarbazona","Semicarbazona","Acilalaninato","isotiocianato de metila ","triazol","organofosforado","alquilenobis","Cloroacetanilida","metilcarbamato de oxima","Diacilhidrazina","Triazinona","Alquilazina","Sulfoniluréia","Triazol","diacilhidrazina","carboxamida","sulfonamida fluoroalifática","feniluréia","carboxamida","organoarsênico","Éter difenílico","Triazol","espinosinas","Sulfonylurea herbicide; Pyrimidinylsulfonylurea herbicide","Benzoiluréia","Organofosforado","Éter difenílico","Organofosforado","Sulfoniluréia","cetoenol","Benzoilacetonitrila","sulfito de alquila","Imidazolinonas","Imidazolinonas","Triazol","triazol","Carboxamida","Organofosforado","Dicarboximida","sulfoniluréia","pirazol","oxadiazolona","Piperidinil Tiazol Izoxazolina","Composto inorgânico","Éter difenílico","sulfonanilida triazolopirimidina","ácido ariloxifenoxipropiônico","     Sulfoniluréia","Bipiridílio","Homoalanina substituída","feniluréia","Dinitroanilina","sulfonanilida triazolopirimidina","Piretróide","Triazol","ácido piridinocarboxílico","estrobilurina","carboxamida","Ácido ariloxifenoxipropiônico","piridina azometina","Estrobilurina","análogo de pirazol","Piretróide","piridazinona","anilinopirimidina","Organofosforado","Éter piridiloxipropílico","análogo de ácido pirimidiniloxibenzóico","Pirazol","oxima ciclohexanodiona","Aryloxyphenoxypropionat herbicide","feniltiouréia","alquilenobis","Neocotinoide","Triazolona","Oxima ciclohexanodiona","Metilcarbamato de benzofuranila ","Dinitroanilina","Antranilamida","triazol","Sulfonanilida triazolopirimidina","Triazina","Triazina","Triazina","Triazina","Triazina","Estrobilurina","Estrobilurina","Triazol","Éter piridiloxipropílico","Dicarboximida","avermectina","Organofosforado","oxima ciclohexanodiona","Pirazol","triazina","Anilida","sulfito de alquila","Triazol","alquilenobis","Triazol","Triazolintiona","Isoxazol herbicide","Alquilazina","ácido quinolinocarboxílico","Ácido ariloxifenoxipropiônico","ácido ariloxifenoxipropiônico","Ciclohexenodicarboximida","   Triazolona","Ácido Benzóico","Triazol","Organofosforado","Aryloxyphenoxypropionat herbicide","Imidazolinonas","sulfonanilida triazolopirimidina","isoxazolidinona","Organofosforado","Fenilpirazol","Amônia Quaternária","Ciclohexenodicarboximida","éter mandelamida","Dimetilditiocarbamato","Alquilenobis (ditiocarbamato)","Éter difenílico","ácido pirimidiniloxibenzóico","oxadiazolona","Dicarboximida","Glicina Substituída","Dicarboximida","piretróide","organofosforado","Piretróide","pirimidinadiona","piridazinona","Sulfonylurea herbicide; Pyrimidinylsulfonylurea herbicide","   Triazolona","Triazol","Sulfonanilida triazolopirimidina","Oxima ciclohexanodiona","Aryloxyphenoxypropionat herbicide","Carbamato","sulfoniluréia","Triazinona","Cloroacetanilida","oxima ciclohexanodiona","Metilcarbamato de naftila","Triazina","Butenolida","Triazol","difenil oxazoline","Benzoilciclohexanodiona","Triazolona","Neonicotinóide","Piretróide","Triazol","Sulfonanilida triazolopirimidina","Uréia","Anilida","   Triazolona","Piretróide","Anilida","Fenilpirazol","análogo de ácido pirimidiniloxibenzóico","Piretróide","Sulfonylurea herbicide; Pyrimidinylsulfonylurea herbicide","Triazol","carboxamida","Composto inorgânico","Triazolona","sulfonamida fluoroalifática","Sulfoniluréia","sulfoxaminas","Piretróide","Organophosphate","Organophosphate","Dicarboximida","Dicarboximida","Organophosphate","Flumioxazin herbicide","Benzimidazóis","organofosforado","Cloracetanilida","Triazol","iazolidinacarboxamida","Piretróide","Piretróide","Ácido ariloxifenoxipropiônico","Triazol","Triazol","Triazol","diacilhidrazina","Uréia","Benzimidazóis","Benzoiluréia","Benzoilciclohexanodiona","Triazinona","oxima ciclohexanodiona","organofosforado","Triazina","Triazina","éter tiadiazólico","Triazol","ácido piridinocarboxílico","Benzoiluréia","benzimidazol","neonicotinóide","Neonicotinoide","Triazolona","Éter piridiloxipropílico","Triazol","Carbamato","Benzimidazóis","Dimetilditiocarbamato","Bipiridílio","Triazinona","Pirazol","ácido ariloxifenoxipropiônico","Benzimidazóis","ácido piridiniloxialcanóico","Triazol","Valinamida carbamato","Carbonitrilas","Piretróide","Triazol","benzotiazol","ácido piridiniloxialcanóico","Estrobilurina","imidazol","Estrobilurina","sulfoniluréia","imidazol","Benzoiluréia","Dinitroanilina","Triazinamina","Ácido dioxociclohexanocarboxílico","triazol","Ácido dioxociclohexanocarboxílico","Glicina Substituída","anilinopirimidina","Piretróide","     Sulfoniluréia","Triazinona","Estrobilurina","Benzamida","Triazol","ácido ariloxifenoxipropiônico","Antranilamida","Semicarbazona","Morfolina","Avermectina","Organofosforado","Dimetilditiocarbamato","carboxanilida","organoarsênico","Benzotiadiazinona","Benzoiluréia","Ciclohexenodicarboximida","Pirazol","Estrobilurina","Pirimidilamina","imidazolinona","Sulfoniluréia","Carbonitrilas","Carbonitrilas","Flumioxazin herbicide","Triazol","Piperidinil Tiazol Izoxazolina","benzamida"]
["Produto (nome comercial)",null,"2,4 D ","Abacus","Abamectina","Accent","Accurate","Ace ","Acefato ","Acero","Acetamiprido ","Acetocloro","Acibenzolar-S-metílico","Acifluorfem-sódico ","Acrinatrina","Acronis","Actara","Adengo","Afalon","Affinity","Afidopiropeno ","Agria","Agricur  ","Agritone","Alaclor","Alacloro","Alade","Alfa-Cipermetrina ","Aliette","Alion","Ally","Altaco","Alto 100","Alverde","Ametista","Ametoctradina","Ametrex ","Ametrina","Amicarbazona","Aminol 806","Aminopiralide","Amistar","Amitraz","Ampligo","Amplo","Anchor","Antracol","Antrimo","Applaud","Aproach","Aproach Power","Aramo","Arbust","Arreio","Artea","Asulam ","Asulox","Atabron","Atento","Atranex","Atrasimex","Atrasimex","Atrazina","Attic","Aura","Aurora","Aval","Avant ","Avatar","Azadiractina ","Azamax","Azimsulfurom ","Azimut","Azoxistrobina ","Basagran","Basamid","Baytan","Bazuka","Belt","Belyan","Benalaxil ","Bendazol","Benevia","Benforce","Benfuracarb","Bentazona","Bentiavalicarbe isopropílico ","Benzoato de emamectina","Benzovindiflupir","Beta-ciflutrina ","Bicarbonato de potássio","Bifentrina","Biflex","Bim","Bion","Bispirabaque","Bistar","Bistrifluron","Blade","Blazer","Bold","Boral","Boscalid","Boscalida","Brilhamte","Bromacila","Brometo de metila","Bromuconazol","Bulldock ","Bunema","Buprofezina","Butiron","Cadusafós ","Calisto","Calypso","Campestre","Cantus","Captan","Captana","Captor","Capture","Carbaril ","Carben ","Carbendazim","Carbine","Carbomax ","Carbossulfano ","Carboxina ","Carfentrazona-etílica","Cartape","Cartarys","Cascade","Casugamicina","Catcher ","Cefanol","Celeiro","Censor","Centurion","Cercobin","Cerconil","Certero","Certus","Chaser","Chess","Ciantraniliprole","Ciazofamida ","Ciclaniliprole","Ciclossulfamurom","Cierto","Ciflumetofen ","Cimoxanil","Cipermetrina","Ciproconazol","Ciprodinil","Ciromazina  ","Classic","Cletodim","Clodinafope-Propargil ","Clomazona","Cloransulam-metílico","Clorantraniliprole","Clorfenapir","Clorfuazurom","Cloridrato de propamocarbe","Clorim","Clorimurom-etílico","Clorimuron","Clorotalonil","Clorpirifós","Clotianidina","Comet","Commanche","Completo","Condor","Connect","Contact","Contain","Cordial","Counter","Coyote","Cronnos","Cropstar;","Cruiser;","Cuprodil ","Curyom","Curyom ","Dacobre ","Daconil","Dacostar","Danimen","Dazomete ","Decis","Delan","Deltametrina","Demarcor","Derosal","Derox","Diafenturiom","Dibrometo de Diquate","Dicamba","Dicloreto de Paraquate","Diclosulam ","Difenoconazol","Diflubenzurom ","Diflumax","Dimetoato ","Dimetomorfe","Dimexion","Dimilim","Dinamic","Dinofeturam","Diquate","Direx","Dithane","Ditianona","Diurom ","DMA ","Doble","Dodex","Dodina ","Drible","Dual Gold","Egan","Elatus","Eleitto","Eminent ","Engeo","Envidor","Envoke","Enxofre","Epoxiconazol ","Equation","Equation","Equip Plus","Erune","Esfenvalerato","Espinetoram ","Espinosade ","Espirodiclofeno","Espiromesifeno","Etofenproxi","Etoxazol","Etoxissulfurom","Etridiazol","Evolution","Exalt","Expedition","Extrazin ","Facero ","Facet","Famoxadona","Fascinate","Fastac","Fenamidona","Fenitrotiona","Fenoxaprop-P-ethyl ","Fenpirazamina","Fenpiroximato ","Fenpropatrina","Fenpropimorfe","Fentrol","Fersol","Finale","Fipronil ","Flair","Flazassulfurom","Flex","Flint ","Flonicamida","Florpirauxifen-benzil","Fluazifope-p-butil ","Fluazinam","Flubendiamida","Fludioxonil","Flufenoxurom","Flumetsulam","Flumicloraque-pentílico ","Flumioxazina","Flumyzin","Fluopicolide","Fluopiram","Flupiradifurona ","Fluquinconazol","Fluroxipir","Flutolanil","Flutriafol","Fluxapiroxade  ","Folicur;","Folpan","Folpete","Fomesafem","Foransulfurom","Fortenza","Forum","Fosetil","Fosfeto de alúminio","Fosmete","Fostiazato","Fox","Frowncide","Fungicarb ","Funginil","Fury","Fusão","Fusiflex","Fusilade","Futur","Galben","Gallaxy","Gama-Cialotrina ","Game","Gapper","Gastoxin","Gesagard","Gesapax ","Gesaprim","Gladium","Glider ","Glifosato","Glufosinato de amônio","Glyphotal","Goal","Gramoxone","Graolin","Gulliver","Halauxifen-metíl","Halossulfurom-metílico ","Haloxifope-P-metílico","Hanami","Hanaro","Hayate","Heat","Herbadox","Herbipak ","Hero","Hexanil","Hexazinona","Hexitiazox","Hidróxido de cobre","Hidróxido de Fentina","Hussar","Ichiban","Imazacure","Imazalil ","Imazamoxi ","Imazapique  ","Imazapir","Imazaquim","Imazetapir","Imibenconazol ","Imidacloprido ","Imidam","Impact","Impirfluxam","Imunit","Indaziflam","Indoxacarb","Infinito","Insemat","Intrepid","Invest","Iodossulfurom-metílico-sódico","Ipconazol","Iprodiona","Isatalonil","Isofetamida","Isoxaflutol ","Juno","K-Obiol","K-Othrine ","Kadett","Kaligreen","Karate zeon","Karmex","Kasumin","Katana","Kelion","Kenja","Kicker","Klorpan ","Krovar","Kumulus","Laço ","Lactofem","Lambda-Cialotrina ","Lannate","Larvim","Lava","Liberty","Linurom ","Lorsban","Lufenuron","Magnate","Magnus","Malation","Manage","Mancozeb","Mancozebe","Mandipropamida","Manzate","Marshal","Match","Maxim","Maxim XL","Maxsan","MCPA ","Mefentrifluconazol","Meothrin ","Merpan","Mertin ","Mesotriona","Metaflimizona","Metaflumizone","Metalaxil-M ","Metam-sódico ","Metconazol ","Metidationa ","Metiram","Metolacloro","Metomil","Metoxifenozida ","Metribuzim ","Metribuzin","Metsulfurom-metílico ","Miclobutanil ","Mimic","Miravis","Mirex S","Moceren","Moncut","MSMA ","Naja","Nativo","Natular","Nicossulfurom ","Nomolt","Nordick","Novalurom ","Nufos ","Nufuron;","Oberon","Okay","Omite","Oneshot ","Only","Ópera","Ópera Ultra","Orkestra","Orthene","Orthocide ","Orthosulfamuron","Ortus","Oxadiazona ","Oxatiapiprolina","Oxicloreto de cobre","Oxyfluorfem ","Pacto","Panther","Panzer ","Paraquat","Patrol","Pencicurom ","Pendimetalina","Penoxsulam","Permetrina","Photon ","Picloram","Picoxistrobina","Pidiflumetofen","Pilot ","Pimetrozina","Piraclostrobina","Pirate","Pirephos","Piridabem ","Pirimetanil","Pirimifós-metílico","Piriproxifem ","Piritiobaque-sódico","Piroxassulfona","Poast","Podium","Polo","Polyram","Poncho","Ponteiro","Poquer","Pottente","Premelin","Premio","Premis","Prevaiil","Primagram Gold","Primaiz Gold","Primatop ","Primestra Gold","Primóleo","Priori","Priori Xtra","Prisma","Privilege","Procimidona","Proclaim","Profenofós","Profoxidim ","Prolectus","Prometrina ","Propanil","Propargito ","Propiconazol ","Propinebe ","Prospect","Protioconazol ","Provence","Provence Total","Quincloraque ","Quizalofop-P-ethyl ","Quizalofope-P-tefurílico","Radiant","Rage","Rainvel ","Rancona","Rapel","Rapsode","Raptor","Raster","Reator","Record","Regente","Reglone","Resource","Revus","Rhodiauram","Ridomil","Rimon","Riper","Ronstar","Rotaxil","Roundup","Rovral ","Rufast","Rugby","Safety","Saflufenacil","Sanmite","Sanson","Savana","Score","Scorpion","Select ","Selefen ","Semevim","Sempra","Sencor;","Sequence","Setoxidim ","Sevin","Simazina","Sivanto","Skip","Smile","Soberan","Solara","Sombrero","Sperto","Sphere max","Spider","Spike","Spot","Spotlight","Stalion","Stam","Standak","Staple","Starion","Stoy","Stratego","Sugoy","Sulfato de cobre","Sulfentrazona  ","Sulfluramida ","Sulfometuron metílico","Sulfoxaflor","Sumidan","Sumifog","Sumigran","Sumiguard","Sumilex ","Sumithion","Sumyzin","Support","Suprathion","Surpass","Systhane","Talento","Talisman","Talstar","Targa ","Tasker","Tebuco","Tebuconazol ","Tebufenozida","Tebutiurom","Tebuzim ","Teflubenzurom ","Tembotriona","Tenace","Tepraloxidim ","Terbufós ","Terbumax","Terbutilazina","Terrazole","Tetraconazol","Texaro","Thorn","Tiabendazol","Tiacloprido","Tiametoxam","Tiencarbazona","Tiger","Tilt","Tiodicarbe","Tiofanato-metílico","Tiram ","Tocha","Token","Tolfenpirade","Topic","Topsin","Tordon Ultra","Tornado","Totalit","Totalit","Trebon","Triadimenol  ","Triciclazol","Tricopir-butolítico","Tridium","Trifimine","Trifloxistrobina","Trifloxisulfuron","Triflumizol","Triflumurom","Trifluralina","Trigard ","Trinexapaque-etílico","Triticonazol ","Trix","Trop","Truzon","Turbo","Twister","Unimark","Unizeb ","Verango Prime","Verdadeiro","Verdict-max","Verimark ","Verismo","Versatilis","Vertimec","Vexter","Vitavax ","Vitavax Thiram","Volcane","Volt","Wasp","Xavante","Yamato","Yoda","Zampo","Zaphir","Zartan","Zetanil","Zetaram ","Zethamaxx","Zoom","Zorvec","Zoxamida"]
["14.5 - Ingrediente Ativo do produto",null," 2,4 D","Epoxiconazol ","Abamectina","Nicossulfurom ","Metsulfurom-metílico ","Acefato","Acefato","Acefato","Acetamiprido ","Acetocloro","Acibenzolar-S-metílico","Acifluorfem-sódico ","Acrinatrina","Piraclostrobina","Tiametoxam","Tiencarbazona","Linurom ","Carfentrazona-etílica","Afidopiropeno ","Azoxistrobina ","Folpete","MCPA ","Alacloro","Alacloro","Benzovindiflupir","Alfa-Cipermetrina ","Fosetil","Indaziflam","Sulfometuron metílico","Clorantraniliprole","Ciproconazol","Metaflimizona","Cipermetrina","Ametoctradina","Ametrina","Ametrina","Amicarbazona"," 2,4 D","Aminopiralide","Azoxistrobina ","Amitraz","Abamectina","Imazamoxi ","Tiram ","Propinebe ","Teflubenzurom ","Buprofezina","Ciproconazol","Picoxistrobina","Tepraloxidim ","Tricopir-butolítico","Fluroxipir","Ciproconazol","Asulam ","Asulam ","Clorfuazurom","Fluquinconazol","Atrazina","Atrazina","Simazina","Atrazina","Iprodiona","Profoxidim ","Carfentrazona-etílica","Tebutiurom","Acefato","Indoxacarb","Azadiractina ","Azadiractina ","Azimsulfurom ","Azoxistrobina ","Azoxistrobina ","Bentazona","Dazomete ","Triadimenol  ","Metomil","Flubendiamida","Mefentrifluconazol","Benalaxil ","Carbendazim","Ciantraniliprole","Benfuracarbe","Benfuracarbe","Bentazona","Bentiavalicarbe isopropílico ","Benzoato de emamectina","Benzovindiflupir","Beta-ciflutrina ","Bicarbonato de potássio","Bifentrina","Bifentrina","Triciclazol","Acibenzolar-S-metílico","Bispirabaque","Bifentrina","Bistrifluron","Piriproxifem ","Acifluorfem-sódico ","Fenpropatrina","Sulfentrazona  ","Boscalida","Boscalida","Metomil","Bromacila","Brometo de metila","Bromuconazol","Beta-ciflutrina ","Metam-sódico ","Buprofezina","Tebutiurom","Cadusafós ","Mesotriona","Tiacloprido","Picloram","Boscalida","Captana","Captana","Tiodicarbe","Bifentrina","Carbaril ","Carbendazim","Carbendazim","Flonicamida","Carbendazim","Carbossulfano ","Carboxina ","Carfentrazona-etílica","Cartape","Cartape","Flufenoxurom","Casugamicina","Clorpirifós","Acefato","Flutriafol","Fenamidona","Cletodim","Tiofanato-metílico","Clorotalonil","Triflumurom","Iprodiona","Tolfenpirade","Pimetrozina","Ciantraniliprole","Ciazofamida ","Ciclaniliprole","Ciclossulfamurom","Fostiazato","Ciflumetofen ","Cimoxanil","Cipermetrina","Ciproconazol","Ciprodinil","Ciromazina  ","Clorimurom-etílico","Cletodim","Clodinafope-Propargil ","Clomazona","Cloransulam-metílico","Clorantraniliprole","Clorfenapir","Clorfuazurom","Cloridrato de propamocarbe","Clorimurom-etílico","Clorimurom-etílico","Clorimurom-etílico","Clorotalonil","Clorpirifós","Clotianidina","Piraclostrobina","Cipermetrina","Fluazinam","Bromuconazol","Imidacloprido ","Hidróxido de cobre","Imazapir","Piriproxifem ","Terbufós ","Atrazina","Tebuconazol ","Imidacloprido ","Tiametoxam","Clorotalonil","Lufenuron","Profenofós","Clorotalonil","Clorotalonil","Clorotalonil","Fenpropatrina","Dazomete ","Deltametrina","Ditianona","Deltametrina","Clorantraniliprole","Carbendazim","Carbendazim","Diafenturiom","Dibrometo de Diquate","Dicamba","Dicloreto de Paraquate","Diclosulam ","Difenoconazol","Diflubenzurom ","Diflubenzurom ","Dimetoato ","Dimetomorfe","Dimetoato ","Diflubenzurom ","Amicarbazona","Dinofeturam","Diquate","Diurom ","Mancozebe","Ditianona","Diurom "," 2,4 D","Bentazona","Dodina ","Dodina ","Lactofem","Metolacloro","Tebuconazol ","Azoxistrobina ","Etofenproxi","Tetraconazol","Tiametoxam","Espirodiclofeno","Trifloxisulfuron","Enxofre","Epoxiconazol ","Cimoxanil","Famoxadona","Foransulfurom","Pirimetanil","Esfenvalerato","Espinetoram ","Espinosade ","Espirodiclofeno","Espiromesifeno","Etofenproxi","Etoxazol","Etoxissulfurom","Etridiazol","Acefato","Espinetoram ","Sulfoxaflor","Atrazina","Atrazina","Quincloraque ","Famoxadona","Glufosinato de amônio","Alfa-Cipermetrina ","Fenamidona","Fenitrotiona","Fenoxaprop-P-ethyl ","Fenpirazamina","Fenpiroximato ","Fenpropatrina","Fenpropimorfe","Gama-Cialotrina ","Permetrina","Glufosinato de amônio","Fipronil ","Difenoconazol","Flazassulfurom","Fomesafem","Trifloxistrobina","Flonicamida","Florpirauxifen-benzil","Fluazifope-p-butil ","Fluazinam","Flubendiamida","Fludioxonil","Flufenoxurom","Flumetsulam","Flumicloraque-pentílico ","Flumioxazina","Flumioxazina","Fluopicolide","Fluopiram","Flupiradifurona ","Fluquinconazol","Fluroxipir","Flutolanil","Flutriafol","Fluxapiroxade  ","Tebuconazol ","Folpete","Folpete","Fomesafem","Foransulfurom","Ciantraniliprole","Dimetomorfe","Fosetil","Fosfeto de alúminio","Fosmete","Fostiazato","Protioconazol ","Fluazinam","Carbendazim","Clorotalonil","Cipermetrina","Tebuconazol ","Fomesafem","Fluazifope-p-butil ","Tiodicarbe","Benalaxil ","Novalurom ","Gama-Cialotrina ","Lufenuron","Florpirauxifen-benzil","Fosfeto de alúminio","Prometrina ","Ametrina","Atrazina","Etoxissulfurom","Clorotalonil","Glifosato","Glufosinato de amônio","Glifosato","Oxyfluorfem ","Dicloreto de Paraquate","Pirimifós-metílico","Azimsulfurom ","Halauxifen-metíl","Halossulfurom-metílico ","Haloxifope-P-metílico","Ciazofamida ","Bistrifluron","Ciclaniliprole","Saflufenacil","Pendimetalina","Ametrina","Cipermetrina","Hexazinona","Hexazinona","Hexitiazox","Hidróxido de cobre","Hidróxido de Fentina","Iodossulfurom-metílico-sódico","Clorotalonil","Imazalil ","Imazalil ","Imazamoxi ","Imazapique  ","Imazapir","Imazaquim","Imazetapir","Imibenconazol ","Imidacloprido ","Fosmete","Flutriafol","Impirfluxam","Teflubenzurom ","Indaziflam","Indoxacarb","Cloridrato de propamocarbe","Bifentrina","Metoxifenozida ","Ciclossulfamurom","Iodossulfurom-metílico-sódico","Ipconazol","Iprodiona","Clorotalonil","Isofetamida","Isoxaflutol ","Propiconazol ","Deltametrina","Deltametrina","Acetocloro","Bicarbonato de potássio","Lambda-Cialotrina ","Diurom ","Casugamicina","Flazassulfurom","Orthosulfamuron","Isofetamida","Sulfentrazona  ","Clorpirifós","Bromacila","Enxofre","Alacloro","Lactofem","Lambda-Cialotrina ","Metomil","Tiodicarbe","Tebutiurom","Glufosinato de amônio","Linurom ","Clorpirifós","Lufenuron","Imazalil ","Hexazinona","Malation","Imibenconazol ","Mancozebe","Mancozebe","Mandipropamida","Mancozebe","Carbossulfano ","Lufenuron","Metalaxil-M ","Fludioxonil","Dinofeturam","MCPA ","Mefentrifluconazol","Fenpropatrina","Captana","Hidróxido de Fentina","Mesotriona","Metaflimizona","Metaflimizona","Metalaxil-M ","Metam-sódico ","Metconazol ","Metidationa ","Metiram","Metolacloro","Metomil","Metoxifenozida ","Metribuzim ","Indaziflam","Metsulfurom-metílico ","Miclobutanil ","Tebufenozida","Pidiflumetofen","Sulfluramida ","Pencicurom ","Flutolanil","MSMA ","Lactofem","Tebuconazol ","Espinosade ","Nicossulfurom ","Teflubenzurom ","Malation","Novalurom ","Clorpirifós","Metsulfurom-metílico ","Espiromesifeno","Ciflumetofen ","Propargito ","Imazaquim","Imazapique  ","Epoxiconazol ","Metconazol ","Fluxapiroxade  ","Acefato","Captana","Orthosulfamuron","Fenpiroximato ","Oxadiazona ","Oxatiapiprolina","Oxicloreto de cobre","Oxyfluorfem ","Cloransulam-metílico","Quizalofope-P-tefurílico","Clorimurom-etílico","Dicloreto de Paraquate","Glufosinato de amônio","Pencicurom ","Pendimetalina","Penoxsulam","Permetrina","Triadimenol  ","Picloram","Picoxistrobina","Pidiflumetofen","Fluazifope-p-butil ","Pimetrozina","Piraclostrobina","Clorfenapir","Esfenvalerato","Piridabem ","Pirimetanil","Pirimifós-metílico","Piriproxifem ","Piritiobaque-sódico","Piroxassulfona","Setoxidim ","Fenoxaprop-P-ethyl ","Diafenturiom","Metiram","Clotianidina","Sulfentrazona  ","Cletodim","Benfuracarbe","Trifluralina","Clorantraniliprole","Triticonazol ","Flumetsulam","Atrazina","Atrazina","Atrazina","Atrazina","Atrazina","Azoxistrobina ","Azoxistrobina ","Difenoconazol","Piriproxifem ","Procimidona","Benzoato de emamectina","Profenofós","Profoxidim ","Fenpirazamina","Prometrina ","Propanil","Propargito ","Propiconazol ","Propinebe ","Epoxiconazol ","Protioconazol ","Isoxaflutol ","Indaziflam","Quincloraque ","Quizalofop-P-ethyl ","Quizalofope-P-tefurílico","Flumicloraque-pentílico ","Carfentrazona-etílica","Dicamba","Ipconazol","Acefato","Fenoxaprop-P-ethyl ","Imazamoxi ","Penoxsulam","Clomazona","Clorpirifós","Fipronil ","Diquate","Flumicloraque-pentílico ","Mandipropamida","Tiram ","Mancozebe","Novalurom ","Bispirabaque","Oxadiazona ","Procimidona","Glifosato","Iprodiona","Acrinatrina","Cadusafós ","Etofenproxi","Saflufenacil","Piridabem ","Nicossulfurom ","Carfentrazona-etílica","Difenoconazol","Flumetsulam","Cletodim","Fenoxaprop-P-ethyl ","Tiodicarbe","Halossulfurom-metílico ","Metribuzim ","Metolacloro","Setoxidim ","Carbaril ","Simazina","Flupiradifurona ","Flutriafol","Etoxazol","Tembotriona","Sulfentrazona  ","Imidacloprido ","Bifentrina","Ciproconazol","Diclosulam ","Tebutiurom","Boscalida","Carfentrazona-etílica","Gama-Cialotrina ","Propanil","Fipronil ","Piritiobaque-sódico","Bifentrina","Nicossulfurom ","Propiconazol ","Impirfluxam","Sulfato de cobre","Sulfentrazona  ","Sulfluramida ","Sulfometuron metílico","Sulfoxaflor","Esfenvalerato","Fenitrotiona","Fenitrotiona","Procimidona","Procimidona","Fenitrotiona","Flumioxazina","Tiofanato-metílico","Metidationa ","Acetocloro","Miclobutanil ","Hexitiazox","Bifentrina","Bifentrina","Quizalofop-P-ethyl ","Flutriafol","Tebuconazol ","Tebuconazol ","Tebufenozida","Tebutiurom","Carbendazim","Teflubenzurom ","Tembotriona","Metribuzim ","Tepraloxidim ","Terbufós ","Terbutilazina","Terbutilazina","Etridiazol","Tetraconazol","Halauxifen-metíl","Triflumurom","Tiabendazol","Tiacloprido","Tiametoxam","Tiencarbazona","Piriproxifem ","Propiconazol ","Tiodicarbe","Tiofanato-metílico","Tiram ","Dicloreto de Paraquate","Hexazinona","Tolfenpirade","Clodinafope-Propargil ","Tiofanato-metílico","Aminopiralide","Flutriafol","Bentiavalicarbe isopropílico ","Clorotalonil","Etofenproxi","Triadimenol  ","Triciclazol","Tricopir-butolítico","Azoxistrobina ","Triflumizol","Trifloxistrobina","Trifloxisulfuron","Triflumizol","Triflumurom","Trifluralina","Ciromazina  ","Trinexapaque-etílico","Triticonazol ","Trinexapaque-etílico","Glifosato","Ciprodinil","Beta-ciflutrina ","Clorimurom-etílico","Metribuzim ","Azoxistrobina ","Fluopiram","Ciproconazol","Haloxifope-P-metílico","Ciantraniliprole","Metaflimizona","Fenpropimorfe","Abamectina","Clorpirifós","Tiram ","Carboxina ","MSMA ","Bentazona","Triflumurom","Fluopicolide","Piroxassulfona","Azoxistrobina ","Ametoctradina","Imazetapir","Metsulfurom-metílico ","Clorotalonil","Clorotalonil","Flumioxazina","Flutriafol","Oxatiapiprolina","Zoxamida"]
["14.6 - Toxicidade para peixes - 96h LC50 (mg l-1)",null,63.4,3.14,0.0036,65.7,150,0.63,0.63,0.63,100,0.36,null,17,0.0061,0.006,125,104,3.15,1.6,18.3,0.47,0.233,100,1.8,1.8,0.0035,1.8000000000000002E-3,122,0.42,12.5,12,19,0.228,2.8E-3,0.065,5,5,120,63.4,100,0.47,0.74,0.0036,122,0.171,0.33,0.0065,0.33,19,0.075,82.5,1.3,14.3,19,91.3,91.3,300,1.9,4.5,4.5,90,4.5,36.2,15,1.6,87,0.63,0.17,null,null,154,0.47,0.47,100,0.3,21.3,0.63,0.06,0.532,3.75,0.19,12.6,0.038,0.038,100,10,null,0.0035,6.8e-05,1200,0.00026,0.00026,7.3,null,95,0.00026,0.5,0.27,17,2.3E-3,93.8,2.7,2.7,0.63,36,null,1.7,6.8e-05,0.175,0.33,87,0.13,120,90.1,8.8,2.7,0.186,0.186,1.4,0.00026,2.6,0.19,0.19,100,0.19,0.015,2.3,1.6,1.6,1.6,0.0049,null,0.0013,0.63,33,0.74,25,11,0.038,0.021,36.2,0.049,100,12.6,0.56,0.195,7.7,114,0.63,29,2.8E-3,19,2.41,100,8.4,25,0.21,14.4,86,12,0.007,300,99,8.4,8.4,8.4,0.038,0.0013,104.2,0.006,2.8E-3,0.055,1.7,211,0.017,100,0.27,0.004,4.5,4.4,211,125,0.038,29,0.08,0.038,0.038,0.038,2.3E-3,0.3,0.00026,0.07,0.00026,12,0.19,0.19,0.007,67,98.85,19,110,1.1,0.13,0.13,30.2,6.1,30.2,0.13,120,100,21,6.7,0.074,0.07,6.7,63.4,100,0.57,0.57,0.1,1.23,4.4,0.47,0.0027,4.3,125,0.035,730,0.063,3.14,29,0.011,100,10.56,1E-4,2.69,null,0.035,0.016,0.0027,null,80,2.4,0.63,2.69,101,4.5,4.5,100,0.011,710,1.8000000000000002E-3,0.74,1.3,0.19,5.2,0.00105,2.3E-3,2.3,3.5E-4,0.0125,710,0.248,1.1,22,170,0.022,100,100,1.41,0.055,0.06,0.23,0.0049,300,1.1,2.3,2.3,0.36,0.98,70.5,1.9,14.3,5.4,33,546,4.4,0.233,0.233,170,100,12.6,6.1,122,0.0097,0.24,114,1.83,0.055,0.19,0.038,2.8E-3,4.4,170,1.41,1.4,3.75,1,3.5E-4,29,100,0.0097,5.5,5,4.5,80,0.038,38,710,38,0.25,19,0.404,154,1.33,118,0.088,0.56,0.5,0.195,98,"0,196",5,2.8E-3,320,320,3.2,0.017,0.05,100,0.038,1.48,1.48,122,100,100,100,340,0.0085,211,0.24,33,null,0.0065,0.42,0.17,99,0.00026,4.2,7.7,100,1.5,36.2,0.038,2.27,1.7,2.6,0.00026,0.00026,0.36,1200,0.00021,6.7,null,22,100,2.27,93.8,0.0013,36,0.063,1.8,0.1,0.00021,0.63,1.4,87,710,3.15,0.0013,29,1.48,320,0.018,0.0085,0.074,0.074,2.9,0.074,0.015,29,100,0.23,100,100,0.532,2.3E-3,0.186,0.05,120,0.228,0.228,100,0.175,2.1,0.01,0.336,1.23,0.63,4.2,74.6,0.42,150,2,3,0.18,8,0.3,5.4,null,0.1,4.4,null,65.7,0.0065,0.018,1,0.0013,150,0.016,0.63,0.043,100,100,3.14,2.1,546,0.63,0.186,100,0.00105,1.2,0.69,43.8,0.25,86,0.23,8.4,19,710,0.3,"0,196",100,0.0125,21.3,8.8,0.075,0.18,1.41,100,0.006,0.007,1E-4,0.0007,10.56,0.404,0.27,930,2.2,170,0.19,0.007,0.336,104.2,93.8,25,0.038,0.088,12,3.6,300,4.5,4.5,4.5,4.5,4.5,0.47,0.47,1.1,0.27,7.22,null,0.08,15,5.2,5.5,5.4,0.043,2.6,0.33,3.14,1.83,1.7,0.42,100,0.21,0.23,1.1,1.6,98.85,1.5,0.63,0.19,122,100,14.4,0.0013,0.248,21,1.1,2.9,0.171,0.074,1,95,1.2,7.22,38,36.2,0.0061,0.13,0.0027,98,0.0007,65.7,1.6,1.1,300,25,0.19,1.4,118,74.6,1.23,170,2.6,90,70.5,33,null,100,93.8,211,0.00026,19,110,87,2.7,1.6,3.5E-4,5.4,0.248,930,0.00026,65.7,2.6,null,13.2,93.8,8,12.5,101,1E-4,1.3,1.3,7.22,7.22,1.3,2.3,11,0.01,0.36,2,3.2,0.00026,0.00026,0.21,33,4.4,4.4,3,87,0.19,0.0065,100,74.6,82.5,0.004,2.2,2.2,2.4,4.3,1.33,0.021,0.55,90.1,125,104,0.27,2.6,1.4,11,0.171,19,320,0.049,0.21,11,100,33,10,0.038,0.0027,21.3,7.3,1.3,0.47,0.57,0.022,730,0.57,0.021,0.088,100,null,3.6,null,38,2.41,6.8e-05,8.4,74.6,0.47,0.98,19,0.088,12.6,0.228,2.3,0.0036,0.0013,0.171,2.3,null,100,0.021,0.36,2.2,0.47,0.065,340,150,0.038,0.038,2.3,33,0.69,0.16]
["14.7 - Toxicidade - DAH (mg kg-1 day-1)\t",null,{"v":0.05,"d":"0.050"},0.008,{"v":0.0025,"d":"0.003"},{"v":2,"d":"2.000"},{"v":0.22,"d":"0.220"},{"v":0.0025,"d":"0.003"},{"v":0.0025,"d":"0.003"},{"v":0.0025,"d":"0.003"},0.025,{"v":0.0036,"d":"0.004"},null,null,{"v":0.01,"d":"0.010"},{"v":0.03,"d":"0.030"},0.026,{"v":0.23,"d":"0.230"},0.003,{"v":0.03,"d":"0.030"},null,{"v":0.2,"d":"0.200"},{"v":0.1,"d":"0.100"},{"v":0.05,"d":"0.050"},{"v":0.01,"d":"0.010"},{"v":0.01,"d":"0.010"},{"v":0.05,"d":"0.050"},0.015,{"v":1,"d":"1.000"},null,null,{"v":1.58,"d":"1.580"},{"v":0.02,"d":"0.020"},{"v":0.03,"d":"0.030"},{"v":0.05,"d":"0.050"},{"v":10,"d":"10.000"},0.015,0.015,null,{"v":0.05,"d":"0.050"},{"v":0.26,"d":"0.260"},{"v":0.2,"d":"0.200"},0.003,{"v":0.0025,"d":"0.003"},{"v":9,"d":"9.000"},{"v":0.01,"d":"0.010"},0.025,{"v":0.01,"d":"0.010"},{"v":0.01,"d":"0.010"},{"v":0.02,"d":"0.020"},null,0.025,{"v":0.03,"d":"0.030"},{"v":0.8,"d":"0.800"},{"v":0.02,"d":"0.020"},{"v":0.36,"d":"0.360"},{"v":0.36,"d":"0.360"},null,{"v":2E-3,"d":"0.002"},{"v":0.02,"d":"0.020"},{"v":0.02,"d":"0.020"},null,{"v":0.02,"d":"0.020"},{"v":0.06,"d":"0.060"},0.005,{"v":0.03,"d":"0.030"},{"v":0.07,"d":"0.070"},{"v":0.0025,"d":"0.003"},0.005,null,null,{"v":0.1,"d":"0.100"},{"v":0.2,"d":"0.200"},{"v":0.2,"d":"0.200"},{"v":0.1,"d":"0.100"},{"v":0.01,"d":"0.010"},{"v":0.05,"d":"0.050"},{"v":0.0025,"d":"0.003"},0.017,0.035,{"v":0.04,"d":"0.040"},{"v":0.02,"d":"0.020"},{"v":0.01,"d":"0.010"},{"v":0.01,"d":"0.010"},{"v":0.01,"d":"0.010"},{"v":0.1,"d":"0.100"},{"v":0.1,"d":"0.100"},null,{"v":0.05,"d":"0.050"},0.003,null,0.015,0.015,null,null,{"v":0.01,"d":"0.010"},0.015,null,{"v":0.1,"d":"0.100"},null,{"v":0.03,"d":"0.030"},{"v":1E-4,"d":"0.000"},{"v":0.04,"d":"0.040"},{"v":0.04,"d":"0.040"},{"v":0.0025,"d":"0.003"},null,null,{"v":0.01,"d":"0.010"},0.003,{"v":1E-3,"d":"0.001"},{"v":0.01,"d":"0.010"},{"v":0.07,"d":"0.070"},{"v":0.0004,"d":"0.000"},{"v":0.01,"d":"0.010"},{"v":0.01,"d":"0.010"},{"v":0.3,"d":"0.300"},{"v":0.04,"d":"0.040"},{"v":0.1,"d":"0.100"},{"v":0.1,"d":"0.100"},"0,01",0.015,{"v":0.007500000000000001,"d":"0.008"},{"v":0.02,"d":"0.020"},{"v":0.02,"d":"0.020"},0.025,{"v":0.02,"d":"0.020"},0.005,0.008,{"v":0.03,"d":"0.030"},null,null,{"v":0.01,"d":"0.010"},null,{"v":0.01,"d":"0.010"},{"v":0.0025,"d":"0.003"},{"v":0.01,"d":"0.010"},{"v":0.03,"d":"0.030"},{"v":0.16,"d":"0.160"},{"v":0.08,"d":"0.080"},0.015,0.014,{"v":0.06,"d":"0.060"},null,{"v":0.03,"d":"0.030"},{"v":0.01,"d":"0.010"},{"v":0.17,"d":"0.170"},null,null,0.004,{"v":0.17,"d":"0.170"},0.013,{"v":0.05,"d":"0.050"},{"v":0.02,"d":"0.020"},{"v":0.03,"d":"0.030"},{"v":0.06,"d":"0.060"},{"v":0.02,"d":"0.020"},{"v":0.16,"d":"0.160"},0.003,0.133,null,{"v":1.58,"d":"1.580"},0.015,null,{"v":0.29,"d":"0.290"},{"v":0.02,"d":"0.020"},{"v":0.02,"d":"0.020"},{"v":0.02,"d":"0.020"},0.015,{"v":0.01,"d":"0.010"},0.097,{"v":0.03,"d":"0.030"},{"v":0.05,"d":"0.050"},{"v":0.01,"d":"0.010"},{"v":0.01,"d":"0.010"},{"v":0.06,"d":"0.060"},{"v":0.15,"d":"0.150"},{"v":1E-4,"d":"0.000"},{"v":0.1,"d":"0.100"},{"v":0.0006,"d":"0.001"},{"v":0.02,"d":"0.020"},{"v":0.03,"d":"0.030"},{"v":0.06,"d":"0.060"},0.026,0.015,{"v":0.0155,"d":"0.016"},{"v":0.03,"d":"0.030"},0.015,0.015,0.015,{"v":0.03,"d":"0.030"},{"v":0.01,"d":"0.010"},{"v":0.01,"d":"0.010"},{"v":0.01,"d":"0.010"},{"v":0.01,"d":"0.010"},{"v":1.58,"d":"1.580"},{"v":0.02,"d":"0.020"},{"v":0.02,"d":"0.020"},null,"0,0024",{"v":0.3,"d":"0.300"},0.004,{"v":0.05,"d":"0.050"},{"v":0.01,"d":"0.010"},{"v":0.1,"d":"0.100"},{"v":0.1,"d":"0.100"},null,{"v":0.05,"d":"0.050"},null,{"v":0.1,"d":"0.100"},null,null,{"v":2E-3,"d":"0.002"},0.007,{"v":0.05,"d":"0.050"},{"v":0.01,"d":"0.010"},0.007,{"v":0.05,"d":"0.050"},{"v":0.1,"d":"0.100"},{"v":0.1,"d":"0.100"},{"v":0.1,"d":"0.100"},{"v":1.5E-3,"d":"0.002"},{"v":0.1,"d":"0.100"},{"v":0.03,"d":"0.030"},{"v":0.2,"d":"0.200"},{"v":0.03,"d":"0.030"},0.004,0.026,0.015,{"v":0.04,"d":"0.040"},null,0.008,0.013,0.006,{"v":0.25,"d":"0.250"},{"v":0.17,"d":"0.170"},{"v":0.0175,"d":"0.018"},0.025,null,0.015,{"v":0.03,"d":"0.030"},{"v":0.03,"d":"0.030"},null,{"v":0.04,"d":"0.040"},0.015,{"v":0.0025,"d":"0.003"},0.025,{"v":0.04,"d":"0.040"},{"v":0.02,"d":"0.020"},{"v":0.02,"d":"0.020"},null,0.006,0.021,0.015,{"v":0.03,"d":"0.030"},0.005,{"v":0.01,"d":"0.010"},{"v":0.13,"d":"0.130"},{"v":0.01,"d":"0.010"},{"v":0.03,"d":"0.030"},0.003,{"v":0.0012,"d":"0.001"},null,0.021,{"v":0.0002,"d":"0.000"},{"v":0.01,"d":"0.010"},0.013,0.003,{"v":0.1,"d":"0.100"},0.025,{"v":0.5,"d":"0.500"},{"v":0.01,"d":"0.010"},{"v":0.01,"d":"0.010"},0.017,{"v":0.37,"d":"0.370"},{"v":0.01,"d":"0.010"},{"v":1E-4,"d":"0.000"},{"v":1E-4,"d":"0.000"},0.009,0.009,{"v":0.08,"d":"0.080"},0.012,{"v":64,"d":"64.000"},{"v":2E-3,"d":"0.002"},{"v":0.8,"d":"0.800"},{"v":0.09,"d":"0.090"},{"v":0.01,"d":"0.010"},{"v":0.02,"d":"0.020"},{"v":0.03,"d":"0.030"},{"v":0.1,"d":"0.100"},{"v":0.1,"d":"0.100"},0.003,{"v":0.25,"d":"0.250"},{"v":0.01,"d":"0.010"},{"v":0.05,"d":"0.050"},{"v":1,"d":"1.000"},0.019,{"v":1E-3,"d":"0.001"},0.004,{"v":0.05,"d":"0.050"},{"v":0.01,"d":"0.010"},{"v":0.02,"d":"0.020"},0.015,{"v":0.05,"d":"0.050"},{"v":0.03,"d":"0.030"},0.003,{"v":0.01,"d":"0.010"},"0,01",{"v":0.04,"d":"0.040"},{"v":0.01,"d":"0.010"},{"v":0.0012,"d":"0.001"},{"v":0.0155,"d":"0.016"},{"v":0.5,"d":"0.500"},0.019,null,0.015,{"v":0.02,"d":"0.020"},{"v":0.04,"d":"0.040"},0.015,{"v":0.3,"d":"0.300"},0.021,{"v":0.3,"d":"0.300"},{"v":3,"d":"3.000"},0.004,0.004,{"v":0.1,"d":"0.100"},0.058,0.063,{"v":0.00065,"d":"0.001"},{"v":0.17,"d":"0.170"},{"$nulls":3},"0,125",0.015,{"v":0.05,"d":"0.050"},{"v":0.05,"d":"0.050"},{"v":0.05,"d":"0.050"},{"v":0.03,"d":"0.030"},{"v":0.15,"d":"0.150"},{"v":0.0005,"d":"0.001"},{"v":0.03,"d":"0.030"},0.015,0.025,0.025,{"v":9,"d":"9.000"},{"v":0.5,"d":"0.500"},{"v":1E-4,"d":"0.000"},{"v":0.25,"d":"0.250"},null,{"v":0.67,"d":"0.670"},{"v":0.06,"d":"0.060"},{"v":1E-3,"d":"0.001"},{"v":0.01,"d":"0.010"},null,{"v":0.01,"d":"0.010"},null,0.005,{"v":0.29,"d":"0.290"},0.015,{"v":0.1,"d":"0.100"},null,{"v":0.03,"d":"0.030"},0.015,{"v":0.06,"d":"0.060"},0.015,{"v":0.02,"d":"0.020"},{"v":0.02,"d":"0.020"},{"v":0.04,"d":"0.040"},{"v":0.01,"d":"0.010"},{"v":0.01,"d":"0.010"},{"v":0.0036,"d":"0.004"},null,0.005,0.007,null,0.013,null,{"v":0.02,"d":"0.020"},{"v":1E-4,"d":"0.000"},{"v":0.01,"d":"0.010"},null,null,{"v":0.01,"d":"0.010"},{"v":1.5E-3,"d":"0.002"},0.005,{"v":0.0025,"d":"0.003"},"0,01",{"v":0.07,"d":"0.070"},0.021,0.003,{"v":0.01,"d":"0.010"},{"v":0.0155,"d":"0.016"},0.025,{"v":0.05,"d":"0.050"},{"v":0.03,"d":"0.030"},{"v":0.67,"d":"0.670"},{"v":0.05,"d":"0.050"},{"v":0.05,"d":"0.050"},{"v":0.15,"d":"0.150"},{"v":0.05,"d":"0.050"},0.005,{"v":0.0155,"d":"0.016"},{"v":0.08,"d":"0.080"},{"v":0.37,"d":"0.370"},null,{"v":0.05,"d":"0.050"},0.035,{"v":0.03,"d":"0.030"},{"v":0.1,"d":"0.100"},{"v":0.0005,"d":"0.001"},{"v":0.01,"d":"0.010"},{"v":0.03,"d":"0.030"},{"v":0.03,"d":"0.030"},{"v":0.08,"d":"0.080"},{"v":1E-3,"d":"0.001"},{"v":0.01,"d":"0.010"},{"v":1E-3,"d":"0.001"},{"v":0.03,"d":"0.030"},{"v":0.1,"d":"0.100"},{"v":0.0025,"d":"0.003"},{"v":0.1,"d":"0.100"},0.013,null,{"v":0.22,"d":"0.220"},0.025,{"v":0.02,"d":"0.020"},0.092,null,{"v":0.2,"d":"0.200"},{"v":0.09,"d":"0.090"},null,{"v":1.5E-3,"d":"0.002"},{"v":0.03,"d":"0.030"},null,{"v":2,"d":"2.000"},{"v":0.01,"d":"0.010"},{"v":0.03,"d":"0.030"},{"v":0.01,"d":"0.010"},{"v":0.01,"d":"0.010"},{"v":0.22,"d":"0.220"},{"v":0.03,"d":"0.030"},{"v":0.17,"d":"0.170"},{"v":0.03,"d":"0.030"},{"v":0.25,"d":"0.250"},{"v":0.5,"d":"0.500"},0.008,{"v":0.01,"d":"0.010"},{"v":0.02,"d":"0.020"},{"v":0.0025,"d":"0.003"},{"v":0.1,"d":"0.100"},null,{"v":0.01,"d":"0.010"},{"v":0.0036,"d":"0.004"},{"v":1.04,"d":"1.040"},{"v":0.15,"d":"0.150"},{"v":3,"d":"3.000"},null,0.013,{"v":0.02,"d":"0.020"},0.004,0.021,{"v":0.2,"d":"0.200"},"0,125",{"v":0.05,"d":"0.050"},null,{"v":0.05,"d":"0.050"},{"v":0.3,"d":"0.300"},null,0.092,{"v":0.01,"d":"0.010"},{"v":0.03,"d":"0.030"},{"v":0.03,"d":"0.030"},0.015,{"v":0.0175,"d":"0.018"},{"v":0.01,"d":"0.010"},{"v":0.17,"d":"0.170"},0.004,{"v":0.1,"d":"0.100"},{"$nulls":3},{"v":0.01,"d":"0.010"},null,{"v":0.03,"d":"0.030"},0.097,{"v":1E-4,"d":"0.000"},{"v":0.16,"d":"0.160"},{"v":0.01,"d":"0.010"},{"v":15,"d":"15.000"},{"v":1.58,"d":"1.580"},0.025,{"v":1E-4,"d":"0.000"},{"v":0.02,"d":"0.020"},{"v":0.02,"d":"0.020"},{"v":0.02,"d":"0.020"},{"v":0.02,"d":"0.020"},{"v":0.02,"d":"0.020"},{"v":0.2,"d":"0.200"},{"v":0.2,"d":"0.200"},{"v":0.01,"d":"0.010"},{"v":0.1,"d":"0.100"},{"v":2.8E-3,"d":"0.003"},null,{"v":0.03,"d":"0.030"},0.005,{"v":0.13,"d":"0.130"},null,{"v":0.02,"d":"0.020"},{"v":0.03,"d":"0.030"},{"v":0.04,"d":"0.040"},0.025,0.008,{"v":0.05,"d":"0.050"},{"v":0.02,"d":"0.020"},null,null,{"v":0.0013,"d":"0.001"},0.013,{"v":1E-4,"d":"0.000"},{"v":0.03,"d":"0.030"},{"v":0.3,"d":"0.300"},0.015,{"v":0.0025,"d":"0.003"},{"v":0.01,"d":"0.010"},{"v":9,"d":"9.000"},{"v":0.05,"d":"0.050"},0.133,{"v":0.01,"d":"0.010"},{"v":0.0002,"d":"0.000"},{"v":2E-3,"d":"0.002"},{"v":1E-4,"d":"0.000"},{"v":0.15,"d":"0.150"},{"v":0.01,"d":"0.010"},{"v":0.05,"d":"0.050"},{"v":0.01,"d":"0.010"},{"v":0.01,"d":"0.010"},{"v":0.0036,"d":"0.004"},{"v":2.8E-3,"d":"0.003"},{"v":0.3,"d":"0.300"},{"v":0.06,"d":"0.060"},{"v":0.01,"d":"0.010"},{"v":0.0004,"d":"0.000"},{"v":0.03,"d":"0.030"},null,{"v":0.01,"d":"0.010"},{"v":2,"d":"2.000"},{"v":0.03,"d":"0.030"},{"v":0.01,"d":"0.010"},{"v":1E-4,"d":"0.000"},{"v":0.16,"d":"0.160"},{"v":0.01,"d":"0.010"},"0,01",0.063,0.013,{"v":0.1,"d":"0.100"},null,{"v":0.007500000000000001,"d":"0.008"},null,{"v":64,"d":"64.000"},{"v":0.01,"d":"0.010"},null,{"v":0.01,"d":"0.010"},{"v":1E-4,"d":"0.000"},{"v":0.06,"d":"0.060"},0.015,{"v":0.02,"d":"0.020"},{"v":0.05,"d":"0.050"},{"v":0.07,"d":"0.070"},{"v":0.04,"d":"0.040"},{"v":0.03,"d":"0.030"},{"v":0.0012,"d":"0.001"},{"v":0.02,"d":"0.020"},{"v":0.0002,"d":"0.000"},null,0.015,{"v":2,"d":"2.000"},{"v":0.04,"d":"0.040"},null,{"v":0.15,"d":"0.150"},{"v":1E-4,"d":"0.000"},null,null,{"v":0.04,"d":"0.040"},{"v":0.0175,"d":"0.018"},0.005,0.005,{"v":2.8E-3,"d":"0.003"},{"v":2.8E-3,"d":"0.003"},0.005,0.009,{"v":0.08,"d":"0.080"},{"v":1E-3,"d":"0.001"},{"v":0.0036,"d":"0.004"},0.025,{"v":0.03,"d":"0.030"},0.015,0.015,{"v":0.0013,"d":"0.001"},{"v":0.01,"d":"0.010"},{"v":0.03,"d":"0.030"},{"v":0.03,"d":"0.030"},{"v":0.02,"d":"0.020"},{"v":0.07,"d":"0.070"},{"v":0.02,"d":"0.020"},{"v":0.01,"d":"0.010"},{"v":0.01,"d":"0.010"},0.013,0.025,{"v":0.0006,"d":"0.001"},0.004,0.004,0.015,0.004,0.058,0.014,{"v":0.1,"d":"0.100"},{"v":0.01,"d":"0.010"},0.026,{"v":0.23,"d":"0.230"},{"v":0.1,"d":"0.100"},{"v":0.04,"d":"0.040"},"0,01",{"v":0.08,"d":"0.080"},{"v":0.01,"d":"0.010"},0.004,{"v":0.05,"d":"0.050"},null,0.003,{"v":0.08,"d":"0.080"},{"v":0.26,"d":"0.260"},{"v":0.01,"d":"0.010"},{"v":0.1,"d":"0.100"},0.015,{"v":0.03,"d":"0.030"},{"v":0.05,"d":"0.050"},null,{"v":0.03,"d":"0.030"},{"v":0.2,"d":"0.200"},{"v":0.05,"d":"0.050"},{"v":0.1,"d":"0.100"},{"v":0.04,"d":"0.040"},{"v":0.05,"d":"0.050"},0.014,{"v":15,"d":"15.000"},{"v":0.06,"d":"0.060"},null,0.025,null,{"v":0.3,"d":"0.300"},{"v":0.03,"d":"0.030"},0.003,{"v":0.02,"d":"0.020"},0.013,{"v":0.2,"d":"0.200"},0.012,{"v":0.02,"d":"0.020"},{"v":0.00065,"d":"0.001"},{"v":0.01,"d":"0.010"},{"v":0.03,"d":"0.030"},0.003,{"v":0.0025,"d":"0.003"},{"v":0.01,"d":"0.010"},{"v":0.01,"d":"0.010"},0.008,null,{"v":0.1,"d":"0.100"},0.014,{"v":0.08,"d":"0.080"},null,{"v":0.2,"d":"0.200"},{"v":10,"d":"10.000"},null,{"v":0.22,"d":"0.220"},0.015,0.015,0.009,{"v":0.01,"d":"0.010"},{"v":1.04,"d":"1.040"},{"v":0.5,"d":"0.500"}]
["Índice para Toxicidade do produto (>2,5 - Alerta alto risco)",null,{"v":1.7494703688911244,"d":"1.75"},{"v":2.799990182467421,"d":"2.80"},{"v":4.522878745280337,"d":"4.52"},{"v":0.9407023173881188,"d":"0.94"},{"v":1.2407430300610562,"d":"1.24"},{"v":3.40135972093719,"d":"3.40"},{"v":3.40135972093719,"d":"3.40"},{"v":3.40135972093719,"d":"3.40"},{"v":1.8010299956639813,"d":"1.80"},{"v":3.4436974992327123,"d":"3.44"},null,null,{"$f":"IF(O7>0,(((4-LOG10(O7))+(-LOG(O8)))/2),\"\")","v":{"v":4.107335082494616,"d":"4.11"}},{"v":3.8723637474483468,"d":"3.87"},{"v":1.7440583195105628,"d":"1.74"},{"$f":"IF(R7>0,(((4-LOG10(R7))+(-LOG(R8)))/2),\"\")","v":{"v":1.3106194123418133,"d":"1.31"}},{"v":3.0122840957453683,"d":"3.01"},{"v":2.659379381312206,"d":"2.66"},null,{"v":2.513436073200151,"d":"2.51"},{"v":2.8163220394869906,"d":"2.82"},{"$f":"IF(X7>0,(((4-LOG10(X7))+(-LOG(X8)))/2),\"\")","v":{"v":1.6505149978319906,"d":"1.65"}},{"v":2.8723637474483468,"d":"2.87"},{"v":2.8723637474483468,"d":"2.87"},{"$f":"IF(AA7>0,(((4-LOG10(AA7))+(-LOG(AA8)))/2),\"\")","v":{"v":3.878480975656853,"d":"3.88"}},{"v":4.284318117920506,"d":"4.28"},{"$f":"IF(AC7>0,(((4-LOG10(AC7))+(-LOG(AC8)))/2),\"\")","v":{"v":0.9568200846626258,"d":"0.96"}},null,null,{"v":1.3610808334989761,"d":"1.36"},{"v":2.210108201691595,"d":"2.21"},{"v":3.0824719491399417,"d":"3.08"},{"v":3.926935982160881,"d":"3.93"},{"$f":"IF(AJ7>0,(((4-LOG10(AJ7))+(-LOG(AJ8)))/2),\"\")","v":{"v":2.093543321678572,"d":"2.09"}},{"v":2.56246936830415,"d":"2.56"},{"v":2.56246936830415,"d":"2.56"},null,{"v":1.7494703688911244,"d":"1.75"},{"$f":"IF(AO7>0,(((4-LOG10(AO7))+(-LOG(AO8)))/2),\"\")","v":{"v":1.292513326014591,"d":"1.29"}},{"v":2.513436073200151,"d":"2.51"},{"$f":"IF(AQ7>0,(((4-LOG10(AQ7))+(-LOG(AQ8)))/2),\"\")","v":{"v":3.3268235127746806,"d":"3.33"}},{"v":4.522878745280337,"d":"4.52"},{"v":0.47969882994296337,"d":"0.48"},{"v":3.383501944803923,"d":"3.38"},{"$f":"IF(AU7>0,(((4-LOG10(AU7))+(-LOG(AU8)))/2),\"\")","v":{"v":3.0417730257250373,"d":"3.04"}},{"v":4.093543321678572,"d":"4.09"},{"$f":"IF(AW7>0,(((4-LOG10(AW7))+(-LOG(AW8)))/2),\"\")","v":{"v":3.240743030061056,"d":"3.24"}},{"v":2.210108201691595,"d":"2.21"},null,{"$f":"IF(AZ7>0,(((4-LOG10(AZ7))+(-LOG(AZ8)))/2),\"\")","v":{"v":1.8428030213890185,"d":"1.84"}},{"$f":"IF(BA7>0,(((4-LOG10(BA7))+(-LOG(BA8)))/2),\"\")","v":{"v":2.7044676964867502,"d":"2.70"}},{"$f":"IF(BB7>0,(((4-LOG10(BB7))+(-LOG(BB8)))/2),\"\")","v":{"v":1.4707869877714972,"d":"1.47"}},{"v":2.210108201691595,"d":"2.21"},{"$f":"IF(BD7>0,(((4-LOG10(BD7))+(-LOG(BD8)))/2),\"\")","v":{"v":1.2416133608492068,"d":"1.24"}},{"$f":"IF(BE7>0,(((4-LOG10(BE7))+(-LOG(BE8)))/2),\"\")","v":{"v":1.2416133608492068,"d":"1.24"}},null,{"$f":"IF(BG7>0,(((4-LOG10(BG7))+(-LOG(BG8)))/2),\"\")","v":{"v":3.210108201691595,"d":"3.21"}},{"v":2.5228787452803374,"d":"2.52"},{"v":2.5228787452803374,"d":"2.52"},null,{"v":2.5228787452803374,"d":"2.52"},{"v":1.8315700895415952,"d":"1.83"},{"$f":"IF(BM7>0,(((4-LOG10(BM7))+(-LOG(BM8)))/2),\"\")","v":{"v":2.56246936830415,"d":"2.56"}},{"v":2.659379381312206,"d":"2.66"},{"v":1.6076913536835624,"d":"1.61"},{"v":3.40135972093719,"d":"3.40"},{"$f":"IF(BQ7>0,(((4-LOG10(BQ7))+(-LOG(BQ8)))/2),\"\")","v":{"v":3.5352905371428536,"d":"3.54"}},null,null,{"$f":"IF(BT7>0,(((4-LOG10(BT7))+(-LOG(BT8)))/2),\"\")","v":{"v":1.4062396395817685,"d":"1.41"}},{"v":2.513436073200151,"d":"2.51"},{"v":2.513436073200151,"d":"2.51"},{"v":1.5,"d":"1.50"},{"$f":"IF(BX7>0,(((4-LOG10(BX7))+(-LOG(BX8)))/2),\"\")","v":{"v":3.2614393726401687,"d":"3.26"}},{"v":1.9863251961126216,"d":"1.99"},{"v":3.40135972093719,"d":"3.40"},{"v":3.495699914119041,"d":"3.50"},{"$f":"IF(CB7>0,(((4-LOG10(CB7))+(-LOG(CB8)))/2),\"\")","v":{"v":2.865010161677338,"d":"2.87"}},{"$f":"IF(CC7>0,(((4-LOG10(CC7))+(-LOG(CC8)))/2),\"\")","v":{"v":2.4119543704721593,"d":"2.41"}},{"v":3.210108201691595,"d":"3.21"},{"v":2.4498147274412183,"d":"2.45"},{"v":3.710108201691595,"d":"3.71"},{"v":3.710108201691595,"d":"3.71"},{"v":1.5,"d":"1.50"},{"$f":"IF(CI7>0,(((4-LOG10(CI7))+(-LOG(CI8)))/2),\"\")","v":{"v":2,"d":"2.00"}},null,{"$f":"IF(CK7>0,(((4-LOG10(CK7))+(-LOG(CK8)))/2),\"\")","v":{"v":3.878480975656853,"d":"3.88"}},{"v":5.34518491628705,"d":"5.35"},null,{"$f":"IF(CN7>0,(((4-LOG10(CN7))+(-LOG(CN8)))/2),\"\")","v":{"v":4.70446769648675,"d":"4.70"}},{"$f":"IF(CO7>0,(((4-LOG10(CO7))+(-LOG(CO8)))/2),\"\")","v":{"v":4.70446769648675,"d":"4.70"}},null,null,{"$f":"IF(CR7>0,(((4-LOG10(CR7))+(-LOG(CR8)))/2),\"\")","v":{"v":2.011138197355576,"d":"2.01"}},{"$f":"IF(CS7>0,(((4-LOG10(CS7))+(-LOG(CS8)))/2),\"\")","v":{"v":4.70446769648675,"d":"4.70"}},null,{"v":2.784318117920506,"d":"2.78"},null,{"v":4.080575454631372,"d":"4.08"},{"v":3.013898580810468,"d":"3.01"},{"v":2.483288122256525,"d":"2.48"},{"v":2.483288122256525,"d":"2.48"},{"v":3.40135972093719,"d":"3.40"},null,null,{"$f":"IF(DD7>0,(((4-LOG10(DD7))+(-LOG(DD8)))/2),\"\")","v":{"v":2.884775539310863,"d":"2.88"}},{"v":5.34518491628705,"d":"5.35"},{"$f":"IF(DF7>0,(((4-LOG10(DF7))+(-LOG(DF8)))/2),\"\")","v":{"v":3.878480975656853,"d":"3.88"}},{"$f":"IF(DG7>0,(((4-LOG10(DG7))+(-LOG(DG8)))/2),\"\")","v":{"v":3.240743030061056,"d":"3.24"}},{"v":1.6076913536835624,"d":"1.61"},{"$f":"IF(DI7>0,(((4-LOG10(DI7))+(-LOG(DI8)))/2),\"\")","v":{"v":4.1419983281826,"d":"4.14"}},{"v":1.9604093769761877,"d":"1.96"},{"$f":"IF(DK7>0,(((4-LOG10(DK7))+(-LOG(DK8)))/2),\"\")","v":{"v":2.0226376045104684,"d":"2.02"}},{"$f":"IF(DL7>0,(((4-LOG10(DL7))+(-LOG(DL8)))/2),\"\")","v":{"v":1.7891980365650846,"d":"1.79"}},{"v":2.483288122256525,"d":"2.48"},{"v":2.865243527891042,"d":"2.87"},{"v":2.865243527891042,"d":"2.87"},{"v":2.926935982160881,"d":"2.93"},{"$f":"IF(DQ7>0,(((4-LOG10(DQ7))+(-LOG(DQ8)))/2),\"\")","v":{"v":4.70446769648675,"d":"4.70"}},{"v":2.854982694318741,"d":"2.85"},{"v":3.210108201691595,"d":"3.21"},{"v":3.210108201691595,"d":"3.21"},{"$f":"IF(DU7>0,(((4-LOG10(DU7))+(-LOG(DU8)))/2),\"\")","v":{"v":1.8010299956639813,"d":"1.80"}},{"v":3.210108201691595,"d":"3.21"},{"$f":"IF(DW7>0,(((4-LOG10(DW7))+(-LOG(DW8)))/2),\"\")","v":{"v":4.06246936830415,"d":"4.06"}},{"$f":"IF(DX7>0,(((4-LOG10(DX7))+(-LOG(DX8)))/2),\"\")","v":{"v":2.8675910884952316,"d":"2.87"}},{"v":2.659379381312206,"d":"2.66"},null,null,{"v":4.154901959985743,"d":"4.15"},null,{"v":4.4430283238465815,"d":"4.44"},{"v":3.40135972093719,"d":"3.40"},{"v":2.240743030061056,"d":"2.24"},{"v":2.8268235127746806,"d":"2.83"},{"v":1.6989700043360187,"d":"1.70"},{"v":2.0277586639249154,"d":"2.03"},{"v":3.6220625721637543,"d":"3.62"},{"v":3.765826334793921,"d":"3.77"},{"v":1.8315700895415952,"d":"1.83"},null,{"$f":"IF(EN7>0,(((4-LOG10(EN7))+(-LOG(EN8)))/2),\"\")","v":{"v":1.7614393726401687,"d":"1.76"}},{"v":2.4498147274412183,"d":"2.45"},{"$f":"IF(EP7>0,(((4-LOG10(EP7))+(-LOG(EP8)))/2),\"\")","v":{"v":2.5106815258077626,"d":"2.51"}},null,null,{"$f":"IF(ES7>0,(((4-LOG10(ES7))+(-LOG(ES8)))/2),\"\")","v":{"v":2.1705175786677824,"d":"2.17"}},{"$f":"IF(ET7>0,(((4-LOG10(ET7))+(-LOG(ET8)))/2),\"\")","v":{"v":2.485105264584072,"d":"2.49"}},{"$f":"IF(EU7>0,(((4-LOG10(EU7))+(-LOG(EU8)))/2),\"\")","v":{"v":2.2118293248971037,"d":"2.21"}},{"v":3.926935982160881,"d":"3.93"},{"v":2.210108201691595,"d":"2.21"},{"$f":"IF(EX7>0,(((4-LOG10(EX7))+(-LOG(EX8)))/2),\"\")","v":{"v":2.5704308513527345,"d":"2.57"}},{"v":1.610924374808178,"d":"1.61"},{"v":2.3873453591370684,"d":"2.39"},{"v":1.6989700043360187,"d":"1.70"},{"$f":"IF(FB7>0,(((4-LOG10(FB7))+(-LOG(FB8)))/2),\"\")","v":{"v":3.600329725273209,"d":"3.60"}},{"$f":"IF(FC7>0,(((4-LOG10(FC7))+(-LOG(FC8)))/2),\"\")","v":{"v":1.8588929334688322,"d":"1.86"}},null,{"v":1.3610808334989761,"d":"1.36"},{"$f":"IF(FF7>0,(((4-LOG10(FF7))+(-LOG(FF8)))/2),\"\")","v":{"v":3.989405350465031,"d":"3.99"}},null,{"$f":"IF(FH7>0,(((4-LOG10(FH7))+(-LOG(FH8)))/2),\"\")","v":{"v":1.2709834037517471,"d":"1.27"}},{"v":2.3873453591370684,"d":"2.39"},{"v":2.3873453591370684,"d":"2.39"},{"v":2.3873453591370684,"d":"2.39"},{"v":3.6220625721637543,"d":"3.62"},{"v":4.4430283238465815,"d":"4.44"},{"$f":"IF(FN7>0,(((4-LOG10(FN7))+(-LOG(FN8)))/2),\"\")","v":{"v":1.4976802733851249,"d":"1.50"}},{"v":3.8723637474483468,"d":"3.87"},{"v":3.926935982160881,"d":"3.93"},{"v":3.629818655252878,"d":"3.63"},{"$f":"IF(FR7>0,(((4-LOG10(FR7))+(-LOG(FR8)))/2),\"\")","v":{"v":2.884775539310863,"d":"2.88"}},{"v":1.448783147159332,"d":"1.45"},{"v":3.2967299097830223,"d":"3.30"},{"v":3,"d":"3.00"},{"v":2.784318117920506,"d":"2.78"},{"$f":"IF(FW7>0,(((4-LOG10(FW7))+(-LOG(FW8)))/2),\"\")","v":{"v":4.809894379144197,"d":"4.81"}},{"v":2.5228787452803374,"d":"2.52"},{"v":2.439713034397075,"d":"2.44"},{"v":1.448783147159332,"d":"1.45"},{"v":1.7440583195105628,"d":"1.74"},{"v":3.6220625721637543,"d":"3.62"},{"v":2.1736351519653763,"d":"2.17"},{"$f":"IF(GD7>0,(((4-LOG10(GD7))+(-LOG(GD8)))/2),\"\")","v":{"v":3.309894379144197,"d":"3.31"}},{"v":3.6220625721637543,"d":"3.62"},{"v":3.6220625721637543,"d":"3.62"},{"v":3.6220625721637543,"d":"3.62"},{"v":4.080575454631372,"d":"4.08"},{"$f":"IF(GI7>0,(((4-LOG10(GI7))+(-LOG(GI8)))/2),\"\")","v":{"v":3.2614393726401687,"d":"3.26"}},{"v":4.792513326014591,"d":"4.79"},{"$f":"IF(GK7>0,(((4-LOG10(GK7))+(-LOG(GK8)))/2),\"\")","v":{"v":3.5774509799928715,"d":"3.58"}},{"v":4.792513326014591,"d":"4.79"},{"v":1.3610808334989761,"d":"1.36"},{"v":3.210108201691595,"d":"3.21"},{"v":3.210108201691595,"d":"3.21"},null,{"v":2.396856977793784,"d":"2.40"},{"$f":"IF(GR7>0,(((4-LOG10(GR7))+(-LOG(GR8)))/2),\"\")","v":{"v":1.2639510358153232,"d":"1.26"}},{"v":2.5595932038596043,"d":"2.56"},{"v":1.6298186552528782,"d":"1.63"},{"v":2.9793036574208873,"d":"2.98"},{"v":2.9430283238465815,"d":"2.94"},{"v":2.9430283238465815,"d":"2.94"},null,{"$f":"IF(GY7>0,(((4-LOG10(GY7))+(-LOG(GY8)))/2),\"\")","v":{"v":2.257850080326607,"d":"2.26"}},null,{"v":2.9430283238465815,"d":"2.94"},null,null,{"$f":"IF(HD7>0,(((4-LOG10(HD7))+(-LOG(HD8)))/2),\"\")","v":{"v":2.6883753548010496,"d":"2.69"}},{"v":2.664413578642458,"d":"2.66"},{"v":3.2158991379665025,"d":"3.22"},{"$f":"IF(HG7>0,(((4-LOG10(HG7))+(-LOG(HG8)))/2),\"\")","v":{"v":3.5774509799928715,"d":"3.58"}},{"v":2.664413578642458,"d":"2.66"},{"v":1.7494703688911244,"d":"1.75"},{"v":1.5,"d":"1.50"},{"$f":"IF(HK7>0,(((4-LOG10(HK7))+(-LOG(HK8)))/2),\"\")","v":{"v":2.6220625721637543,"d":"2.62"}},{"$f":"IF(HL7>0,(((4-LOG10(HL7))+(-LOG(HL8)))/2),\"\")","v":{"v":2.6220625721637543,"d":"2.62"}},{"v":3.9119543704721593,"d":"3.91"},{"v":2.455047444280301,"d":"2.46"},{"v":2.439713034397075,"d":"2.44"},{"v":2.513436073200151,"d":"2.51"},{"v":4.045757490560675,"d":"4.05"},{"v":2.882235776546225,"d":"2.88"},{"v":1.7440583195105628,"d":"1.74"},{"$f":"IF(HT7>0,(((4-LOG10(HT7))+(-LOG(HT8)))/2),\"\")","v":{"v":3.6399203482970215,"d":"3.64"}},{"$f":"IF(HU7>0,(((4-LOG10(HU7))+(-LOG(HU8)))/2),\"\")","v":{"v":1.2673085742757908,"d":"1.27"}},null,{"v":2.799990182467421,"d":"2.80"},{"$f":"IF(HX7>0,(((4-LOG10(HX7))+(-LOG(HX8)))/2),\"\")","v":{"v":2.2118293248971037,"d":"2.21"}},{"$f":"IF(HY7>0,(((4-LOG10(HY7))+(-LOG(HY8)))/2),\"\")","v":{"v":4.090228032229065,"d":"4.09"}},{"v":1.3010299956639813,"d":"1.30"},{"$f":"IF(IA7>0,(((4-LOG10(IA7))+(-LOG(IA8)))/2),\"\")","v":{"v":1.8729435802119663,"d":"1.87"}},{"v":4.878480975656853,"d":"4.88"},{"$f":"IF(IC7>0,(((4-LOG10(IC7))+(-LOG(IC8)))/2),\"\")","v":{"v":2.586153855662777,"d":"2.59"}},null,{"$f":"IF(IE7>0,(((4-LOG10(IE7))+(-LOG(IE8)))/2),\"\")","v":{"v":3.6399203482970215,"d":"3.64"}},{"$f":"IF(IF7>0,(((4-LOG10(IF7))+(-LOG(IF8)))/2),\"\")","v":{"v":3.659379381312206,"d":"3.66"}},{"v":4.045757490560675,"d":"4.05"},null,{"$f":"IF(II7>0,(((4-LOG10(II7))+(-LOG(II8)))/2),\"\")","v":{"v":1.7474250108400469,"d":"1.75"}},{"$f":"IF(IJ7>0,(((4-LOG10(IJ7))+(-LOG(IJ8)))/2),\"\")","v":{"v":2.7218487496163566,"d":"2.72"}},{"v":3.40135972093719,"d":"3.40"},{"$f":"IF(IL7>0,(((4-LOG10(IL7))+(-LOG(IL8)))/2),\"\")","v":{"v":2.586153855662777,"d":"2.59"}},{"$f":"IF(IM7>0,(((4-LOG10(IM7))+(-LOG(IM8)))/2),\"\")","v":{"v":1.6968093174446974,"d":"1.70"}},{"v":2.5228787452803374,"d":"2.52"},{"v":2.5228787452803374,"d":"2.52"},null,{"$f":"IF(IQ7>0,(((4-LOG10(IQ7))+(-LOG(IQ8)))/2),\"\")","v":{"v":4.090228032229065,"d":"4.09"}},{"v":1.4132611782735025,"d":"1.41"},{"v":4.284318117920506,"d":"4.28"},{"v":2.8268235127746806,"d":"2.83"},{"$f":"IF(IU7>0,(((4-LOG10(IU7))+(-LOG(IU8)))/2),\"\")","v":{"v":3.093543321678572,"d":"3.09"}},{"v":3.3606231995235856,"d":"3.36"},{"$f":"IF(IW7>0,(((4-LOG10(IW7))+(-LOG(IW8)))/2),\"\")","v":{"v":2.085026652029182,"d":"2.09"}},{"$f":"IF(IX7>0,(((4-LOG10(IX7))+(-LOG(IX8)))/2),\"\")","v":{"v":4.489405350465031,"d":"4.49"}},{"v":4.080575454631372,"d":"4.08"},{"$f":"IF(IZ7>0,(((4-LOG10(IZ7))+(-LOG(IZ8)))/2),\"\")","v":{"v":3.080575454631372,"d":"3.08"}},{"$f":"IF(JA7>0,(((4-LOG10(JA7))+(-LOG(JA8)))/2),\"\")","v":{"v":5.18837535480105,"d":"5.19"}},null,{"v":1.4132611782735025,"d":"1.41"},{"v":4.152259161754902,"d":"4.15"},{"v":2.9793036574208873,"d":"2.98"},{"v":2.2718169834354787,"d":"2.27"},{"v":2.1462149119510316,"d":"2.15"},{"v":3.3287886595888967,"d":"3.33"},{"$f":"IF(JI7>0,(((4-LOG10(JI7))+(-LOG(JI8)))/2),\"\")","v":{"v":1.8010299956639813,"d":"1.80"}},{"$f":"IF(JJ7>0,(((4-LOG10(JJ7))+(-LOG(JJ8)))/2),\"\")","v":{"v":1.1505149978319906,"d":"1.15"}},{"v":2.92539044367231,"d":"2.93"},{"v":3.629818655252878,"d":"3.63"},{"v":3.495699914119041,"d":"3.50"},{"$f":"IF(JN7>0,(((4-LOG10(JN7))+(-LOG(JN8)))/2),\"\")","v":{"v":2.535035219957706,"d":"2.54"}},{"v":4.154901959985743,"d":"4.15"},{"v":2.7614393726401687,"d":"2.76"},{"v":3.9793036574208873,"d":"3.98"},{"v":2.842014827271541,"d":"2.84"},{"v":2.842014827271541,"d":"2.84"},{"$f":"IF(JT7>0,(((4-LOG10(JT7))+(-LOG(JT8)))/2),\"\")","v":{"v":2.7703037561203843,"d":"2.77"}},{"$f":"IF(JU7>0,(((4-LOG10(JU7))+(-LOG(JU8)))/2),\"\")","v":{"v":2.96479633912994,"d":"2.96"}},{"v":0.17281545451235725,"d":"0.17"},{"$f":"IF(JW7>0,(((4-LOG10(JW7))+(-LOG(JW8)))/2),\"\")","v":{"v":3.210108201691595,"d":"3.21"}},{"$f":"IF(JX7>0,(((4-LOG10(JX7))+(-LOG(JX8)))/2),\"\")","v":{"v":1.4707869877714972,"d":"1.47"}},{"$f":"IF(JY7>0,(((4-LOG10(JY7))+(-LOG(JY8)))/2),\"\")","v":{"v":2.1566818653688533,"d":"2.16"}},{"v":2.240743030061056,"d":"2.24"},{"v":1.4808886808156407,"d":"1.48"},{"v":2.439713034397075,"d":"2.44"},{"v":2.8163220394869906,"d":"2.82"},{"v":2.8163220394869906,"d":"2.82"},{"v":2.1462149119510316,"d":"2.15"},{"v":1.3010299956639813,"d":"1.30"},{"v":2.4498147274412183,"d":"2.45"},{"$f":"IF(KH7>0,(((4-LOG10(KH7))+(-LOG(KH8)))/2),\"\")","v":{"v":2.257850080326607,"d":"2.26"}},{"$f":"IF(KI7>0,(((4-LOG10(KI7))+(-LOG(KI8)))/2),\"\")","v":{"v":0.9568200846626258,"d":"0.96"}},{"$f":"IF(KJ7>0,(((4-LOG10(KJ7))+(-LOG(KJ8)))/2),\"\")","v":{"v":3.867237332390463,"d":"3.87"}},{"$f":"IF(KK7>0,(((4-LOG10(KK7))+(-LOG(KK8)))/2),\"\")","v":{"v":3.809894379144197,"d":"3.81"}},{"$f":"IF(KL7>0,(((4-LOG10(KL7))+(-LOG(KL8)))/2),\"\")","v":{"v":2.1705175786677824,"d":"2.17"}},{"v":2.5192894529667758,"d":"2.52"},{"v":3.629818655252878,"d":"3.63"},{"v":3.210108201691595,"d":"3.21"},{"v":3.6220625721637543,"d":"3.62"},{"v":3.926935982160881,"d":"3.93"},{"v":2.439713034397075,"d":"2.44"},{"v":2.1462149119510316,"d":"2.15"},{"v":2.92539044367231,"d":"2.93"},{"v":2.926935982160881,"d":"2.93"},{"$f":"IF(KV7>0,(((4-LOG10(KV7))+(-LOG(KV8)))/2),\"\")","v":{"v":2.4119543704721593,"d":"2.41"}},{"v":3,"d":"3.00"},{"$f":"IF(KX7>0,(((4-LOG10(KX7))+(-LOG(KX8)))/2),\"\")","v":{"v":5.18837535480105,"d":"5.19"}},{"v":2.1736351519653763,"d":"2.17"},{"$f":"IF(KZ7>0,(((4-LOG10(KZ7))+(-LOG(KZ8)))/2),\"\")","v":{"v":1.1505149978319906,"d":"1.15"}},{"$f":"IF(LA7>0,(((4-LOG10(LA7))+(-LOG(LA8)))/2),\"\")","v":{"v":3.867237332390463,"d":"3.87"}},null,{"v":2.56246936830415,"d":"2.56"},{"v":2.5228787452803374,"d":"2.52"},{"$f":"IF(LE7>0,(((4-LOG10(LE7))+(-LOG(LE8)))/2),\"\")","v":{"v":1.7474250108400469,"d":"1.75"}},{"v":3.6220625721637543,"d":"3.62"},{"v":1.4715475743317636,"d":"1.47"},{"v":1.4132611782735025,"d":"1.41"},{"v":1.4715475743317636,"d":"1.47"},{"v":2.06246936830415,"d":"2.06"},{"v":2.5595932038596043,"d":"2.56"},{"v":3.3957793217807164,"d":"3.40"},{"$f":"IF(LM7>0,(((4-LOG10(LM7))+(-LOG(LM8)))/2),\"\")","v":{"v":1.4062396395817685,"d":"1.41"}},{"$f":"IF(LN7>0,(((4-LOG10(LN7))+(-LOG(LN8)))/2),\"\")","v":{"v":2.5563601827349887,"d":"2.56"}},{"$f":"IF(LO7>0,(((4-LOG10(LO7))+(-LOG(LO8)))/2),\"\")","v":{"v":1.5643887216201464,"d":"1.56"}},{"$f":"IF(LP7>0,(((4-LOG10(LP7))+(-LOG(LP8)))/2),\"\")","v":{"v":4.121301985603488,"d":"4.12"}},{"$f":"IF(LQ7>0,(((4-LOG10(LQ7))+(-LOG(LQ8)))/2),\"\")","v":{"v":2.5106815258077626,"d":"2.51"}},{"$nulls":3},{"v":2.8054169578177337,"d":"2.81"},{"v":2.56246936830415,"d":"2.56"},{"v":3.926935982160881,"d":"3.93"},{"v":1.3979400086720377,"d":"1.40"},{"v":1.3979400086720377,"d":"1.40"},{"$f":"IF(LZ7>0,(((4-LOG10(LZ7))+(-LOG(LZ8)))/2),\"\")","v":{"v":2.5088643834802156,"d":"2.51"}},{"v":3.2967299097830223,"d":"3.30"},{"v":4.301029995663981,"d":"4.30"},{"v":1.7614393726401687,"d":"1.76"},{"v":3.6220625721637543,"d":"3.62"},{"v":2.7158991379665025,"d":"2.72"},{"v":2.7158991379665025,"d":"2.72"},{"v":0.47969882994296337,"d":"0.48"},{"v":1.1505149978319906,"d":"1.15"},{"v":3,"d":"3.00"},{"v":1.3010299956639813,"d":"1.30"},null,{"v":3.12225313579244,"d":"3.12"},{"v":1.448783147159332,"d":"1.45"},{"$f":"IF(MN7>0,(((4-LOG10(MN7))+(-LOG(MN8)))/2),\"\")","v":{"v":3.809894379144197,"d":"3.81"}},{"v":2.240743030061056,"d":"2.24"},null,{"v":4.093543321678572,"d":"4.09"},null,{"$f":"IF(MS7>0,(((4-LOG10(MS7))+(-LOG(MS8)))/2),\"\")","v":{"v":3.5352905371428536,"d":"3.54"}},{"$f":"IF(MT7>0,(((4-LOG10(MT7))+(-LOG(MT8)))/2),\"\")","v":{"v":1.2709834037517471,"d":"1.27"}},{"$f":"IF(MU7>0,(((4-LOG10(MU7))+(-LOG(MU8)))/2),\"\")","v":{"v":4.70446769648675,"d":"4.70"}},{"v":2.1883753548010496,"d":"2.19"},null,{"v":1.7614393726401687,"d":"1.76"},{"$f":"IF(MY7>0,(((4-LOG10(MY7))+(-LOG(MY8)))/2),\"\")","v":{"v":2.8239087409443187,"d":"2.82"}},{"v":1.8315700895415952,"d":"1.83"},{"v":3.6220625721637543,"d":"3.62"},{"$f":"IF(NB7>0,(((4-LOG10(NB7))+(-LOG(NB8)))/2),\"\")","v":{"v":2.671472073571448,"d":"2.67"}},2.73,{"v":2.4914833303506096,"d":"2.49"},{"v":4.792513326014591,"d":"4.79"},{"v":4.792513326014591,"d":"4.79"},{"v":3.4436974992327123,"d":"3.44"},null,{"v":4.989405350465031,"d":"4.99"},{"v":2.664413578642458,"d":"2.66"},null,{"v":2.2718169834354787,"d":"2.27"},null,{"$f":"IF(NN7>0,(((4-LOG10(NN7))+(-LOG(NN8)))/2),\"\")","v":{"v":2.671472073571448,"d":"2.67"}},{"v":3.013898580810468,"d":"3.01"},{"v":4.4430283238465815,"d":"4.44"},null,null,{"v":2.8723637474483468,"d":"2.87"},{"v":3.9119543704721593,"d":"3.91"},{"v":4.989405350465031,"d":"4.99"},{"v":3.40135972093719,"d":"3.40"},{"v":2.926935982160881,"d":"2.93"},{"v":1.6076913536835624,"d":"1.61"},{"v":1.4132611782735025,"d":"1.41"},{"v":3.0122840957453683,"d":"3.01"},{"v":4.4430283238465815,"d":"4.44"},{"v":2.1736351519653763,"d":"2.17"},{"v":2.7158991379665025,"d":"2.72"},{"v":1.3979400086720377,"d":"1.40"},{"v":3.6338031200885155,"d":"3.63"},{"v":3.12225313579244,"d":"3.12"},{"v":3.2158991379665025,"d":"3.22"},{"v":3.2158991379665025,"d":"3.22"},{"$f":"IF(OI7>0,(((4-LOG10(OI7))+(-LOG(OI8)))/2),\"\")","v":{"v":2.1807553715226815,"d":"2.18"}},{"v":3.2158991379665025,"d":"3.22"},{"$f":"IF(OK7>0,(((4-LOG10(OK7))+(-LOG(OK8)))/2),\"\")","v":{"v":4.06246936830415,"d":"4.06"}},{"v":2.1736351519653763,"d":"2.17"},{"v":1.5484550065040281,"d":"1.55"},{"$f":"IF(ON7>0,(((4-LOG10(ON7))+(-LOG(ON8)))/2),\"\")","v":{"v":2.535035219957706,"d":"2.54"}},null,{"$f":"IF(OP7>0,(((4-LOG10(OP7))+(-LOG(OP8)))/2),\"\")","v":{"v":1.6505149978319906,"d":"1.65"}},{"$f":"IF(OQ7>0,(((4-LOG10(OQ7))+(-LOG(OQ8)))/2),\"\")","v":{"v":2.865010161677338,"d":"2.87"}},{"v":4.080575454631372,"d":"4.08"},{"v":2.865243527891042,"d":"2.87"},{"v":4.301029995663981,"d":"4.30"},{"v":1.9604093769761877,"d":"1.96"},{"v":3.0824719491399417,"d":"3.08"},{"v":3.0824719491399417,"d":"3.08"},{"v":1.5484550065040281,"d":"1.55"},{"$f":"IF(OY7>0,(((4-LOG10(OY7))+(-LOG(OY8)))/2),\"\")","v":{"v":3.878480975656853,"d":"3.88"}},{"$f":"IF(OZ7>0,(((4-LOG10(OZ7))+(-LOG(OZ8)))/2),\"\")","v":{"v":2.8388903526330402,"d":"2.84"}},{"$f":"IF(PA7>0,(((4-LOG10(PA7))+(-LOG(PA8)))/2),\"\")","v":{"v":4.5,"d":"4.50"}},{"$f":"IF(PB7>0,(((4-LOG10(PB7))+(-LOG(PB8)))/2),\"\")","v":{"v":2.9982697339452464,"d":"3.00"}},{"v":2.455047444280301,"d":"2.46"},{"v":3.40135972093719,"d":"3.40"},{"v":2.1883753548010496,"d":"2.19"},{"v":2.006658910110247,"d":"2.01"},null,{"v":1.2407430300610562,"d":"1.24"},{"v":2.6505149978319906,"d":"2.65"},{"$f":"IF(PJ7>0,(((4-LOG10(PJ7))+(-LOG(PJ8)))/2),\"\")","v":{"v":2.610924374808178,"d":"2.61"}},{"$f":"IF(PK7>0,(((4-LOG10(PK7))+(-LOG(PK8)))/2),\"\")","v":{"v":2.890469833775569,"d":"2.89"}},null,{"$f":"IF(PM7>0,(((4-LOG10(PM7))+(-LOG(PM8)))/2),\"\")","v":{"v":2.610924374808178,"d":"2.61"}},{"$f":"IF(PN7>0,(((4-LOG10(PN7))+(-LOG(PN8)))/2),\"\")","v":{"v":2.1566818653688533,"d":"2.16"}},null,{"v":3.9119543704721593,"d":"3.91"},{"v":2.439713034397075,"d":"2.44"},null,{"v":0.9407023173881188,"d":"0.94"},{"v":4.093543321678572,"d":"4.09"},{"v":3.6338031200885155,"d":"3.63"},{"v":3,"d":"3.00"},{"v":4.4430283238465815,"d":"4.44"},{"v":1.2407430300610562,"d":"1.24"},{"$f":"IF(PY7>0,(((4-LOG10(PY7))+(-LOG(PY8)))/2),\"\")","v":{"v":3.659379381312206,"d":"3.66"}},{"$f":"IF(PZ7>0,(((4-LOG10(PZ7))+(-LOG(PZ8)))/2),\"\")","v":{"v":2.485105264584072,"d":"2.49"}},{"$f":"IF(QA7>0,(((4-LOG10(QA7))+(-LOG(QA8)))/2),\"\")","v":{"v":3.4447051448503756,"d":"3.44"}},{"v":1.3010299956639813,"d":"1.30"},{"v":1.1505149978319906,"d":"1.15"},{"v":2.799990182467421,"d":"2.80"},{"$f":"IF(QE7>0,(((4-LOG10(QE7))+(-LOG(QE8)))/2),\"\")","v":{"v":2.8388903526330402,"d":"2.84"}},{"v":1.4808886808156407,"d":"1.48"},{"v":3.40135972093719,"d":"3.40"},{"v":2.865243527891042,"d":"2.87"},null,{"$f":"IF(QJ7>0,(((4-LOG10(QJ7))+(-LOG(QJ8)))/2),\"\")","v":{"v":4.489405350465031,"d":"4.49"}},{"$f":"IF(QK7>0,(((4-LOG10(QK7))+(-LOG(QK8)))/2),\"\")","v":{"v":3.182258126592544,"d":"3.18"}},{"$f":"IF(QL7>0,(((4-LOG10(QL7))+(-LOG(QL8)))/2),\"\")","v":{"v":2.072058784981982,"d":"2.07"}},{"$f":"IF(QM7>0,(((4-LOG10(QM7))+(-LOG(QM8)))/2),\"\")","v":{"v":1.5912173152201095,"d":"1.59"}},{"v":2.06246936830415,"d":"2.06"},null,{"$f":"IF(QP7>0,(((4-LOG10(QP7))+(-LOG(QP8)))/2),\"\")","v":{"v":3.262164405837785,"d":"3.26"}},{"v":2.3873453591370684,"d":"2.39"},{"v":2.5595932038596043,"d":"2.56"},{"v":1.4132611782735025,"d":"1.41"},{"$f":"IF(QT7>0,(((4-LOG10(QT7))+(-LOG(QT8)))/2),\"\")","v":{"v":2.610924374808178,"d":"2.61"}},{"v":2.8054169578177337,"d":"2.81"},{"$f":"IF(QV7>0,(((4-LOG10(QV7))+(-LOG(QV8)))/2),\"\")","v":{"v":1.6505149978319906,"d":"1.65"}},null,{"v":1.9863251961126216,"d":"1.99"},{"$f":"IF(QY7>0,(((4-LOG10(QY7))+(-LOG(QY8)))/2),\"\")","v":{"v":1.7891980365650846,"d":"1.79"}},null,{"$f":"IF(RA7>0,(((4-LOG10(RA7))+(-LOG(RA8)))/2),\"\")","v":{"v":2.890469833775569,"d":"2.89"}},{"v":2.92539044367231,"d":"2.93"},{"$f":"IF(RC7>0,(((4-LOG10(RC7))+(-LOG(RC8)))/2),\"\")","v":{"v":1.7614393726401687,"d":"1.76"}},{"v":3.8723637474483468,"d":"3.87"},{"$f":"IF(RE7>0,(((4-LOG10(RE7))+(-LOG(RE8)))/2),\"\")","v":{"v":3.989405350465031,"d":"3.99"}},{"v":4.878480975656853,"d":"4.88"},{"$f":"IF(RG7>0,(((4-LOG10(RG7))+(-LOG(RG8)))/2),\"\")","v":{"v":4.5774509799928715,"d":"4.58"}},{"$f":"IF(RH7>0,(((4-LOG10(RH7))+(-LOG(RH8)))/2),\"\")","v":{"v":1.8729435802119663,"d":"1.87"}},{"v":3.3957793217807164,"d":"3.40"},{"v":2.784318117920506,"d":"2.78"},{"$nulls":3},{"v":3.3606231995235856,"d":"3.36"},null,{"$f":"IF(RP7>0,(((4-LOG10(RP7))+(-LOG(RP8)))/2),\"\")","v":{"v":2.9982697339452464,"d":"3.00"}},{"$f":"IF(RQ7>0,(((4-LOG10(RQ7))+(-LOG(RQ8)))/2),\"\")","v":{"v":1.4976802733851249,"d":"1.50"}},{"v":3.013898580810468,"d":"3.01"},{"v":1.6989700043360187,"d":"1.70"},{"v":3.710108201691595,"d":"3.71"},{"v":1.9397130343970748,"d":"1.94"},{"v":1.3610808334989761,"d":"1.36"},{"$f":"IF(RW7>0,(((4-LOG10(RW7))+(-LOG(RW8)))/2),\"\")","v":{"v":2.5228787452803374,"d":"2.52"}},{"v":2.7614393726401687,"d":"2.76"},{"v":2.5228787452803374,"d":"2.52"},{"v":2.5228787452803374,"d":"2.52"},{"v":2.5228787452803374,"d":"2.52"},{"v":2.5228787452803374,"d":"2.52"},{"v":2.5228787452803374,"d":"2.52"},{"v":2.513436073200151,"d":"2.51"},{"v":2.513436073200151,"d":"2.51"},{"v":2.9793036574208873,"d":"2.98"},{"v":2.784318117920506,"d":"2.78"},{"v":2.847152385544071,"d":"2.85"},null,{"$f":"IF(SJ7>0,(((4-LOG10(SJ7))+(-LOG(SJ8)))/2),\"\")","v":{"v":3.309894379144197,"d":"3.31"}},{"$f":"IF(SK7>0,(((4-LOG10(SK7))+(-LOG(SK8)))/2),\"\")","v":{"v":2.56246936830415,"d":"2.56"}},{"$f":"IF(SL7>0,(((4-LOG10(SL7))+(-LOG(SL8)))/2),\"\")","v":{"v":2.085026652029182,"d":"2.09"}},null,{"$f":"IF(SN7>0,(((4-LOG10(SN7))+(-LOG(SN8)))/2),\"\")","v":{"v":2.483288122256525,"d":"2.48"}},{"$f":"IF(SO7>0,(((4-LOG10(SO7))+(-LOG(SO8)))/2),\"\")","v":{"v":3.4447051448503756,"d":"3.44"}},{"v":2.4914833303506096,"d":"2.49"},{"$f":"IF(SQ7>0,(((4-LOG10(SQ7))+(-LOG(SQ8)))/2),\"\")","v":{"v":3.0417730257250373,"d":"3.04"}},{"v":2.799990182467421,"d":"2.80"},{"v":2.5192894529667758,"d":"2.52"},2.73,null,null,{"v":3.7819186764796218,"d":"3.78"},{"$f":"IF(SX7>0,(((4-LOG10(SX7))+(-LOG(SX8)))/2),\"\")","v":{"v":3.262164405837785,"d":"3.26"}},{"v":3.9793036574208873,"d":"3.98"},{"v":2.659379381312206,"d":"2.66"},{"$f":"IF(TA7>0,(((4-LOG10(TA7))+(-LOG(TA8)))/2),\"\")","v":{"v":1.2639510358153232,"d":"1.26"}},{"$f":"IF(TB7>0,(((4-LOG10(TB7))+(-LOG(TB8)))/2),\"\")","v":{"v":2.8239087409443187,"d":"2.82"}},{"v":3.40135972093719,"d":"3.40"},{"v":3.3606231995235856,"d":"3.36"},{"v":0.47969882994296337,"d":"0.48"},{"$f":"IF(TF7>0,(((4-LOG10(TF7))+(-LOG(TF8)))/2),\"\")","v":{"v":1.6505149978319906,"d":"1.65"}},{"$f":"IF(TG7>0,(((4-LOG10(TG7))+(-LOG(TG8)))/2),\"\")","v":{"v":1.8588929334688322,"d":"1.86"}},{"v":4.4430283238465815,"d":"4.44"},{"v":4.152259161754902,"d":"4.15"},{"$f":"IF(TJ7>0,(((4-LOG10(TJ7))+(-LOG(TJ8)))/2),\"\")","v":{"v":2.6883753548010496,"d":"2.69"}},{"v":3.9793036574208873,"d":"3.98"},{"$f":"IF(TL7>0,(((4-LOG10(TL7))+(-LOG(TL8)))/2),\"\")","v":{"v":2.1807553715226815,"d":"2.18"}},{"v":3.383501944803923,"d":"3.38"},{"v":3.2158991379665025,"d":"3.22"},{"v":3,"d":"3.00"},{"$f":"IF(TP7>0,(((4-LOG10(TP7))+(-LOG(TP8)))/2),\"\")","v":{"v":2.011138197355576,"d":"2.01"}},{"$f":"IF(TQ7>0,(((4-LOG10(TQ7))+(-LOG(TQ8)))/2),\"\")","v":{"v":3.182258126592544,"d":"3.18"}},{"v":2.847152385544071,"d":"2.85"},{"v":1.4715475743317636,"d":"1.47"},{"v":1.8315700895415952,"d":"1.83"},{"$f":"IF(TU7>0,(((4-LOG10(TU7))+(-LOG(TU8)))/2),\"\")","v":{"v":4.107335082494616,"d":"4.11"}},{"$f":"IF(TV7>0,(((4-LOG10(TV7))+(-LOG(TV8)))/2),\"\")","v":{"v":4.1419983281826,"d":"4.14"}},{"v":4.045757490560675,"d":"4.05"},null,{"$f":"IF(TY7>0,(((4-LOG10(TY7))+(-LOG(TY8)))/2),\"\")","v":{"v":4.5774509799928715,"d":"4.58"}},{"v":0.9407023173881188,"d":"0.94"},{"v":2.659379381312206,"d":"2.66"},{"v":2.9793036574208873,"d":"2.98"},{"v":2.7614393726401687,"d":"2.76"},{"v":1.6989700043360187,"d":"1.70"},{"v":3.3606231995235856,"d":"3.36"},{"v":2.926935982160881,"d":"2.93"},{"$f":"IF(UG7>0,(((4-LOG10(UG7))+(-LOG(UG8)))/2),\"\")","v":{"v":1.5643887216201464,"d":"1.56"}},{"v":2.006658910110247,"d":"2.01"},{"v":2.455047444280301,"d":"2.46"},null,{"v":2.854982694318741,"d":"2.85"},null,{"v":0.17281545451235725,"d":"0.17"},{"v":2.240743030061056,"d":"2.24"},null,{"v":2,"d":"2.00"},{"v":3.013898580810468,"d":"3.01"},{"v":1.448783147159332,"d":"1.45"},{"$f":"IF(US7>0,(((4-LOG10(US7))+(-LOG(US8)))/2),\"\")","v":{"v":4.70446769648675,"d":"4.70"}},{"v":2.210108201691595,"d":"2.21"},{"v":1.6298186552528782,"d":"1.63"},{"v":1.6076913536835624,"d":"1.61"},{"v":2.483288122256525,"d":"2.48"},{"v":2.659379381312206,"d":"2.66"},{"$f":"IF(UY7>0,(((4-LOG10(UY7))+(-LOG(UY8)))/2),\"\")","v":{"v":5.18837535480105,"d":"5.19"}},{"$f":"IF(UZ7>0,(((4-LOG10(UZ7))+(-LOG(UZ8)))/2),\"\")","v":{"v":2.483288122256525,"d":"2.48"}},{"v":4.152259161754902,"d":"4.15"},null,{"$f":"IF(VC7>0,(((4-LOG10(VC7))+(-LOG(VC8)))/2),\"\")","v":{"v":4.70446769648675,"d":"4.70"}},{"v":0.9407023173881188,"d":"0.94"},{"v":2.4914833303506096,"d":"2.49"},null,{"$f":"IF(VG7>0,(((4-LOG10(VG7))+(-LOG(VG8)))/2),\"\")","v":{"v":1.8516674048692345,"d":"1.85"}},{"v":3.013898580810468,"d":"3.01"},null,null,{"$f":"IF(VK7>0,(((4-LOG10(VK7))+(-LOG(VK8)))/2),\"\")","v":{"v":1.6968093174446974,"d":"1.70"}},{"v":4.878480975656853,"d":"4.88"},{"$f":"IF(VM7>0,(((4-LOG10(VM7))+(-LOG(VM8)))/2),\"\")","v":{"v":3.093543321678572,"d":"3.09"}},{"$f":"IF(VN7>0,(((4-LOG10(VN7))+(-LOG(VN8)))/2),\"\")","v":{"v":3.093543321678572,"d":"3.09"}},{"v":2.847152385544071,"d":"2.85"},{"v":2.847152385544071,"d":"2.85"},{"$f":"IF(VQ7>0,(((4-LOG10(VQ7))+(-LOG(VQ8)))/2),\"\")","v":{"v":3.093543321678572,"d":"3.09"}},{"v":2.842014827271541,"d":"2.84"},{"v":2.0277586639249154,"d":"2.03"},{"$f":"IF(VT7>0,(((4-LOG10(VT7))+(-LOG(VT8)))/2),\"\")","v":{"v":4.5,"d":"4.50"}},{"v":3.4436974992327123,"d":"3.44"},{"v":2.6505149978319906,"d":"2.65"},{"$f":"IF(VW7>0,(((4-LOG10(VW7))+(-LOG(VW8)))/2),\"\")","v":{"v":2.5088643834802156,"d":"2.51"}},{"$f":"IF(VX7>0,(((4-LOG10(VX7))+(-LOG(VX8)))/2),\"\")","v":{"v":4.70446769648675,"d":"4.70"}},{"$f":"IF(VY7>0,(((4-LOG10(VY7))+(-LOG(VY8)))/2),\"\")","v":{"v":4.70446769648675,"d":"4.70"}},{"v":3.7819186764796218,"d":"3.78"},{"v":2.240743030061056,"d":"2.24"},{"v":2.439713034397075,"d":"2.44"},{"v":2.439713034397075,"d":"2.44"},{"$f":"IF(WD7>0,(((4-LOG10(WD7))+(-LOG(WD8)))/2),\"\")","v":{"v":2.610924374808178,"d":"2.61"}},{"v":1.6076913536835624,"d":"1.61"},{"v":3.210108201691595,"d":"3.21"},{"v":4.093543321678572,"d":"4.09"},{"v":2,"d":"2.00"},{"v":2.006658910110247,"d":"2.01"},{"$f":"IF(WJ7>0,(((4-LOG10(WJ7))+(-LOG(WJ8)))/2),\"\")","v":{"v":1.8428030213890185,"d":"1.84"}},{"$f":"IF(WK7>0,(((4-LOG10(WK7))+(-LOG(WK8)))/2),\"\")","v":{"v":4.809894379144197,"d":"4.81"}},{"$f":"IF(WL7>0,(((4-LOG10(WL7))+(-LOG(WL8)))/2),\"\")","v":{"v":3.0277586639249154,"d":"3.03"}},{"$f":"IF(WM7>0,(((4-LOG10(WM7))+(-LOG(WM8)))/2),\"\")","v":{"v":3.0277586639249154,"d":"3.03"}},{"$f":"IF(WN7>0,(((4-LOG10(WN7))+(-LOG(WN8)))/2),\"\")","v":{"v":2.7218487496163566,"d":"2.72"}},{"v":2.882235776546225,"d":"2.88"},{"$f":"IF(WP7>0,(((4-LOG10(WP7))+(-LOG(WP8)))/2),\"\")","v":{"v":2.5563601827349887,"d":"2.56"}},{"v":3.765826334793921,"d":"3.77"},{"$f":"IF(WR7>0,(((4-LOG10(WR7))+(-LOG(WR8)))/2),\"\")","v":{"v":2.629818655252878,"d":"2.63"}},{"$f":"IF(WS7>0,(((4-LOG10(WS7))+(-LOG(WS8)))/2),\"\")","v":{"v":2.0226376045104684,"d":"2.02"}},{"v":1.7440583195105628,"d":"1.74"},{"$f":"IF(WU7>0,(((4-LOG10(WU7))+(-LOG(WU8)))/2),\"\")","v":{"v":1.3106194123418133,"d":"1.31"}},{"v":2.784318117920506,"d":"2.78"},{"v":2.4914833303506096,"d":"2.49"},{"v":2.926935982160881,"d":"2.93"},{"v":2.0277586639249154,"d":"2.03"},{"v":3.383501944803923,"d":"3.38"},{"v":2.5595932038596043,"d":"2.56"},{"v":1.3979400086720377,"d":"1.40"},null,{"$f":"IF(XD7>0,(((4-LOG10(XD7))+(-LOG(XD8)))/2),\"\")","v":{"v":3.600329725273209,"d":"3.60"}},{"v":2.0277586639249154,"d":"2.03"},{"$f":"IF(XF7>0,(((4-LOG10(XF7))+(-LOG(XF8)))/2),\"\")","v":{"v":1.292513326014591,"d":"1.29"}},{"v":2.240743030061056,"d":"2.24"},{"$f":"IF(XH7>0,(((4-LOG10(XH7))+(-LOG(XH8)))/2),\"\")","v":{"v":2,"d":"2.00"}},{"v":3.6220625721637543,"d":"3.62"},{"v":4.045757490560675,"d":"4.05"},{"v":1.9863251961126216,"d":"1.99"},null,{"$f":"IF(XM7>0,(((4-LOG10(XM7))+(-LOG(XM8)))/2),\"\")","v":{"v":2.7044676964867502,"d":"2.70"}},{"v":2.513436073200151,"d":"2.51"},{"$f":"IF(XO7>0,(((4-LOG10(XO7))+(-LOG(XO8)))/2),\"\")","v":{"v":2.772577569995745,"d":"2.77"}},{"v":3.3287886595888967,"d":"3.33"},{"$f":"IF(XQ7>0,(((4-LOG10(XQ7))+(-LOG(XQ8)))/2),\"\")","v":{"v":1.2673085742757908,"d":"1.27"}},{"$f":"IF(XR7>0,(((4-LOG10(XR7))+(-LOG(XR8)))/2),\"\")","v":{"v":2.772577569995745,"d":"2.77"}},{"v":3.765826334793921,"d":"3.77"},{"v":1.9397130343970748,"d":"1.94"},{"v":1.610924374808178,"d":"1.61"},null,{"$f":"IF(XW7>0,(((4-LOG10(XW7))+(-LOG(XW8)))/2),\"\")","v":{"v":2.5228787452803374,"d":"2.52"}},null,{"v":1.4715475743317636,"d":"1.47"},{"$f":"IF(XZ7>0,(((4-LOG10(XZ7))+(-LOG(XZ8)))/2),\"\")","v":{"v":2.5704308513527345,"d":"2.57"}},{"v":5.34518491628705,"d":"5.35"},{"v":2.3873453591370684,"d":"2.39"},{"v":2.006658910110247,"d":"2.01"},{"v":2.513436073200151,"d":"2.51"},{"$f":"IF(YE7>0,(((4-LOG10(YE7))+(-LOG(YE8)))/2),\"\")","v":{"v":2.96479633912994,"d":"2.96"}},{"v":2.210108201691595,"d":"2.21"},{"$f":"IF(YG7>0,(((4-LOG10(YG7))+(-LOG(YG8)))/2),\"\")","v":{"v":4.121301985603488,"d":"4.12"}},{"v":2.4498147274412183,"d":"2.45"},{"v":3.0824719491399417,"d":"3.08"},{"$f":"IF(YJ7>0,(((4-LOG10(YJ7))+(-LOG(YJ8)))/2),\"\")","v":{"v":3.080575454631372,"d":"3.08"}},{"v":4.522878745280337,"d":"4.52"},{"v":4.4430283238465815,"d":"4.44"},{"v":3.383501944803923,"d":"3.38"},{"$f":"IF(YN7>0,(((4-LOG10(YN7))+(-LOG(YN8)))/2),\"\")","v":{"v":2.8675910884952316,"d":"2.87"}},null,{"v":1.5,"d":"1.50"},{"v":3.765826334793921,"d":"3.77"},{"$f":"IF(YR7>0,(((4-LOG10(YR7))+(-LOG(YR8)))/2),\"\")","v":{"v":2.7703037561203843,"d":"2.77"}},null,{"v":2.513436073200151,"d":"2.51"},{"$f":"IF(YU7>0,(((4-LOG10(YU7))+(-LOG(YU8)))/2),\"\")","v":{"v":2.093543321678572,"d":"2.09"}},null,{"v":1.2407430300610562,"d":"1.24"},{"v":3.6220625721637543,"d":"3.62"},{"v":3.6220625721637543,"d":"3.62"},{"v":2.842014827271541,"d":"2.84"},{"v":2.240743030061056,"d":"2.24"},{"$f":"IF(ZB7>0,(((4-LOG10(ZB7))+(-LOG(ZB8)))/2),\"\")","v":{"v":2.072058784981982,"d":"2.07"}},{"$f":"IF(ZC7>0,(((4-LOG10(ZC7))+(-LOG(ZC8)))/2),\"\")","v":{"v":2.548455006504028,"d":"2.55"}}]
["14.8 - Koc",null,242,{"v":1073,"d":"1,073"},{"v":6631,"d":"6,631"},30,{"v":39.5,"d":"40"},72,72,72,200,156,null,null,744,{"v":9315,"d":"9,315"},{"v":56.2,"d":"56"},null,620,866,null,589,304,{"v":73.88,"d":"74"},335,335,null,{"v":288735,"d":"288,735"},null,{"v":1000,"d":"1,000"},85,301,364,{"v":30714,"d":"30,714"},{"v":156250,"d":"156,250"},{"v":89.6,"d":"90"},316,316,30,242,null,589,{"v":1000,"d":"1,000"},{"v":6631,"d":"6,631"},{"v":11.6,"d":"12"},{"v":9629,"d":"9,629"},null,{"v":26062,"d":"26,062"},{"v":5363,"d":"5,363"},364,965,null,null,{"v":1E-4,"d":"0"},364,null,null,{"v":20800,"d":"20,800"},null,174,174,130,174,700,null,866,80,72,{"v":4483,"d":"4,483"},null,null,{"v":73.8,"d":"74"},589,589,86,10,750,{"v":25.2,"d":"25"},{"v":2197,"d":"2,197"},null,{"v":4998,"d":"4,998"},225,241,{"v":9100,"d":"9,100"},{"v":9100,"d":"9,100"},86,{"v":245.2,"d":"245"},null,null,{"v":64300,"d":"64,300"},null,{"v":236610,"d":"236,610"},{"v":236610,"d":"236,610"},169,null,null,{"v":236610,"d":"236,610"},{"v":37480,"d":"37,480"},{"v":21175,"d":"21,175"},null,{"v":35660,"d":"35,660"},43,772,772,{"v":25.2,"d":"25"},32,null,872,{"v":64300,"d":"64,300"},{"v":17.8,"d":"18"},{"v":5363,"d":"5,363"},80,null,112,null,13,772,200,200,{"v":1.4,"d":"1"},{"v":236610,"d":"236,610"},300,225,225,{"v":1.6,"d":"2"},225,null,{"v":99.4,"d":"99"},866,null,null,{"v":157643,"d":"157,643"},null,{"v":8151,"d":"8,151"},72,205,388,{"v":22.7,"d":"23"},220,850,{"v":2967,"d":"2,967"},700,{"v":63300,"d":"63,300"},null,241,null,null,{"v":1440,"d":"1,440"},239,{"v":173900,"d":"173,900"},null,{"v":156250,"d":"156,250"},364,null,409,106,{"v":22.7,"d":"23"},null,300,30,301,{"v":12000,"d":"12,000"},{"v":20800,"d":"20,800"},null,106,106,106,850,{"v":8151,"d":"8,151"},123,{"v":9315,"d":"9,315"},{"v":156250,"d":"156,250"},220,872,225,{"v":12000,"d":"12,000"},125,{"v":21175,"d":"21,175"},500,174,769,225,{"v":56.2,"d":"56"},850,{"v":41182,"d":"41,182"},{"v":2016,"d":"2,016"},850,850,850,{"v":35660,"d":"35,660"},10,{"v":10240000,"d":"10,240,000"},{"v":3627,"d":"3,627"},{"v":10240000,"d":"10,240,000"},301,225,225,{"v":43546,"d":"43,546"},{"v":2184750,"d":"2,184,750"},"-",{"v":1000000,"d":"1,000,000"},90,{"v":3760,"d":"3,760"},{"v":4620,"d":"4,620"},{"v":4620,"d":"4,620"},{"$nulls":3},{"v":4620,"d":"4,620"},30,26,{"v":2185000,"d":"2,185,000"},{"v":1067,"d":"1,067"},998,{"v":3627,"d":"3,627"},{"v":1067,"d":"1,067"},242,86,{"v":4236500,"d":"4,236,500"},{"v":4236500,"d":"4,236,500"},{"v":10000,"d":"10,000"},{"v":226.1,"d":"226"},769,589,{"v":17757,"d":"17,757"},{"v":1152,"d":"1,152"},{"v":56.2,"d":"56"},{"v":31037,"d":"31,037"},null,{"v":1950,"d":"1,950"},{"v":1073,"d":"1,073"},null,{"v":3847,"d":"3,847"},{"v":78.4,"d":"78"},null,{"v":251717,"d":"251,717"},{"v":22836,"d":"22,836"},null,{"v":31037,"d":"31,037"},{"v":30900,"d":"30,900"},{"v":17757,"d":"17,757"},null,134,{"v":1000,"d":"1,000"},72,{"v":22836,"d":"22,836"},{"v":40.8,"d":"41"},174,174,50,{"v":3847,"d":"3,847"},600,{"v":288735,"d":"288,735"},388,{"v":2000,"d":"2,000"},{"v":11354,"d":"11,354"},null,null,{"v":35660,"d":"35,660"},null,{"v":59677,"d":"59,677"},{"v":100000,"d":"100,000"},600,727,{"v":3760,"d":"3,760"},{"v":46.2,"d":"46"},228,{"v":2287,"d":"2,287"},{"v":1.6,"d":"2"},{"v":105.2,"d":"105"},{"v":3394,"d":"3,394"},220,{"v":2197,"d":"2,197"},{"v":145600,"d":"145,600"},{"v":157643,"d":"157,643"},28,30,889,889,null,null,{"v":98.4,"d":"98"},null,{"v":1E-4,"d":"0"},null,205,728,769,304,304,228,{"v":78.4,"d":"78"},241,{"$nulls":3},{"v":3534,"d":"3,534"},239,{"v":2556,"d":"2,556"},220,225,850,{"v":156250,"d":"156,250"},769,228,{"v":3394,"d":"3,394"},{"v":1.4,"d":"1"},{"v":4998,"d":"4,998"},{"v":9598,"d":"9,598"},{"v":59677,"d":"59,677"},{"v":41182,"d":"41,182"},{"v":105.2,"d":"105"},null,400,316,174,134,850,{"v":28700,"d":"28,700"},600,{"v":28700,"d":"28,700"},{"v":7566,"d":"7,566"},{"v":1000000,"d":"1,000,000"},{"v":1100,"d":"1,100"},{"v":73.8,"d":"74"},{"v":1417,"d":"1,417"},109,null,null,{"v":37480,"d":"37,480"},null,20,{"v":17491,"d":"17,491"},316,{"v":156250,"d":"156,250"},54,54,null,{"v":12000,"d":"12,000"},{"v":3104,"d":"3,104"},45,850,{"v":4753,"d":"4,753"},{"v":4753,"d":"4,753"},{"v":11.6,"d":"12"},137,125,{"v":17.96,"d":"18"},52,{"v":13120,"d":"13,120"},225,{"v":3534,"d":"3,534"},205,null,{"v":26062,"d":"26,062"},{"v":1000,"d":"1,000"},{"v":4483,"d":"4,483"},null,{"v":236610,"d":"236,610"},402,{"v":1440,"d":"1,440"},45,null,700,850,null,145,{"v":2252,"d":"2,252"},{"v":10240000,"d":"10,240,000"},{"v":10240000,"d":"10,240,000"},156,null,{"v":157450,"d":"157,450"},{"v":1067,"d":"1,067"},null,{"v":46.2,"d":"46"},{"v":352.5,"d":"353"},null,43,{"v":8151,"d":"8,151"},32,{"v":1950,"d":"1,950"},335,{"v":10000,"d":"10,000"},{"v":157450,"d":"157,450"},{"v":25.2,"d":"25"},{"v":1.4,"d":"1"},80,600,620,{"v":8151,"d":"8,151"},{"v":41182,"d":"41,182"},{"v":4753,"d":"4,753"},54,217,{"v":13120,"d":"13,120"},998,998,null,998,null,{"v":41182,"d":"41,182"},{"v":78.9,"d":"79"},{"v":145600,"d":"145,600"},26,{"v":73.88,"d":"74"},null,{"v":35660,"d":"35,660"},200,{"v":3104,"d":"3,104"},112,{"v":30714,"d":"30,714"},{"v":30714,"d":"30,714"},{"v":78.9,"d":"79"},{"v":17.8,"d":"18"},null,400,{"v":903012,"d":"903,012"},{"v":226.1,"d":"226"},{"v":25.2,"d":"25"},402,{"v":37.92,"d":"38"},{"v":1000,"d":"1,000"},{"v":39.5,"d":"40"},517,null,null,{"v":3500000,"d":"3,500,000"},{"$nulls":3},{"v":10000,"d":"10,000"},769,null,30,{"v":26062,"d":"26,062"},217,{"v":9598,"d":"9,598"},{"v":8151,"d":"8,151"},{"v":39.5,"d":"40"},{"v":30900,"d":"30,900"},{"v":173900,"d":"173,900"},null,{"v":17.96,"d":"18"},137,{"v":1073,"d":"1,073"},null,728,72,200,{"v":352.5,"d":"353"},null,{"v":3200,"d":"3,200"},{"v":165.4,"d":"165"},{"v":1000,"d":"1,000"},{"v":7566,"d":"7,566"},30,477,106,{"v":1000000,"d":"1,000,000"},600,null,{"v":17491,"d":"17,491"},{"v":73.2,"d":"73"},{"v":100000,"d":"100,000"},750,13,965,null,{"v":3394,"d":"3,394"},null,{"v":9315,"d":"9,315"},{"v":12000,"d":"12,000"},{"v":251717,"d":"251,717"},null,null,{"v":1100,"d":"1,100"},{"v":21175,"d":"21,175"},null,223,75,{"v":11354,"d":"11,354"},{"v":43546,"d":"43,546"},{"v":903012,"d":"903,012"},123,43,{"v":22.7,"d":"23"},{"v":9100,"d":"9,100"},{"v":15800,"d":"15,800"},301,374,28,174,174,174,174,174,589,589,{"v":3760,"d":"3,760"},{"v":21175,"d":"21,175"},378,null,{"v":2016,"d":"2,016"},null,null,400,149,null,{"v":2252,"d":"2,252"},null,{"v":1073,"d":"1,073"},{"v":2556,"d":"2,556"},145,{"v":1000,"d":"1,000"},50,{"v":1816,"d":"1,816"},477,30,866,"-",null,72,{"v":11354,"d":"11,354"},{"v":11.6,"d":"12"},{"v":73.2,"d":"73"},300,{"v":8151,"d":"8,151"},727,{"v":2185000,"d":"2,185,000"},30,null,{"v":9629,"d":"9,629"},998,{"v":9598,"d":"9,598"},null,{"v":3200,"d":"3,200"},378,{"v":28700,"d":"28,700"},700,744,null,{"v":17757,"d":"17,757"},20,null,30,866,{"v":3760,"d":"3,760"},28,{"v":22.7,"d":"23"},{"v":11354,"d":"11,354"},{"v":1.4,"d":"1"},109,{"v":37.92,"d":"38"},{"v":226.1,"d":"226"},75,300,130,{"v":98.4,"d":"98"},205,null,66,43,225,{"v":236610,"d":"236,610"},364,90,80,772,866,{"v":59677,"d":"59,677"},149,727,null,{"v":236610,"d":"236,610"},30,{"v":2252,"d":"2,252"},null,{"v":9500,"d":"9,500"},43,{"v":3500000,"d":"3,500,000"},85,{"v":40.8,"d":"41"},{"v":251717,"d":"251,717"},{"v":2000,"d":"2,000"},{"v":2000,"d":"2,000"},378,378,{"v":2000,"d":"2,000"},889,220,400,156,517,null,{"v":236610,"d":"236,610"},{"v":236610,"d":"236,610"},{"v":1816,"d":"1,816"},205,769,769,null,80,225,{"v":26062,"d":"26,062"},66,{"v":37.92,"d":"38"},null,500,null,null,{"v":1000,"d":"1,000"},{"v":1152,"d":"1,152"},{"v":1417,"d":"1,417"},{"v":2967,"d":"2,967"},{"v":3983,"d":"3,983"},null,{"v":56.2,"d":"56"},null,{"v":21175,"d":"21,175"},{"v":2252,"d":"2,252"},{"v":1.4,"d":"1"},220,{"v":9629,"d":"9,629"},{"v":1000000,"d":"1,000,000"},54,{"v":63300,"d":"63,300"},null,220,null,205,{"v":245.2,"d":"245"},850,{"v":17757,"d":"17,757"},750,169,null,589,{"v":1373,"d":"1,373"},{"v":2287,"d":"2,287"},null,{"v":1373,"d":"1,373"},{"v":2967,"d":"2,967"},{"v":15800,"d":"15,800"},409,null,374,null,{"v":28700,"d":"28,700"},null,{"v":64300,"d":"64,300"},106,{"v":37.92,"d":"38"},589,null,364,null,241,{"v":30714,"d":"30,714"},null,{"v":6631,"d":"6,631"},{"v":8151,"d":"8,151"},{"v":9629,"d":"9,629"},{"v":99.4,"d":"99"},null,86,{"v":2967,"d":"2,967"},null,223,589,{"v":89.6,"d":"90"},52,{"v":39.5,"d":"40"},850,850,889,205,{"v":165.4,"d":"165"},{"v":1224,"d":"1,224"}]
["14.9 - t1/2 (DT50)",null,{"v":10,"d":"10.0"},{"v":354,"d":"354.0"},{"v":30,"d":"30.0"},{"v":26,"d":"26.0"},{"v":10,"d":"10.0"},{"v":7,"d":"7.0"},{"v":7,"d":"7.0"},{"v":7,"d":"7.0"},1.6,{"v":14,"d":"14.0"},null,{"v":59,"d":"59.0"},39.2,{"v":32,"d":"32.0"},{"v":50,"d":"50.0"},11.6,{"v":48,"d":"48.0"},{"v":1,"d":"1.0"},8.8,{"v":78,"d":"78.0"},4.7,{"v":12.07,"d":"12.1"},{"v":14,"d":"14.0"},{"v":14,"d":"14.0"},{"v":908,"d":"908.0"},{"v":23,"d":"23.0"},0.1,{"v":150,"d":"150.0"},{"v":24,"d":"24.0"},{"v":597,"d":"597.0"},{"v":142,"d":"142.0"},{"v":141,"d":"141.0"},{"v":60,"d":"60.0"},1.8,{"v":37,"d":"37.0"},{"v":37,"d":"37.0"},{"v":21,"d":"21.0"},{"v":10,"d":"10.0"},{"v":35,"d":"35.0"},{"v":78,"d":"78.0"},0.2,{"v":30,"d":"30.0"},200.2,{"v":4.89,"d":"4.9"},4.3,{"v":92,"d":"92.0"},55.4,{"v":142,"d":"142.0"},24.4,{"v":10,"d":"10.0"},1.5,13.1,{"v":142,"d":"142.0"},3.2,3.2,{"v":90,"d":"90.0"},{"v":350,"d":"350.0"},{"v":75,"d":"75.0"},{"v":75,"d":"75.0"},{"v":60,"d":"60.0"},{"v":75,"d":"75.0"},3.7,{"v":8,"d":"8.0"},{"v":1,"d":"1.0"},{"v":400,"d":"400.0"},{"v":7,"d":"7.0"},113.2,null,null,{"v":64,"d":"64.0"},{"v":78,"d":"78.0"},{"v":78,"d":"78.0"},{"v":13,"d":"13.0"},{"v":0.52,"d":"0.5"},{"v":250,"d":"250.0"},{"v":7,"d":"7.0"},{"v":8,"d":"8.0"},{"v":268,"d":"268.0"},33.2,{"v":40,"d":"40.0"},34.4,0.5,0.5,{"v":13,"d":"13.0"},13.8,null,{"v":908,"d":"908.0"},{"v":13,"d":"13.0"},0.1,{"v":26,"d":"26.0"},{"v":26,"d":"26.0"},{"v":450,"d":"450.0"},null,{"v":13,"d":"13.0"},{"v":26,"d":"26.0"},80.5,{"v":10,"d":"10.0"},{"v":59,"d":"59.0"},{"v":34,"d":"34.0"},{"v":541,"d":"541.0"},{"v":200,"d":"200.0"},{"v":200,"d":"200.0"},{"v":7,"d":"7.0"},{"v":60,"d":"60.0"},null,{"v":190,"d":"190.0"},{"v":13,"d":"13.0"},{"v":7,"d":"7.0"},55.4,{"v":400,"d":"400.0"},{"v":38,"d":"38.0"},19.6,{"v":0.88,"d":"0.9"},{"v":23,"d":"23.0"},{"v":200,"d":"200.0"},0.8,0.8,{"v":0.67,"d":"0.7"},{"v":26,"d":"26.0"},{"v":16,"d":"16.0"},{"v":40,"d":"40.0"},{"v":40,"d":"40.0"},3.1,{"v":40,"d":"40.0"},{"v":21,"d":"21.0"},0.5,{"v":1,"d":"1.0"},null,null,{"v":42,"d":"42.0"},null,{"v":50,"d":"50.0"},{"v":7,"d":"7.0"},{"v":1358,"d":"1,358.0"},8.5,{"v":0.55,"d":"0.6"},0.5,{"v":22,"d":"22.0"},{"v":22,"d":"22.0"},3.7,{"v":4,"d":"4.0"},{"v":5,"d":"5.0"},34.4,{"v":10,"d":"10.0"},{"v":1161,"d":"1,161.0"},{"v":15,"d":"15.0"},{"v":13,"d":"13.0"},{"v":9,"d":"9.0"},1.7,{"v":60,"d":"60.0"},{"v":142,"d":"142.0"},{"v":37,"d":"37.0"},{"v":93,"d":"93.0"},{"v":40,"d":"40.0"},{"v":0.55,"d":"0.6"},0.8,22.6,{"v":11,"d":"11.0"},{"v":597,"d":"597.0"},1.4,{"v":90,"d":"90.0"},39.3,{"v":40,"d":"40.0"},{"v":40,"d":"40.0"},{"v":40,"d":"40.0"},{"v":22,"d":"22.0"},{"v":50,"d":"50.0"},{"v":545,"d":"545.0"},{"v":32,"d":"32.0"},{"v":60,"d":"60.0"},{"v":11,"d":"11.0"},{"v":190,"d":"190.0"},{"v":191,"d":"191.0"},{"v":10000,"d":"10,000.0"},{"v":11,"d":"11.0"},{"v":10,"d":"10.0"},{"v":8,"d":"8.0"},{"v":75,"d":"75.0"},{"v":63,"d":"63.0"},{"v":191,"d":"191.0"},{"v":50,"d":"50.0"},{"v":22,"d":"22.0"},16.3,{"v":7,"d":"7.0"},{"v":22,"d":"22.0"},{"v":22,"d":"22.0"},{"v":22,"d":"22.0"},{"v":34,"d":"34.0"},{"v":0.52,"d":"0.5"},{"v":13,"d":"13.0"},10.5,{"v":13,"d":"13.0"},{"v":597,"d":"597.0"},{"v":40,"d":"40.0"},{"v":40,"d":"40.0"},0.5,{"v":2345,"d":"2,345.0"},{"v":9.62,"d":"9.6"},{"v":3000,"d":"3,000.0"},{"v":49,"d":"49.0"},{"v":130,"d":"130.0"},{"v":3,"d":"3.0"},{"v":3,"d":"3.0"},2.5,72.7,2.5,{"v":3,"d":"3.0"},{"v":21,"d":"21.0"},{"v":82,"d":"82.0"},{"v":2345,"d":"2,345.0"},75.5,0.1,10.5,75.5,{"v":10,"d":"10.0"},{"v":13,"d":"13.0"},4.7,4.7,{"v":4,"d":"4.0"},{"v":15,"d":"15.0"},{"v":63,"d":"63.0"},{"v":78,"d":"78.0"},{"v":11,"d":"11.0"},{"v":61,"d":"61.0"},{"v":50,"d":"50.0"},{"v":7,"d":"7.0"},6.5,{"v":30,"d":"30.0"},{"v":354,"d":"354.0"},1.7,41.1,25.4,50.9,66.6,16.1,null,{"v":7,"d":"7.0"},4.1,{"v":11,"d":"11.0"},null,{"v":18,"d":"18.0"},{"v":20,"d":"20.0"},{"v":7,"d":"7.0"},16.1,2.2,{"v":75,"d":"75.0"},{"v":75,"d":"75.0"},{"v":450,"d":"450.0"},41.1,7.4,{"v":23,"d":"23.0"},8.5,2.7,0.4,99.6,135.1,{"v":34,"d":"34.0"},{"v":35,"d":"35.0"},26.8,{"v":13,"d":"13.0"},7.4,{"v":142,"d":"142.0"},{"v":130,"d":"130.0"},41.2,{"v":86,"d":"86.0"},{"v":0.34,"d":"0.3"},3.1,39.8,{"v":1,"d":"1.0"},{"v":11,"d":"11.0"},{"v":8,"d":"8.0"},{"v":164,"d":"164.0"},{"v":42,"d":"42.0"},{"v":45,"d":"45.0"},2.5,21.9,21.9,{"v":271,"d":"271.0"},{"v":309,"d":"309.0"},57.1,{"v":350,"d":"350.0"},13.1,{"v":400,"d":"400.0"},{"v":1358,"d":"1,358.0"},{"v":183,"d":"183.0"},{"v":63,"d":"63.0"},4.7,4.7,{"v":86,"d":"86.0"},25.4,34.4,72.7,0.1,null,3.2,{"v":13,"d":"13.0"},0.5,{"v":11,"d":"11.0"},{"v":40,"d":"40.0"},{"v":22,"d":"22.0"},{"v":60,"d":"60.0"},{"v":63,"d":"63.0"},{"v":86,"d":"86.0"},{"v":1,"d":"1.0"},{"v":0.67,"d":"0.7"},33.2,{"v":72,"d":"72.0"},26.8,16.3,39.8,null,{"v":41,"d":"41.0"},{"v":37,"d":"37.0"},{"v":75,"d":"75.0"},{"v":18,"d":"18.0"},{"v":22,"d":"22.0"},{"v":12,"d":"12.0"},7.4,{"v":12,"d":"12.0"},{"v":35,"d":"35.0"},{"v":3000,"d":"3,000.0"},{"v":39,"d":"39.0"},{"v":64,"d":"64.0"},1.3,26.7,0.5,{"v":10,"d":"10.0"},80.5,{"v":1161,"d":"1,161.0"},null,182.3,{"v":37,"d":"37.0"},{"v":60,"d":"60.0"},{"v":105,"d":"105.0"},{"v":105,"d":"105.0"},{"v":30,"d":"30.0"},{"v":10000,"d":"10,000.0"},{"v":26,"d":"26.0"},2.7,{"v":22,"d":"22.0"},76.3,76.3,200.2,{"v":120,"d":"120.0"},{"v":11,"d":"11.0"},{"v":60,"d":"60.0"},{"v":90,"d":"90.0"},{"v":15,"d":"15.0"},{"v":191,"d":"191.0"},3.2,{"v":1358,"d":"1,358.0"},null,{"v":92,"d":"92.0"},{"v":150,"d":"150.0"},113.2,39.3,{"v":26,"d":"26.0"},{"v":146,"d":"146.0"},{"v":15,"d":"15.0"},2.7,{"v":50,"d":"50.0"},3.7,{"v":22,"d":"22.0"},37.1,0.9,{"v":214,"d":"214.0"},{"v":13,"d":"13.0"},{"v":13,"d":"13.0"},{"v":14,"d":"14.0"},0.1,{"v":25,"d":"25.0"},75.5,null,41.2,12.5,37.1,{"v":541,"d":"541.0"},{"v":50,"d":"50.0"},{"v":60,"d":"60.0"},{"v":30,"d":"30.0"},{"v":14,"d":"14.0"},{"v":4,"d":"4.0"},{"v":25,"d":"25.0"},{"v":7,"d":"7.0"},{"v":0.67,"d":"0.7"},{"v":400,"d":"400.0"},7.4,{"v":48,"d":"48.0"},{"v":50,"d":"50.0"},16.3,76.3,{"v":105,"d":"105.0"},{"v":0.17,"d":"0.2"},{"v":15,"d":"15.0"},0.1,0.1,49.1,0.1,{"v":21,"d":"21.0"},16.3,6.5,{"v":164,"d":"164.0"},{"v":82,"d":"82.0"},{"v":12.07,"d":"12.1"},{"v":268,"d":"268.0"},{"v":34,"d":"34.0"},0.8,{"v":26,"d":"26.0"},19.6,{"v":141,"d":"141.0"},{"v":141,"d":"141.0"},6.5,{"v":7,"d":"7.0"},142.2,{"v":10,"d":"10.0"},1.3,{"v":15,"d":"15.0"},{"v":7,"d":"7.0"},{"v":146,"d":"146.0"},11.5,{"v":150,"d":"150.0"},{"v":10,"d":"10.0"},{"v":560,"d":"560.0"},{"v":400,"d":"400.0"},{"v":2416,"d":"2,416.0"},null,82.4,{"v":400,"d":"400.0"},null,{"v":4,"d":"4.0"},{"v":63,"d":"63.0"},null,{"v":26,"d":"26.0"},{"v":92,"d":"92.0"},{"v":0.17,"d":"0.2"},{"v":72,"d":"72.0"},{"v":50,"d":"50.0"},{"v":10,"d":"10.0"},4.1,{"v":9,"d":"9.0"},{"v":56,"d":"56.0"},{"v":60,"d":"60.0"},{"v":120,"d":"120.0"},{"v":354,"d":"354.0"},142.2,{"v":183,"d":"183.0"},{"v":7,"d":"7.0"},0.8,12.5,135.1,{"v":502,"d":"502.0"},121.2,0.1,{"v":35,"d":"35.0"},{"v":11,"d":"11.0"},0.2,{"v":40,"d":"40.0"},{"v":3000,"d":"3,000.0"},7.4,82.4,182.3,21.7,{"v":13,"d":"13.0"},{"v":250,"d":"250.0"},{"v":23,"d":"23.0"},24.4,{"v":2416,"d":"2,416.0"},{"v":1,"d":"1.0"},{"v":5,"d":"5.0"},{"v":32,"d":"32.0"},1.4,66.6,{"v":55,"d":"55.0"},50.9,{"v":39,"d":"39.0"},{"v":10,"d":"10.0"},{"v":60,"d":"60.0"},{"v":22,"d":"22.0"},1.2,0.4,0.5,1.3,{"v":545,"d":"545.0"},{"v":541,"d":"541.0"},{"v":0.55,"d":"0.6"},0.5,{"v":181,"d":"181.0"},{"v":597,"d":"597.0"},{"v":237,"d":"237.0"},{"v":45,"d":"45.0"},{"v":75,"d":"75.0"},{"v":75,"d":"75.0"},{"v":75,"d":"75.0"},{"v":75,"d":"75.0"},{"v":75,"d":"75.0"},{"v":78,"d":"78.0"},{"v":78,"d":"78.0"},{"v":130,"d":"130.0"},{"v":10,"d":"10.0"},{"v":7,"d":"7.0"},null,{"v":7,"d":"7.0"},{"v":8,"d":"8.0"},99.6,{"v":41,"d":"41.0"},0.4,{"v":56,"d":"56.0"},{"v":214,"d":"214.0"},4.3,{"v":354,"d":"354.0"},0.5,0.9,{"v":150,"d":"150.0"},{"v":450,"d":"450.0"},{"v":2,"d":"2.0"},0.2,2.5,{"v":1,"d":"1.0"},{"v":9.62,"d":"9.6"},{"v":50,"d":"50.0"},{"v":7,"d":"7.0"},0.4,200.2,21.7,22.6,{"v":50,"d":"50.0"},{"v":142,"d":"142.0"},{"v":2345,"d":"2,345.0"},2.5,49.1,{"v":4.89,"d":"4.9"},0.1,{"v":72,"d":"72.0"},{"v":13,"d":"13.0"},{"v":502,"d":"502.0"},{"v":7,"d":"7.0"},{"v":12,"d":"12.0"},3.7,39.2,{"v":38,"d":"38.0"},{"v":11,"d":"11.0"},null,{"v":55,"d":"55.0"},{"v":26,"d":"26.0"},{"v":1,"d":"1.0"},{"v":130,"d":"130.0"},{"v":45,"d":"45.0"},{"v":0.55,"d":"0.6"},0.4,{"v":0.67,"d":"0.7"},26.7,11.5,{"v":15,"d":"15.0"},1.2,{"v":16,"d":"16.0"},{"v":60,"d":"60.0"},57.1,{"v":1358,"d":"1,358.0"},null,{"v":30,"d":"30.0"},{"v":541,"d":"541.0"},{"v":191,"d":"191.0"},{"v":26,"d":"26.0"},{"v":142,"d":"142.0"},{"v":49,"d":"49.0"},{"v":400,"d":"400.0"},{"v":200,"d":"200.0"},{"v":1,"d":"1.0"},26.8,0.4,{"v":142,"d":"142.0"},{"v":60,"d":"60.0"},{"v":26,"d":"26.0"},{"v":26,"d":"26.0"},{"v":214,"d":"214.0"},null,0.1,{"v":541,"d":"541.0"},null,{"v":24,"d":"24.0"},2.2,66.6,2.7,2.7,{"v":7,"d":"7.0"},{"v":7,"d":"7.0"},2.7,21.9,0.5,{"v":10,"d":"10.0"},{"v":14,"d":"14.0"},{"v":560,"d":"560.0"},{"v":30,"d":"30.0"},{"v":26,"d":"26.0"},{"v":26,"d":"26.0"},{"v":2,"d":"2.0"},{"v":1358,"d":"1,358.0"},{"v":63,"d":"63.0"},{"v":63,"d":"63.0"},{"v":400,"d":"400.0"},{"v":400,"d":"400.0"},{"v":40,"d":"40.0"},{"v":92,"d":"92.0"},{"v":30,"d":"30.0"},11.5,{"v":10,"d":"10.0"},{"v":8,"d":"8.0"},{"v":72,"d":"72.0"},{"v":72,"d":"72.0"},{"v":20,"d":"20.0"},{"v":61,"d":"61.0"},1.3,{"v":22,"d":"22.0"},{"v":500,"d":"500.0"},{"v":0.88,"d":"0.9"},{"v":50,"d":"50.0"},11.6,{"v":10,"d":"10.0"},{"v":214,"d":"214.0"},{"v":0.67,"d":"0.7"},0.5,{"v":4.89,"d":"4.9"},{"v":3000,"d":"3,000.0"},{"v":105,"d":"105.0"},{"v":4,"d":"4.0"},0.8,0.5,{"v":35,"d":"35.0"},{"v":1358,"d":"1,358.0"},13.8,{"v":22,"d":"22.0"},{"v":11,"d":"11.0"},{"v":250,"d":"250.0"},{"v":450,"d":"450.0"},1.5,{"v":78,"d":"78.0"},{"v":13,"d":"13.0"},{"v":0.34,"d":"0.3"},6.5,{"v":13,"d":"13.0"},{"v":22,"d":"22.0"},{"v":181,"d":"181.0"},{"v":93,"d":"93.0"},null,{"v":237,"d":"237.0"},null,{"v":12,"d":"12.0"},{"v":37,"d":"37.0"},{"v":13,"d":"13.0"},{"v":40,"d":"40.0"},11.5,{"v":78,"d":"78.0"},{"v":309,"d":"309.0"},{"v":142,"d":"142.0"},0.5,34.4,{"v":141,"d":"141.0"},{"v":35,"d":"35.0"},{"v":30,"d":"30.0"},{"v":50,"d":"50.0"},{"v":4.89,"d":"4.9"},0.5,null,{"v":13,"d":"13.0"},{"v":22,"d":"22.0"},{"v":271,"d":"271.0"},{"v":22,"d":"22.0"},{"v":78,"d":"78.0"},1.8,{"v":90,"d":"90.0"},{"v":10,"d":"10.0"},{"v":22,"d":"22.0"},{"v":22,"d":"22.0"},21.9,{"v":1358,"d":"1,358.0"},121.2,5.5]
["Índice de vulnerabilidade GUS (IUPAC) (>2 - Alerta alto risco)",null,1.62,2.47,0.26,3.25,{"v":2.4,"d":"2.40"},1.81,1.81,1.81,2.18,1.58,null,3.15,-0.92,0.05,3.82,3.42,2.03,{"v":0,"d":"0.00"},null,2.65,1.02,3.13,1.08,1.08,0.91,{"v":-2,"d":"-2.00"},null,2.18,3.92,4.22,{"v":3.1,"d":"3.10"},-1.05,-2.12,0.55,0.52,0.52,4.89,1.62,3.34,2.65,{"v":0,"d":"0.00"},0.26,6.76,0.01,null,-0.82,1.21,{"v":3.1,"d":"3.10"},1.35,4.77,null,1.03,{"v":3.1,"d":"3.10"},2.58,2.58,-0.62,{"v":2.3,"d":"2.30"},{"v":3.3,"d":"3.30"},{"v":3.3,"d":"3.30"},{"v":2.2,"d":"2.20"},{"v":3.3,"d":"3.30"},0.58,0.47,{"v":0,"d":"0.00"},5.46,1.81,0.27,null,null,1.18,2.65,2.65,{"v":2.3,"d":"2.30"},0.13,3.34,{"v":2.2,"d":"2.20"},3.98,1.06,2.29,2.53,2.63,"-0.03","-0.03",{"v":2.3,"d":"2.30"},1.99,null,0.91,{"v":-0.9,"d":"-0.90"},{"v":-4,"d":"-4.00"},-2.66,-2.66,3.89,null,1.21,-2.66,-1.09,-0.27,3.15,-0.85,6.16,2.66,2.66,{"v":2.2,"d":"2.20"},3.44,null,2.23,{"v":-0.9,"d":"-0.90"},2.32,1.21,5.46,2.62,2.69,{"v":1.1,"d":"1.10"},4.14,2.66,{"v":0,"d":"0.00"},{"v":0,"d":"0.00"},-0.56,-2.66,2.02,2.53,2.53,1.87,2.53,0.89,2.01,{"v":0,"d":"0.00"},null,null,-3.14,null,0.15,1.81,{"v":5.4,"d":"5.40"},1.31,-0.69,{"v":-0.5,"d":"-0.50"},{"v":1.4371723157801364,"d":"1.44"},-0.05,0.58,-0.48,1.33,2.63,0.57,2.56,0.99,2.48,-1.17,1.47,-2.12,{"v":3.1,"d":"3.10"},1.06,2.09,3.16,-0.69,-0.08,2.72,2.52,4.22,-0.01,-0.62,{"v":1.5,"d":"1.50"},3.16,3.16,3.16,{"v":1.4371723157801364,"d":"1.44"},0.15,3.74,0.05,-2.12,1.73,2.23,3.76,-0.32,1.98,-0.27,1.25,{"v":3.3,"d":"3.30"},2.85,3.76,3.82,{"v":1.4371723157801364,"d":"1.44"},-0.75,0.59,{"v":1.4371723157801364,"d":"1.44"},{"v":1.4371723157801364,"d":"1.44"},{"v":1.4371723157801364,"d":"1.44"},-0.85,0.13,-3.35,0.68,-3.35,4.22,2.53,2.53,0.19,-2.29,1.94,-6.95,3.46,{"v":0.9,"d":"0.90"},0.16,0.16,2.18,2.26,2.18,0.16,4.89,4.85,{"v":-7.6,"d":"-7.60"},1.83,{"v":-1,"d":"-1.00"},0.68,1.83,1.62,{"v":2.3,"d":"2.30"},-2.95,-2.95,{"v":0,"d":"0.00"},1.94,2.85,2.65,{"v":-0.3,"d":"-0.30"},1.81,3.82,-0.42,1.81,-0.71,2.47,1.47,1.09,2.95,2.17,-2.55,0.27,null,-0.42,-0.16,{"v":-0.3,"d":"-0.30"},null,2.33,1.47,1.81,0.27,1.35,{"v":3.3,"d":"3.30"},{"v":3.3,"d":"3.30"},6.29,1.09,1.06,{"v":-2,"d":"-2.00"},1.31,0.48,0.02,1.98,0.26,-0.85,{"v":0.5,"d":"0.50"},{"v":-1.1,"d":"-1.10"},-1.62,1.06,2.45,{"v":0.9,"d":"0.90"},{"v":2.5,"d":"2.50"},3.18,{"v":-0.3,"d":"-0.30"},1.87,3.38,{"v":0,"d":"0.00"},1.73,3.98,-1.35,-3.14,4.22,{"v":1,"d":"1.00"},1.41,1.41,{"v":3.2,"d":"3.20"},3.23,3.53,{"v":2.3,"d":"2.30"},1.03,2.29,{"v":5.4,"d":"5.40"},2.57,2.85,1.02,1.02,3.18,2.95,2.63,2.26,null,null,0.48,2.48,-0.18,1.73,2.53,{"v":1.4371723157801364,"d":"1.44"},-2.12,2.85,3.18,{"v":0,"d":"0.00"},-0.56,2.29,0.02,{"v":-1.1,"d":"-1.10"},-0.75,3.38,null,0.59,0.52,{"v":3.3,"d":"3.30"},2.33,{"v":1.4371723157801364,"d":"1.44"},-0.49,1.06,-0.49,0.26,-6.95,1.03,1.18,1.64,2.25,null,0.57,-1.09,2.56,null,-0.32,0.52,-2.12,4.58,4.58,0.03,-0.32,0.72,1.01,{"v":1.4371723157801364,"d":"1.44"},0.61,0.61,6.76,3.87,1.98,5.42,{"v":3.9,"d":"3.90"},-0.13,3.76,0.48,{"v":5.4,"d":"5.40"},null,-0.82,2.18,0.27,{"v":1.5,"d":"1.50"},-2.66,3.02,0.99,1.01,{"v":1.3,"d":"1.30"},0.58,{"v":1.4371723157801364,"d":"1.44"},1.99,{"v":-0.1,"d":"-0.10"},1.51,-3.35,-3.35,1.58,{"v":-4,"d":"-4.00"},-1.67,1.83,null,{"v":2.5,"d":"2.50"},1.59,1.99,6.16,0.15,3.44,-0.71,1.08,{"v":0,"d":"0.00"},-1.67,{"v":2.2,"d":"2.20"},-0.56,5.46,1.06,2.03,0.15,-0.75,0.61,4.58,{"v":0,"d":"0.00"},-0.13,{"v":-1,"d":"-1.00"},{"v":-1,"d":"-1.00"},1.22,{"v":-1,"d":"-1.00"},0.89,-0.75,1.71,-1.35,4.85,3.13,1.06,-0.85,{"v":0,"d":"0.00"},0.72,2.69,-1.05,-1.05,1.71,2.32,2.03,1.18,-1.65,1.94,{"v":2.2,"d":"2.20"},3.02,2.57,2.18,{"v":2.4,"d":"2.40"},{"v":3.3,"d":"3.30"},1.72,2.57,null,0.49,2.29,null,{"v":0,"d":"0.00"},2.85,null,3.25,-0.82,{"v":0,"d":"0.00"},0.02,0.15,{"v":2.4,"d":"2.40"},-0.16,-1.17,-0.86,5.42,3.87,2.47,2.03,2.57,1.81,{"v":0,"d":"0.00"},1.59,0.26,1.97,0.38,{"v":-1,"d":"-1.00"},0.26,2.52,-0.11,3.16,-6.95,1.06,0.49,-0.32,1.56,-1.62,3.34,4.14,1.35,2.57,{"v":0,"d":"0.00"},1.33,0.05,-0.01,-2.55,{"v":-1.2,"d":"-1.20"},2.17,1.03,-0.27,null,2.22,1.49,0.02,0.19,-1.65,3.74,6.16,-0.69,"-0.03",0.13,4.22,{"v":2.7,"d":"2.70"},4.22,{"v":3.3,"d":"3.30"},{"v":3.3,"d":"3.30"},{"v":3.3,"d":"3.30"},{"v":3.3,"d":"3.30"},{"v":3.3,"d":"3.30"},2.65,2.65,{"v":0.9,"d":"0.90"},-0.27,4.12,null,0.59,0.47,1.98,0.59,-0.51,-0.86,1.51,null,2.47,-0.18,{"v":-0.1,"d":"-0.10"},2.18,6.29,-0.29,-0.11,{"v":1,"d":"1.00"},{"v":0,"d":"0.00"},1.94,{"v":1.3,"d":"1.30"},1.81,0.02,6.76,1.56,2.72,0.15,2.45,{"v":-7.6,"d":"-7.60"},{"v":1,"d":"1.00"},1.22,0.01,{"v":-1,"d":"-1.00"},0.02,1.21,1.97,4.12,-0.49,0.58,-0.92,2.62,{"v":-0.3,"d":"-0.30"},null,{"v":-1.2,"d":"-1.20"},3.25,{"v":0,"d":"0.00"},{"v":0.9,"d":"0.90"},4.22,-0.69,0.02,-0.56,2.25,2.57,1.94,1.49,2.02,{"v":2.2,"d":"2.20"},3.53,{"v":5.4,"d":"5.40"},null,3.22,6.16,3.76,-2.66,{"v":3.1,"d":"3.10"},3.46,5.46,2.66,{"v":0,"d":"0.00"},{"v":-1.1,"d":"-1.10"},-0.51,2.45,null,-2.66,3.25,1.51,null,-0.02,6.16,null,3.92,1.35,-2.55,0.48,0.48,4.12,4.12,0.48,1.41,{"v":-0.5,"d":"-0.50"},1.18,1.58,{"v":3.3,"d":"3.30"},0.03,-2.66,-2.66,-0.29,{"v":5.4,"d":"5.40"},2.85,2.85,1.72,5.46,2.53,-0.82,3.22,2.57,4.77,1.25,2.19,2.19,1.47,1.81,1.64,-0.05,1.94,{"v":1.1,"d":"1.10"},3.82,3.42,-0.27,1.51,-0.56,{"v":-0.5,"d":"-0.50"},0.01,-6.95,4.58,-0.48,-0.08,{"v":-0.5,"d":"-0.50"},3.34,{"v":5.4,"d":"5.40"},1.99,{"v":1.4371723157801364,"d":"1.44"},{"v":-0.3,"d":"-0.30"},3.34,3.89,null,2.65,0.96,{"v":-0.3,"d":"-0.30"},1.81,0.96,-0.05,0.13,2.09,null,{"v":2.7,"d":"2.70"},null,-0.49,1.06,{"v":-0.9,"d":"-0.90"},3.16,2.57,2.65,3.23,{"v":3.1,"d":"3.10"},null,2.63,-1.05,{"v":0.5,"d":"0.50"},0.26,0.15,0.01,2.01,null,{"v":2.3,"d":"2.30"},-0.05,{"v":3.2,"d":"3.20"},2.22,2.65,0.55,{"v":3.9,"d":"3.90"},{"v":2.4,"d":"2.40"},{"v":1.4371723157801364,"d":"1.44"},{"v":1.4371723157801364,"d":"1.44"},1.41,{"v":5.4,"d":"5.40"},0.38,0.71]
["Potencial de contaminação (1; 2 - médio risco; 3 - alto risco)",null,1,3,3,2,1,2,2,2,1,3,null,3,3,3,3,3,3,1,3,3,1,2,2,2,3,2,3,1,1,2,3,2,2,1,2,2,1,1,3,3,1,3,2,1,3,3,1,3,1,3,3,3,3,3,3,1,3,3,3,1,3,1,3,1,3,2,3,null,null,2,3,3,2,1,2,3,2,3,2,3,2,1,1,2,2,null,3,2,3,2,2,1,null,3,2,1,1,3,2,3,3,3,3,1,null,3,2,3,1,3,3,2,3,3,3,1,1,1,2,2,3,3,3,3,3,1,1,null,null,2,null,3,2,3,2,1,1,2,2,1,1,3,2,3,3,1,2,1,3,2,3,3,2,3,1,3,2,1,2,1,1,3,3,3,3,2,3,3,3,2,2,3,2,3,2,1,2,3,2,2,3,2,1,2,2,2,2,2,1,1,2,1,2,3,3,1,2,3,2,2,3,1,1,3,3,3,1,1,1,2,2,1,2,2,1,2,1,1,1,2,2,3,2,3,3,1,3,1,3,3,3,2,3,2,1,null,1,1,2,null,2,2,2,1,1,3,3,1,3,1,2,2,1,1,3,3,2,3,2,1,1,3,3,3,3,1,3,2,1,2,2,2,2,3,2,2,2,3,3,1,3,3,3,3,2,2,1,1,3,2,2,3,3,3,1,2,1,2,3,2,2,2,3,1,1,2,2,2,1,2,3,1,2,3,2,2,1,1,1,1,2,3,2,1,2,3,3,1,3,null,2,2,2,2,2,3,3,3,1,2,2,2,2,2,2,3,1,2,2,1,3,null,3,1,3,3,2,3,1,1,3,1,2,3,1,3,1,1,3,3,2,2,null,3,1,3,3,3,1,1,2,1,2,3,1,3,1,3,3,1,2,2,1,2,1,1,3,1,3,1,1,2,1,2,3,2,1,3,2,2,2,1,3,3,3,1,2,3,3,2,1,1,3,3,3,null,3,3,null,1,2,null,2,3,1,2,3,1,1,1,3,3,2,3,3,2,2,1,1,3,3,3,1,1,1,1,3,2,1,3,2,2,1,2,3,1,3,1,3,3,1,2,3,3,3,1,3,1,1,1,1,1,3,3,1,1,2,2,3,3,3,3,3,3,3,3,3,3,1,2,null,2,3,3,1,1,3,3,3,3,1,1,1,1,1,1,2,1,3,3,2,1,2,2,2,3,3,2,2,3,1,1,2,3,3,2,1,1,3,3,2,null,3,2,1,3,3,1,1,1,2,2,2,1,2,1,1,3,null,2,3,2,2,3,2,3,3,1,2,1,3,3,2,2,3,null,1,3,null,1,1,2,1,1,2,2,1,2,1,3,3,3,3,2,2,1,3,2,2,3,3,3,3,2,2,3,2,3,3,2,3,1,2,3,3,3,3,1,3,1,1,1,2,2,1,3,1,3,3,2,2,2,2,1,3,3,2,1,3,2,2,2,2,null,3,null,1,3,2,3,2,3,3,3,3,2,2,3,3,3,1,1,null,2,2,3,1,3,1,1,1,2,2,2,3,3,1]
["Nome comercial",null,"2,4 D; Aminol; DMA","Epoxiconazol; Abacus; Ópera; Prospect","Abamectina; Ampligo; Vertimec","Nicossulfurom; Accent; Sanson; Stoy","Metsulfurom-metílico; Accurate; Nufuron; Zartan","Acefato; Acero; Orthene; Ace; Avant; Cefanol; Evolution; Orthene; Rapel","Acefato; Acero; Orthene; Ace; Avant; Cefanol; Evolution; Orthene; Rapel","Acefato; Acero; Orthene; Ace; Avant; Cefanol; Evolution; Orthene; Rapel","Acetamiprido, Autêntico ","Acetacloro, Kadette; Surpass","Acibenzolar-S-metílico; Bion","Acifluorfem-sódico;  Blazer","Acrinatrina; Rufast","Piraclostrobina; Acronis; Comet","Tiametoxam; Actara; Cruiser; Engeo","Tiencarbazona; Adengo","Linurom; Afalon","Carfentrazona-etílica; Aurora; Rage; Savana; Affinity; Spotlight","Afidopiropeno ","Azoxistrobina; Amistar; Elatus; Priori; Unizeb; Agria; Azimut; Priori Xtra; Tridium; Yoda","Folpete; Folpan Agricur  ","MCPA; Agritone","Alacloro; Alaclor; Laço","Alacloro; Alaclor; Laço","Benzovindiflupir; Alade","Alfa-Cipermetrina;  Fastac","Fosetil; Aliette","Indaziflam; Alion; Metribuzin; Provence Total","Sulfometuron metílico; Ally","Clorantraniliprole; Altacor; Dermacor; Premio","Ciproconazol; Alto 100; Aproach; Artea; Sphere max; Verdadeiro","Metaflumizone; Alverde; Metaflimizona; Verismo","Cipermetrina; Ametista; Commanche; Fury; Hero","Ametoctradina; Zampo","Ametrina; Ametrex; Gesapax; Herbipak  ","Ametrina; Ametrex; Gesapax; Herbipak  ","Amicarbazona; Dinamic","2,4 D; Aminol; DMA","Aminopiralide; Tordon Ultra","Azoxistrobina; Amistar; Elatus; Priori; Unizeb; Agria; Azimut; Priori Xtra; Tridium; Yoda","Amitraz","Abamectina; Ampligo; Vertimec","Imazamoxi; Amplo; Raptor","Tiram; Anchor; Rhodiauram; Vitavax ","Propinebe; Antracol","Teflubenzurom; Antrimo; Imunit; Nomolt","Buprofezina; Applaud","Ciproconazol; Alto 100; Aproach; Artea; Sphere max; Verdadeiro","Picoxistrobina; Aproach Power","Tepraloxidim; Aramo","Tricopir-butolítico; Arbust","Fluroxipir; Arreio","Ciproconazol; Alto 100; Aproach; Artea; Sphere max; Verdadeiro","Asulam; Asulox","Asulam; Asulox","Clorfuazurom; Atabron","Fluquinconazol; Atento","Atrazina; Primestra; Gesaprim; Atranex; Atrasimex; Coyote; Extrazin; Facero; Primagram Gold; Primaiz Gold; Primatop; Primóleo    ","Atrazina; Primestra; Gesaprim; Atranex; Atrasimex; Coyote; Extrazin; Facero; Primagram Gold; Primaiz Gold; Primatop; Primóleo    ","Simazina; Atrasimex","Atrazina; Primestra; Gesaprim; Atranex; Atrasimex; Coyote; Extrazin; Facero; Primagram Gold; Primaiz Gold; Primatop; Primóleo    ","Iprodiona; Attic; Certus; Rovral ","Profoxidim; Aura","Carfentrazona-etílica; Aurora; Rage; Savana; Affinity; Spotlight","Tebutiurom; Aval; Butiron; Lava; Spike","Acefato; Acero; Orthene; Ace; Avant; Cefanol; Evolution; Orthene; Rapel","Indoxacarb; Avatar","Azadiractina; Azamax","Azadiractina; Azamax","Azimsulfurom; Gulliver","Azoxistrobina; Amistar; Elatus; Priori; Unizeb; Agria; Azimut; Priori Xtra; Tridium; Yoda","Azoxistrobina; Amistar; Elatus; Priori; Unizeb; Agria; Azimut; Priori Xtra; Tridium; Yoda","Bentazona; Basagran; Doble; Volt","Dazomete; Basamid","Triadimenol; Baytan; Photon ","Metomil; Bazuka; Brilhamte; Lannate","Flubendiamida; Belt","Mefentrifluconazol; Belyan","Benalaxil; Galben","Carbendazim; Derosal; Fungicarb; Tebuzin; Bendazol; Carben; Carbomax; Derox; ","Ciantraniliprole; Benevia; Fortenza; Verimark ","Benfuracarbe; Benforce; Pottente","Benfuracarbe; Benforce; Pottente","Bentazona; Basagran; Doble; Volt","Bentiavalicarbe isopropílico; Totalit","Benzoato de emamectina; Proclaim","Benzovindiflupir; Alade","Beta-ciflutrina; Bulldock ; Turbo","Bicarbonato de potássio; Kaligreen","Bifentrina; Capture; Sperto; Talisman; Biflex; Bistar; Insemat; Starion; Talstar","Bifentrina; Capture; Sperto; Talisman; Biflex; Bistar; Insemat; Starion; Talstar","Triciclazol; Bim","Acibenzolar-S-metílico; Bion","Bispirabaque; Riper","Bifentrina; Capture; Sperto; Talisman; Biflex; Bistar; Insemat; Starion; Talstar","Bistrifluron; Hanaro","Piriproxifem; Blade; Cordial; Privilege; Tiger","Acifluorfem-sódico;  Blazer","Fenpropatrina; Bold; Danimen; Meothrin ","Sulfentrazona; Boral; Kicker; Ponteiro; Solara","Boscalida; Boscalid; Cantus; Spot","Boscalida; Boscalid; Cantus; Spot","Metomil; Bazuka; Brilhamte; Lannate","Bromacila; Krovar","Brometo de metila ","Bromuconazol; Condor","Beta-ciflutrina; Bulldock ; Turbo","Metam-sódico; Bunema","Buprofezina; Applaud","Tebutiurom; Aval; Butiron; Lava; Spike","Cadusafós; Rugby","Mesotriona; Calisto","Tiacloprido; Calypso","Picloram; Campestre","Boscalida; Boscalid; Cantus; Spot","Captana; Captan; Merpan; Orthocide ","Captana; Captan; Merpan; Orthocide ","Tiodicarbe; Captor; Futur; Larvim; Semevim","Bifentrina; Capture; Sperto; Talisman; Biflex; Bistar; Insemat; Starion; Talstar","Carbaril; Sevin","Carbendazim; Derosal; Fungicarb; Tebuzin; Bendazol; Carben; Carbomax; Derox; ","Carbendazim; Derosal; Fungicarb; Tebuzin; Bendazol; Carben; Carbomax; Derox; ","Flonicamida; Carbine","Carbendazim; Derosal; Fungicarb; Tebuzin; Bendazol; Carben; Carbomax; Derox; ","Carbossulfano;  Marshal","Carboxina; Vitavax Thiram","Carfentrazona-etílica; Aurora; Rage; Savana; Affinity; Spotlight","Cartape; Cartarys","Cartape; Cartarys","Flufenoxurom; Cascade","Casugamicina; Kasumin","Clorpirifós; Klorpan; Losban; Catcher; Nufos; Record; Vexter","Acefato; Acero; Orthene; Ace; Avant; Cefanol; Evolution; Orthene; Rapel","Flutriafol; Celeiro; Impact; Skip; Tasker; Tornado; Zoom","Fenamidona; Censor","Cletodim; Centurion; Poquer; Select","Tiofanato-metílico; Cercobin; Support; Topsin","Clorotalonil; Cerconil; Cuprodil; Daconil; Glider; Zetanil; Dacobre; Dacostar; Funginil; Ichiban; Isatalonil; Totalit; Zetaran","Triflumurom; Certero; Thorn; Wasp","Iprodiona; Attic; Certus; Rovral ","Tolfenpirade; Chaser","Pimetrozina; Chess","Ciantraniliprole; Benevia; Fortenza; Verimark ","Ciazofamida; Hanami","Ciclaniliprol; Hayate","Ciclossulfamurom; Invest","Fostiazato; Cierto","Ciflumetofen; Okay","Cimoxanil; Equation","Cipermetrina; Ametista; Commanche; Fury; Hero","Ciproconazol; Alto 100; Aproach; Artea; Sphere max; Verdadeiro","Ciprodinil; Truzon","Ciromazina; Trigard ","Clorimurom-etílico; Classic; Panzer; Twister; Clorim; Clorimuron; ","Cletodim; Centurion; Poquer; Select","Clodinafope-Propargil; Topic","Clomazona; Reator","Cloransulam-metílico; Pacto","Clorantraniliprole; Altacor; Dermacor; Premio","Clorfenapir; Pirate","Clorfuazurom; Atabron","Cloridrato de propamocarbe; Infinito","Clorimurom-etílico; Classic; Panzer; Twister; Clorim; Clorimuron; ","Clorimurom-etílico; Classic; Panzer; Twister; Clorim; Clorimuron; ","Clorimurom-etílico; Classic; Panzer; Twister; Clorim; Clorimuron; ","Clorotalonil; Cerconil; Cuprodil; Daconil; Glider; Zetanil; Dacobre; Dacostar; Funginil; Ichiban; Isatalonil; Totalit; Zetaran","Clorpirifós; Klorpan; Losban; Catcher; Nufos; Record; Vexter","Clotianidina; Poncho","Piraclostrobina; Acronis; Comet","Cipermetrina; Ametista; Commanche; Fury; Hero","Fluazinam; Completo; Frowncide","Bromuconazol; Condor","Imidacloprido; Connect; Cropstar; Sombrero","Hidróxido de cobre; Contact","Imazapir; Contain","Piriproxifem; Blade; Cordial; Privilege; Tiger","Terbufós; Counter","Atrazina; Primestra; Gesaprim; Atranex; Atrasimex; Coyote; Extrazin; Facero; Primagram Gold; Primaiz Gold; Primatop; Primóleo    ","Tebuconazol; Cronnos; Egan; Folicur; Fusão; Nativo; Tebuco","Imidacloprido; Connect; Cropstar; Sombrero","Tiametoxam; Actara; Cruiser; Engeo","Clorotalonil; Cerconil; Cuprodil; Daconil; Glider; Zetanil; Dacobre; Dacostar; Funginil; Ichiban; Isatalonil; Totalit; Zetaran","Lufenuron; Curyom; Game; Match","Profenofós; Curyom ","Clorotalonil; Cerconil; Cuprodil; Daconil; Glider; Zetanil; Dacobre; Dacostar; Funginil; Ichiban; Isatalonil; Totalit; Zetaran","Clorotalonil; Cerconil; Cuprodil; Daconil; Glider; Zetanil; Dacobre; Dacostar; Funginil; Ichiban; Isatalonil; Totalit; Zetaran","Clorotalonil; Cerconil; Cuprodil; Daconil; Glider; Zetanil; Dacobre; Dacostar; Funginil; Ichiban; Isatalonil; Totalit; Zetaran","Fenpropatrina; Bold; Danimen; Meothrin ","Dazomete; Basamid","Deltametrina; Decis; K-Obiol; K-Othrine ","Ditianona; Delan","Deltametrina; Decis; K-Obiol; K-Othrine ","Clorantraniliprole; Altacor; Dermacor; Premio","Carbendazim; Derosal; Fungicarb; Tebuzin; Bendazol; Carben; Carbomax; Derox; ","Carbendazim; Derosal; Fungicarb; Tebuzin; Bendazol; Carben; Carbomax; Derox; ","Diafentiuron; Polo","Dibrometo de Diquate","Dicamba; Rainvel ","Dicloreto de Paraquate; Gramoxone; Paraquat; Tocha","Diclosulam; Spider","Difenoconazol; Flair; Prisma; Score","Diflubenzurom; Diflumax; Dimilim","Diflubenzurom; Diflumax; Dimilim","Dimetoato; Dimexion","Dimetomorfe; Forum","Dimetoato; Dimexion","Diflubenzurom; Diflumax; Dimilim","Amicarbazona; Dinamic","Dinofeturam; Maxsan","Diquate; Reglone","Diurom; Direx; Karmex","Mancozebe; Dithane; Mancozeb; Manzate; Ridomil","Ditianona; Delan","Diurom; Direx; Karmex","2,4 D; Aminol; DMA","Bentazona; Basagran; Doble; Volt","Dodina; Dodex","Dodina; Dodex","Lactofem; Drible; Naja","Metolacloro; Dual Gold; Sequence","Tebuconazol; Cronnos; Egan; Folicur; Fusão; Nativo; Tebuco","Azoxistrobina; Amistar; Elatus; Priori; Unizeb; Agria; Azimut; Priori Xtra; Tridium; Yoda","Etofenproxi; Eleitto; Safety; Trebon","Tetraconazol; Eminent ","Tiametoxam; Actara; Cruiser; Engeo","Espirodiclofeno; Envidor","Trifloxisulfuron; Envoke","Enxofre; Kumulus","Epoxiconazol; Abacus; Ópera; Prospect","Cimoxanil; Equation","Famoxadona; Equation","Foransulfurom; Equip Plus","Pirimetanil; Erune","Esfenvalerato; Pirephos; Sumidan","Espinetoram; Exalt","Espinosade; Natular","Espirodiclofeno; Envidor","Espiromesifeno; Oberon","Etofenproxi; Eleitto; Safety; Trebon","Etoxazol; Smite","Etoxissulfurom; Gladium","Etridiazol; Terrazole","Acefato; Acero; Orthene; Ace; Avant; Cefanol; Evolution; Orthene; Rapel","Espinetoram; Exalt","Sulfoxaflor; Expedition","Atrazina; Primestra; Gesaprim; Atranex; Atrasimex; Coyote; Extrazin; Facero; Primagram Gold; Primaiz Gold; Primatop; Primóleo    ","Atrazina; Primestra; Gesaprim; Atranex; Atrasimex; Coyote; Extrazin; Facero; Primagram Gold; Primaiz Gold; Primatop; Primóleo    ","Quincloraque; Facet","Famoxadona; Equation","Glufosinato de amônio; Fascinate; Finale; Liberty; Patrol","Alfa-Cipermetrina;  Fastac","Fenamidona; Censor","Fenitrotiona; Sumifog; Sumigran; Sumithion ","Fenoxaprop-P-ethyl; Podium; Rapsode; Selefen ","Fenpirazamina; Prolectus","Fenpiroximato; Ortus","Fenpropatrina; Bold; Danimen; Meothrin ","Fenpropimorfe; Versatilis","Gama-Cialotrina; Fentrol; Stalion","Permetrina; Fersol","Glufosinato de amônio; Fascinate; Finale; Liberty; Patrol","Fipronil; Regente; Standak","Difenoconazol; Flair; Prisma; Score","Flazassulfurom; Katana","Fomesafem; Flex; Fusiflex","Trifloxistrobina; Flint ","Flonicamida; Carbine","Florpirauxifen-benzil; Gapper","Fluazifope-p-butil;  Fusilade; Pilot ","Fluazinam; Completo; Frowncide","Flubendiamida; Belt","Fludioxonil; Maxim XL","Flufenoxurom; Cascade","Flumetsulam; Prevaiil; Scorpion","Flumicloraque-pentílico; Radiant; Resource","Flumioxazina; Flumyzin; Sumyzin; Zethamaxx","Flumioxazina; Flumyzin; Sumyzin; Zethamaxx","Fluopicolide; Xavante","Fluopiram; Verango Prime","Flupiradifurona; Sivanto","Fluquinconazol; Atento","Fluroxipir; Arreio","Flutolanil; Moncut","Flutriafol; Celeiro; Impact; Skip; Tasker; Tornado; Zoom","Fluxapiroxade; Orkestra","Tebuconazol; Cronnos; Egan; Folicur; Fusão; Nativo; Tebuco","Folpete; Folpan Agricur  ","Folpete; Folpan Agricur  ","Fomesafem; Flex; Fusiflex","Foransulfurom; Equip Plus","Ciantraniliprole; Benevia; Fortenza; Verimark ","Dimetomorfe; Forum","Fosetil; Aliette","Fosfeto de alúminio; Gastoxin","Fosmete; Imidam","Fostiazato; Cierto","Protioconazol; Fox","Fluazinam; Completo; Frowncide","Carbendazim; Derosal; Fungicarb; Tebuzin; Bendazol; Carben; Carbomax; Derox; ","Clorotalonil; Cerconil; Cuprodil; Daconil; Glider; Zetanil; Dacobre; Dacostar; Funginil; Ichiban; Isatalonil; Totalit; Zetaran","Cipermetrina; Ametista; Commanche; Fury; Hero","Tebuconazol; Cronnos; Egan; Folicur; Fusão; Nativo; Tebuco","Fomesafem; Flex; Fusiflex","Fluazifope-p-butil;  Fusilade; Pilot ","Tiodicarbe; Captor; Futur; Larvim; Semevim","Benalaxil; Galben","Novalurom; Gallaxy;  Rimon","Gama-Cialotrina; Fentrol; Stalion","Lufenuron; Curyom; Game; Match","Florpirauxifen-benzil; Gapper","Fosfeto de alúminio; Gastoxin","Prometrina; Gesagard","Ametrina; Ametrex; Gesapax; Herbipak  ","Atrazina; Primestra; Gesaprim; Atranex; Atrasimex; Coyote; Extrazin; Facero; Primagram Gold; Primaiz Gold; Primatop; Primóleo    ","Etoxissulfurom; Gladium","Clorotalonil; Cerconil; Cuprodil; Daconil; Glider; Zetanil; Dacobre; Dacostar; Funginil; Ichiban; Isatalonil; Totalit; Zetaran","Glifosato; Glyphotal; Roundup; Trop","Glufosinato de amônio; Fascinate; Finale; Liberty; Patrol","Glifosato; Glyphotal; Roundup; Trop","Oxyfluorfem; Goal","Dicloreto de Paraquate; Gramoxone; Paraquat; Tocha","Pirimifós-metílico; Graolin","Azimsulfurom; Gulliver","Halauxifen-metíl; Texaro","Halossulfurom-metílico; Sempra","Haloxifope-P-metílico; Verdict-max","Ciazofamida; Hanami","Bistrifluron; Hanaro","Ciclaniliprol; Hayate","Saflufenacil; Heat","Pendimetalina; Herbadox","Ametrina; Ametrex; Gesapax; Herbipak  ","Cipermetrina; Ametista; Commanche; Fury; Hero","Hexazinona; Hexanil; Magnus; Token","Hexazinona; Hexanil; Magnus; Token","Hexitiazox; Talento","Hidróxido de cobre; Contact","Hidróxido de Fentina; Mertin ","Iodossulfurom-metílico-sódico; Hussar","Clorotalonil; Cerconil; Cuprodil; Daconil; Glider; Zetanil; Dacobre; Dacostar; Funginil; Ichiban; Isatalonil; Totalit; Zetaran","Imazalil; Imazacure; Magnate ","Imazalil; Imazacure; Magnate ","Imazamoxi; Amplo; Raptor","Imazapique; Only","Imazapir; Contain","Imazaquim; Oneshot ","Imazetapir; Zaphir","Imibenconazol; Manage ","Imidacloprido; Connect; Cropstar; Sombrero","Fosmete; Imidam","Flutriafol; Celeiro; Impact; Skip; Tasker; Tornado; Zoom","Impirfluxam; Sugoy","Teflubenzurom; Antrimo; Imunit; Nomolt","Indaziflam; Alion; Metribuzin; Provence Total","Indoxacarb; Avatar","Cloridrato de propamocarbe; Infinito","Bifentrina; Capture; Sperto; Talisman; Biflex; Bistar; Insemat; Starion; Talstar","Metoxifenozida; Intrepid","Ciclossulfamurom; Invest","Iodossulfurom-metílico-sódico; Hussar","Ipconazol; Rancona","Iprodiona; Attic; Certus; Rovral ","Clorotalonil; Cerconil; Cuprodil; Daconil; Glider; Zetanil; Dacobre; Dacostar; Funginil; Ichiban; Isatalonil; Totalit; Zetaran","Isofetamida; Kenja","Isoxaflutol; Provence","Propiconazol; Juno; Stratego; Tilt","Deltametrina; Decis; K-Obiol; K-Othrine ","Deltametrina; Decis; K-Obiol; K-Othrine ","Acetacloro, Kadette; Surpass","Bicarbonato de potássio; Kaligreen","Lambda-Cialotrina; Karate zeon","Diurom; Direx; Karmex","Casugamicina; Kasumin","Flazassulfurom; Katana","Orthosulfamuron; Kelion","Isofetamida; Kenja","Sulfentrazona; Boral; Kicker; Ponteiro; Solara","Clorpirifós; Klorpan; Losban; Catcher; Nufos; Record; Vexter","Bromacila; Krovar","Enxofre; Kumulus","Alacloro; Alaclor; Laço","Lactofem; Drible; Naja","Lambda-Cialotrina; Karate zeon","Metomil; Bazuka; Brilhamte; Lannate","Tiodicarbe; Captor; Futur; Larvim; Semevim","Tebutiurom; Aval; Butiron; Lava; Spike","Glufosinato de amônio; Fascinate; Finale; Liberty; Patrol","Linurom; Afalon","Clorpirifós; Klorpan; Losban; Catcher; Nufos; Record; Vexter","Lufenuron; Curyom; Game; Match","Imazalil; Imazacure; Magnate ","Hexazinona; Hexanil; Magnus; Token","Malation; Nordick","Imibenconazol; Manage ","Mancozebe; Dithane; Mancozeb; Manzate; Ridomil","Mancozebe; Dithane; Mancozeb; Manzate; Ridomil","Mandipropamida; Revus","Mancozebe; Dithane; Mancozeb; Manzate; Ridomil","Carbossulfano;  Marshal","Lufenuron; Curyom; Game; Match","Metalaxil-M; Maxim","Fludioxonil; Maxim XL","Dinofeturam; Maxsan","MCPA; Agritone","Mefentrifluconazol; Belyan","Fenpropatrina; Bold; Danimen; Meothrin ","Captana; Captan; Merpan; Orthocide ","Hidróxido de Fentina; Mertin ","Mesotriona; Calisto","Metaflumizone; Alverde; Metaflimizona; Verismo","Metaflumizone; Alverde; Metaflimizona; Verismo","Metalaxil-M; Maxim","Metam-sódico; Bunema","Metconazol; Ópera Ultra","Metidationa; Suprathion","Metiram; Polyram","Metolacloro; Dual Gold; Sequence","Metomil; Bazuka; Brilhamte; Lannate","Metoxifenozida; Intrepid","Metribuzim; Sencor; Tenace; Unimark","Indaziflam; Alion; Metribuzin; Provence Total","Metsulfurom-metílico; Accurate; Nufuron; Zartan","Miclobutanil; Systhane","Tebufenozida; Mimic","Pidiflumetofen; Miravis","Sulfluramida; Mirex S","Pencicurom; Moceren","Flutolanil; Moncut","MSMA; Volcane","Lactofem; Drible; Naja","Tebuconazol; Cronnos; Egan; Folicur; Fusão; Nativo; Tebuco","Espinosade; Natular","Nicossulfurom; Accent; Sanson; Stoy","Teflubenzurom; Antrimo; Imunit; Nomolt","Malation; Nordick","Novalurom; Gallaxy;  Rimon","Clorpirifós; Klorpan; Losban; Catcher; Nufos; Record; Vexter","Metsulfurom-metílico; Accurate; Nufuron; Zartan","Espiromesifeno; Oberon","Ciflumetofen; Okay","Propargito; Omite","Imazaquim; Oneshot ","Imazapique; Only","Epoxiconazol; Abacus; Ópera; Prospect","Metconazol; Ópera Ultra","Fluxapiroxade; Orkestra","Acefato; Acero; Orthene; Ace; Avant; Cefanol; Evolution; Orthene; Rapel","Captana; Captan; Merpan; Orthocide ","Orthosulfamuron; Kelion","Fenpiroximato; Ortus","Oxadiazona; Ronstar","Oxatiapiprolina; Zorvec","Oxicloreto de cobre","Oxyfluorfem; Goal","Cloransulam-metílico; Pacto","Quizalofope-P-tefurílico; Panther","Clorimurom-etílico; Classic; Panzer; Twister; Clorim; Clorimuron; ","Dicloreto de Paraquate; Gramoxone; Paraquat; Tocha","Glufosinato de amônio; Fascinate; Finale; Liberty; Patrol","Pencicurom; Moceren","Pendimetalina; Herbadox","Penoxsulam; Raster","Permetrina; Fersol","Triadimenol; Baytan; Photon ","Picloram; Campestre","Picoxistrobina; Aproach Power","Pidiflumetofen; Miravis","Fluazifope-p-butil;  Fusilade; Pilot ","Pimetrozina; Chess","Piraclostrobina; Acronis; Comet","Clorfenapir; Pirate","Esfenvalerato; Pirephos; Sumidan","Piridabem; Sanmite","Pirimetanil; Erune","Pirimifós-metílico; Graolin","Piriproxifem; Blade; Cordial; Privilege; Tiger","Piritiobaque-sódico; Staple","Piroxassulfona; Yamato","Setoxidim; Poast","Fenoxaprop-P-ethyl; Podium; Rapsode; Selefen ","Diafentiuron; Polo","Metiram; Polyram","Clotianidina; Poncho","Sulfentrazona; Boral; Kicker; Ponteiro; Solara","Cletodim; Centurion; Poquer; Select","Benfuracarbe; Benforce; Pottente","Trifluralina; Premelin","Clorantraniliprole; Altacor; Dermacor; Premio","Triticonazol; Premis","Flumetsulam; Prevaiil; Scorpion","Atrazina; Primestra; Gesaprim; Atranex; Atrasimex; Coyote; Extrazin; Facero; Primagram Gold; Primaiz Gold; Primatop; Primóleo    ","Atrazina; Primestra; Gesaprim; Atranex; Atrasimex; Coyote; Extrazin; Facero; Primagram Gold; Primaiz Gold; Primatop; Primóleo    ","Atrazina; Primestra; Gesaprim; Atranex; Atrasimex; Coyote; Extrazin; Facero; Primagram Gold; Primaiz Gold; Primatop; Primóleo    ","Atrazina; Primestra; Gesaprim; Atranex; Atrasimex; Coyote; Extrazin; Facero; Primagram Gold; Primaiz Gold; Primatop; Primóleo    ","Atrazina; Primestra; Gesaprim; Atranex; Atrasimex; Coyote; Extrazin; Facero; Primagram Gold; Primaiz Gold; Primatop; Primóleo    ","Azoxistrobina; Amistar; Elatus; Priori; Unizeb; Agria; Azimut; Priori Xtra; Tridium; Yoda","Azoxistrobina; Amistar; Elatus; Priori; Unizeb; Agria; Azimut; Priori Xtra; Tridium; Yoda","Difenoconazol; Flair; Prisma; Score","Piriproxifem; Blade; Cordial; Privilege; Tiger","Procimidona; Rotaxil; Sumiguard; Sumilex ","Benzoato de emamectina; Proclaim","Profenofós; Curyom ","Profoxidim; Aura","Fenpirazamina; Prolectus","Prometrina; Gesagard","Propanil; Stam","Propargito; Omite","Propiconazol; Juno; Stratego; Tilt","Propinebe; Antracol","Epoxiconazol; Abacus; Ópera; Prospect","Protioconazol; Fox","Isoxaflutol; Provence","Indaziflam; Alion; Metribuzin; Provence Total","Quincloraque; Facet","Quizalofop-P-ethyl; Targa ","Quizalofope-P-tefurílico; Panther","Flumicloraque-pentílico; Radiant; Resource","Carfentrazona-etílica; Aurora; Rage; Savana; Affinity; Spotlight","Dicamba; Rainvel ","Ipconazol; Rancona","Acefato; Acero; Orthene; Ace; Avant; Cefanol; Evolution; Orthene; Rapel","Fenoxaprop-P-ethyl; Podium; Rapsode; Selefen ","Imazamoxi; Amplo; Raptor","Penoxsulam; Raster","Clomazona; Reator","Clorpirifós; Klorpan; Losban; Catcher; Nufos; Record; Vexter","Fipronil; Regente; Standak","Diquate; Reglone","Flumicloraque-pentílico; Radiant; Resource","Mandipropamida; Revus","Tiram; Anchor; Rhodiauram; Vitavax ","Mancozebe; Dithane; Mancozeb; Manzate; Ridomil","Novalurom; Gallaxy;  Rimon","Bispirabaque; Riper","Oxadiazona; Ronstar","Procimidona; Rotaxil; Sumiguard; Sumilex ","Glifosato; Glyphotal; Roundup; Trop","Iprodiona; Attic; Certus; Rovral ","Acrinatrina; Rufast","Rugby","Etofenproxi; Eleitto; Safety; Trebon","Saflufenacil; Heat","Piridabem; Sanmite","Nicossulfurom; Accent; Sanson; Stoy","Carfentrazona-etílica; Aurora; Rage; Savana; Affinity; Spotlight","Difenoconazol; Flair; Prisma; Score","Flumetsulam; Prevaiil; Scorpion","Cletodim; Centurion; Poquer; Select","Fenoxaprop-P-ethyl; Podium; Rapsode; Selefen ","Tiodicarbe; Captor; Futur; Larvim; Semevim","Halossulfurom-metílico; Sempra","Metribuzim; Sencor; Tenace; Unimark","Metolacloro; Dual Gold; Sequence","Setoxidim; Poast","Carbaril; Sevin","Simazina; Atrasimex","Flupiradifurona; Sivanto","Flutriafol; Celeiro; Impact; Skip; Tasker; Tornado; Zoom","Etoxazol; Smite","Tembotriona; Soberan","Sulfentrazona; Boral; Kicker; Ponteiro; Solara","Imidacloprido; Connect; Cropstar; Sombrero","Bifentrina; Capture; Sperto; Talisman; Biflex; Bistar; Insemat; Starion; Talstar","Ciproconazol; Alto 100; Aproach; Artea; Sphere max; Verdadeiro","Diclosulam; Spider","Tebutiurom; Aval; Butiron; Lava; Spike","Boscalida; Boscalid; Cantus; Spot","Carfentrazona-etílica; Aurora; Rage; Savana; Affinity; Spotlight","Gama-Cialotrina; Fentrol; Stalion","Propanil; Stam","Fipronil; Regente; Standak","Piritiobaque-sódico; Staple","Bifentrina; Capture; Sperto; Talisman; Biflex; Bistar; Insemat; Starion; Talstar","Nicossulfurom; Accent; Sanson; Stoy","Propiconazol; Juno; Stratego; Tilt","Impirfluxam; Sugoy","Sulfato de cobre","Sulfentrazona; Boral; Kicker; Ponteiro; Solara","Sulfluramida; Mirex S","Sulfometuron metílico; Ally","Sulfoxaflor; Expedition","Esfenvalerato; Pirephos; Sumidan","Fenitrotiona; Sumifog; Sumigran; Sumithion ","Fenitrotiona; Sumifog; Sumigran; Sumithion ","Procimidona; Rotaxil; Sumiguard; Sumilex ","Procimidona; Rotaxil; Sumiguard; Sumilex ","Fenitrotiona; Sumifog; Sumigran; Sumithion ","Flumioxazina; Flumyzin; Sumyzin; Zethamaxx","Tiofanato-metílico; Cercobin; Support; Topsin","Metidationa; Suprathion","Acetacloro, Kadette; Surpass","Miclobutanil; Systhane","Hexitiazox; Talento","Bifentrina; Capture; Sperto; Talisman; Biflex; Bistar; Insemat; Starion; Talstar","Bifentrina; Capture; Sperto; Talisman; Biflex; Bistar; Insemat; Starion; Talstar","Quizalofop-P-ethyl; Targa ","Flutriafol; Celeiro; Impact; Skip; Tasker; Tornado; Zoom","Tebuconazol; Cronnos; Egan; Folicur; Fusão; Nativo; Tebuco","Tebuconazol; Cronnos; Egan; Folicur; Fusão; Nativo; Tebuco","Tebufenozida; Mimic","Tebutiurom; Aval; Butiron; Lava; Spike","Carbendazim; Derosal; Fungicarb; Tebuzin; Bendazol; Carben; Carbomax; Derox; ","Teflubenzurom; Antrimo; Imunit; Nomolt","Tembotriona; Soberan","Metribuzim; Sencor; Tenace; Unimark","Tepraloxidim; Aramo","Terbufós; Counter","Terbutilazina; Terbumax","Terbutilazina; Terbumax","Etridiazol; Terrazole","Tetraconazol; Eminent ","Halauxifen-metíl; Texaro","Triflumurom; Certero; Thorn; Wasp","Tiabendazol; Tecto","Tiacloprido; Calypso","Tiametoxam; Actara; Cruiser; Engeo","Tiencarbazona; Adengo","Piriproxifem; Blade; Cordial; Privilege; Tiger","Propiconazol; Juno; Stratego; Tilt","Tiodicarbe; Captor; Futur; Larvim; Semevim","Tiofanato-metílico; Cercobin; Support; Topsin","Tiram; Anchor; Rhodiauram; Vitavax ","Dicloreto de Paraquate; Gramoxone; Paraquat; Tocha","Hexazinona; Hexanil; Magnus; Token","Tolfenpirade; Chaser","Clodinafope-Propargil; Topic","Tiofanato-metílico; Cercobin; Support; Topsin","Aminopiralide; Tordon Ultra","Flutriafol; Celeiro; Impact; Skip; Tasker; Tornado; Zoom","Bentiavalicarbe isopropílico; Totalit","Clorotalonil; Cerconil; Cuprodil; Daconil; Glider; Zetanil; Dacobre; Dacostar; Funginil; Ichiban; Isatalonil; Totalit; Zetaran","Etofenproxi; Eleitto; Safety; Trebon","Triadimenol; Baytan; Photon ","Triciclazol; Bim","Tricopir-butolítico; Arbust","Azoxistrobina; Amistar; Elatus; Priori; Unizeb; Agria; Azimut; Priori Xtra; Tridium; Yoda","Triflumizol; Trifimine","Trifloxistrobina; Flint ","Trifloxisulfuron; Envoke","Triflumizol; Trifimine","Triflumurom; Certero; Thorn; Wasp","Trifluralina; Premelin","Ciromazina; Trigard ","Trinexapaque-etílico; Trix","Triticonazol; Premis","Trinexapaque-etílico; Trix","Glifosato; Glyphotal; Roundup; Trop","Ciprodinil; Truzon","Beta-ciflutrina; Bulldock ; Turbo","Clorimurom-etílico; Classic; Panzer; Twister; Clorim; Clorimuron; ","Metribuzim; Sencor; Tenace; Unimark","Azoxistrobina; Amistar; Elatus; Priori; Unizeb; Agria; Azimut; Priori Xtra; Tridium; Yoda","Fluopiram; Verango Prime","Ciproconazol; Alto 100; Aproach; Artea; Sphere max; Verdadeiro","Haloxifope-P-metílico; Verdict-max","Ciantraniliprole; Benevia; Fortenza; Verimark ","Metaflumizone; Alverde; Metaflimizona; Verismo","Fenpropimorfe; Versatilis","Abamectina; Ampligo; Vertimec","Clorpirifós; Klorpan; Losban; Catcher; Nufos; Record; Vexter","Tiram; Anchor; Rhodiauram; Vitavax ","Carboxina; Vitavax Thiram","MSMA; Volcane","Bentazona; Basagran; Doble; Volt","Triflumurom; Certero; Thorn; Wasp","Fluopicolide; Xavante","Piroxassulfona; Yamato","Azoxistrobina; Amistar; Elatus; Priori; Unizeb; Agria; Azimut; Priori Xtra; Tridium; Yoda","Ametoctradina; Zampo","Imazetapir; Zaphir","Metsulfurom-metílico; Accurate; Nufuron; Zartan","Clorotalonil; Cerconil; Cuprodil; Daconil; Glider; Zetanil; Dacobre; Dacostar; Funginil; Ichiban; Isatalonil; Totalit; Zetaran","Clorotalonil; Cerconil; Cuprodil; Daconil; Glider; Zetanil; Dacobre; Dacostar; Funginil; Ichiban; Isatalonil; Totalit; Zetaran","Flumioxazina; Flumyzin; Sumyzin; Zethamaxx","Flutriafol; Celeiro; Impact; Skip; Tasker; Tornado; Zoom","Oxatiapiprolina; Zorvec","Zoxamida"]
["EIQ (<58,33; 58,33 - 94,46; > 94,46)",null,{"v":38.67,"d":"38.7"},{"v":94.33333333333333,"d":"94.3"},{"v":108.16666666666667,"d":"108.2"},{"v":28.666666666666668,"d":"28.7"},{"v":32,"d":"32.0"},{"v":47.333333333333336,"d":"47.3"},{"v":47.333333333333336,"d":"47.3"},{"v":47.333333333333336,"d":"47.3"},{"v":37.666666666666664,"d":"37.7"},{"v":32.666666666666664,"d":"32.7"},{"v":52.666666666666664,"d":"52.7"},{"v":31.666666666666668,"d":"31.7"},{"v":50,"d":"50.0"},{"v":67,"d":"67.0"},{"v":34.333333333333336,"d":"34.3"},{"v":52.333333333333336,"d":"52.3"},{"v":56.666666666666664,"d":"56.7"},{"v":36,"d":"36.0"},{"v":34,"d":"34.0"},{"v":63,"d":"63.0"},48.7,{"v":38.666666666666664,"d":"38.7"},{"v":19.333333333333332,"d":"19.3"},{"v":19.333333333333332,"d":"19.3"},{"v":70.66666666666667,"d":"70.7"},{"v":63,"d":"63.0"},{"v":37.666666666666664,"d":"37.7"},{"v":39.166666666666664,"d":"39.2"},{"v":25.666666666666668,"d":"25.7"},{"v":42,"d":"42.0"},{"v":89.33333333333333,"d":"89.3"},{"v":50.666666666666664,"d":"50.7"},{"v":63,"d":"63.0"},{"v":39.333333333333336,"d":"39.3"},21.5,21.5,null,{"v":38.67,"d":"38.7"},54.5,{"v":63,"d":"63.0"},{"v":56.333333333333336,"d":"56.3"},{"v":108.16666666666667,"d":"108.2"},{"v":75.33333333333333,"d":"75.3"},{"v":39,"d":"39.0"},{"v":32.166666666666664,"d":"32.2"},{"v":74.83333333333333,"d":"74.8"},{"v":54.666666666666664,"d":"54.7"},{"v":89.33333333333333,"d":"89.3"},{"v":59,"d":"59.0"},{"v":40.666666666666664,"d":"40.7"},{"v":48.166666666666664,"d":"48.2"},{"v":42.666666666666664,"d":"42.7"},{"v":89.33333333333333,"d":"89.3"},{"v":41,"d":"41.0"},{"v":41,"d":"41.0"},{"v":30.833333333333332,"d":"30.8"},null,{"v":50,"d":"50.0"},{"v":50,"d":"50.0"},{"v":32.333333333333336,"d":"32.3"},{"v":50,"d":"50.0"},{"v":55,"d":"55.0"},null,{"v":36,"d":"36.0"},{"v":51.333333333333336,"d":"51.3"},{"v":47.333333333333336,"d":"47.3"},{"v":65.33333333333333,"d":"65.3"},{"v":38.666666666666664,"d":"38.7"},{"v":38.666666666666664,"d":"38.7"},{"v":36.333333333333336,"d":"36.3"},{"v":63,"d":"63.0"},{"v":63,"d":"63.0"},{"v":25,"d":"25.0"},{"v":40.333333333333336,"d":"40.3"},{"v":91.33333333333333,"d":"91.3"},{"v":53.833333333333336,"d":"53.8"},60.5,{"v":86,"d":"86.0"},{"v":41.333333333333336,"d":"41.3"},{"v":60.666666666666664,"d":"60.7"},{"v":57.833333333333336,"d":"57.8"},{"v":70,"d":"70.0"},{"v":70,"d":"70.0"},{"v":25,"d":"25.0"},{"v":43,"d":"43.0"},{"v":64,"d":"64.0"},{"v":70.66666666666667,"d":"70.7"},{"v":50.666666666666664,"d":"50.7"},{"v":22,"d":"22.0"},69.5,69.5,{"v":47.333333333333336,"d":"47.3"},{"v":52.666666666666664,"d":"52.7"},{"v":23,"d":"23.0"},69.5,{"v":30.666666666666668,"d":"30.7"},{"v":59.666666666666664,"d":"59.7"},{"v":31.666666666666668,"d":"31.7"},{"v":51,"d":"51.0"},{"v":51,"d":"51.0"},{"v":74.66666666666667,"d":"74.7"},{"v":74.66666666666667,"d":"74.7"},{"v":53.833333333333336,"d":"53.8"},{"v":33.333333333333336,"d":"33.3"},{"v":53.57,"d":"53.6"},{"v":75.66666666666667,"d":"75.7"},{"v":50.666666666666664,"d":"50.7"},{"v":34.666666666666664,"d":"34.7"},{"v":54.666666666666664,"d":"54.7"},{"v":51.333333333333336,"d":"51.3"},{"v":143.16666666666666,"d":"143.2"},{"v":44,"d":"44.0"},54.5,{"v":50.333333333333336,"d":"50.3"},{"v":74.66666666666667,"d":"74.7"},{"v":51.166666666666664,"d":"51.2"},{"v":51.166666666666664,"d":"51.2"},{"v":74,"d":"74.0"},69.5,{"v":58,"d":"58.0"},{"v":60.666666666666664,"d":"60.7"},{"v":60.666666666666664,"d":"60.7"},{"v":33,"d":"33.0"},{"v":60.666666666666664,"d":"60.7"},{"v":68.66666666666667,"d":"68.7"},{"v":40.666666666666664,"d":"40.7"},{"v":36,"d":"36.0"},null,null,{"v":70.66666666666667,"d":"70.7"},{"v":43,"d":"43.0"},{"v":87.16666666666667,"d":"87.2"},{"v":47.333333333333336,"d":"47.3"},{"v":118,"d":"118.0"},{"v":37.666666666666664,"d":"37.7"},{"v":37.333333333333336,"d":"37.3"},{"v":62.333333333333336,"d":"62.3"},{"v":47.333333333333336,"d":"47.3"},{"v":56.666666666666664,"d":"56.7"},{"v":55,"d":"55.0"},{"v":42.666666666666664,"d":"42.7"},{"v":31.666666666666668,"d":"31.7"},{"v":57.833333333333336,"d":"57.8"},{"v":50.666666666666664,"d":"50.7"},{"v":101.66666666666667,"d":"101.7"},{"v":26.666666666666668,"d":"26.7"},{"v":49,"d":"49.0"},{"v":39,"d":"39.0"},{"v":33,"d":"33.0"},{"v":63,"d":"63.0"},{"v":89.33333333333333,"d":"89.3"},{"v":56.666666666666664,"d":"56.7"},{"v":61.833333333333336,"d":"61.8"},{"v":36.166666666666664,"d":"36.2"},{"v":37.333333333333336,"d":"37.3"},{"v":29.333333333333332,"d":"29.3"},{"v":34,"d":"34.0"},{"v":22.666666666666668,"d":"22.7"},{"v":42,"d":"42.0"},null,{"v":30.833333333333332,"d":"30.8"},{"v":64,"d":"64.0"},{"v":36.166666666666664,"d":"36.2"},{"v":36.166666666666664,"d":"36.2"},{"v":36.166666666666664,"d":"36.2"},{"v":47.333333333333336,"d":"47.3"},{"v":87.16666666666667,"d":"87.2"},{"v":115.33333333333333,"d":"115.3"},{"v":67,"d":"67.0"},{"v":63,"d":"63.0"},{"v":56.666666666666664,"d":"56.7"},{"v":75.66666666666667,"d":"75.7"},{"v":70,"d":"70.0"},{"v":50,"d":"50.0"},{"v":22.333333333333332,"d":"22.3"},{"v":59.666666666666664,"d":"59.7"},{"v":102.66666666666667,"d":"102.7"},{"v":50,"d":"50.0"},50.5,{"v":70,"d":"70.0"},{"v":34.333333333333336,"d":"34.3"},{"v":47.333333333333336,"d":"47.3"},{"v":49.666666666666664,"d":"49.7"},{"v":50,"d":"50.0"},{"v":47.333333333333336,"d":"47.3"},{"v":47.333333333333336,"d":"47.3"},{"v":47.333333333333336,"d":"47.3"},{"v":51,"d":"51.0"},{"v":40.333333333333336,"d":"40.3"},{"v":67.33333333333333,"d":"67.3"},{"v":55,"d":"55.0"},{"v":67.33333333333333,"d":"67.3"},{"v":42,"d":"42.0"},{"v":60.666666666666664,"d":"60.7"},{"v":60.666666666666664,"d":"60.7"},{"v":33,"d":"33.0"},{"v":47,"d":"47.0"},42.5,{"v":54.333333333333336,"d":"54.3"},{"v":29.666666666666668,"d":"29.7"},{"v":64.66666666666667,"d":"64.7"},{"v":65.33333333333333,"d":"65.3"},{"v":65.33333333333333,"d":"65.3"},52.5,{"v":56,"d":"56.0"},52.5,{"v":65.33333333333333,"d":"65.3"},null,{"v":90.66666666666667,"d":"90.7"},{"v":52.333333333333336,"d":"52.3"},{"v":46.166666666666664,"d":"46.2"},{"v":46,"d":"46.0"},{"v":55,"d":"55.0"},{"v":46.166666666666664,"d":"46.2"},{"v":38.67,"d":"38.7"},{"v":25,"d":"25.0"},{"v":39.666666666666664,"d":"39.7"},{"v":39.666666666666664,"d":"39.7"},null,{"v":36.166666666666664,"d":"36.2"},50.5,{"v":63,"d":"63.0"},{"v":40.333333333333336,"d":"40.3"},{"v":59,"d":"59.0"},{"v":34.333333333333336,"d":"34.3"},{"v":46,"d":"46.0"},{"v":32.666666666666664,"d":"32.7"},{"v":29.666666666666668,"d":"29.7"},{"v":94.33333333333333,"d":"94.3"},{"v":33,"d":"33.0"},{"v":88,"d":"88.0"},{"v":29,"d":"29.0"},{"v":54.333333333333336,"d":"54.3"},{"v":56,"d":"56.0"},{"v":45.666666666666664,"d":"45.7"},{"v":68.33333333333333,"d":"68.3"},{"v":46,"d":"46.0"},{"v":40.666666666666664,"d":"40.7"},{"v":40.333333333333336,"d":"40.3"},{"v":36.666666666666664,"d":"36.7"},{"v":35,"d":"35.0"},null,{"v":47.333333333333336,"d":"47.3"},{"v":45.666666666666664,"d":"45.7"},{"v":44.666666666666664,"d":"44.7"},{"v":50,"d":"50.0"},{"v":50,"d":"50.0"},{"v":45.333333333333336,"d":"45.3"},{"v":88,"d":"88.0"},{"v":27.666666666666668,"d":"27.7"},{"v":63,"d":"63.0"},{"v":37.666666666666664,"d":"37.7"},{"v":89.33333333333333,"d":"89.3"},{"v":30.333333333333332,"d":"30.3"},{"v":52,"d":"52.0"},{"v":57,"d":"57.0"},{"v":51,"d":"51.0"},{"v":36.666666666666664,"d":"36.7"},{"v":78.83333333333333,"d":"78.8"},{"v":66.33333333333333,"d":"66.3"},{"v":27.666666666666668,"d":"27.7"},{"v":80,"d":"80.0"},{"v":64.66666666666667,"d":"64.7"},{"v":52.333333333333336,"d":"52.3"},{"v":49.166666666666664,"d":"49.2"},{"v":54,"d":"54.0"},{"v":33,"d":"33.0"},{"v":32.166666666666664,"d":"32.2"},{"v":36.666666666666664,"d":"36.7"},{"v":56.666666666666664,"d":"56.7"},60.5,{"v":55,"d":"55.0"},{"v":70.66666666666667,"d":"70.7"},{"v":23.666666666666668,"d":"23.7"},{"v":23.333333333333332,"d":"23.3"},{"v":46.333333333333336,"d":"46.3"},{"v":46.333333333333336,"d":"46.3"},{"v":64.33333333333333,"d":"64.3"},{"v":65,"d":"65.0"},{"v":69,"d":"69.0"},null,{"v":42.666666666666664,"d":"42.7"},{"v":57.333333333333336,"d":"57.3"},{"v":118,"d":"118.0"},{"v":65,"d":"65.0"},50.5,48.7,48.7,{"v":49.166666666666664,"d":"49.2"},{"v":29,"d":"29.0"},{"v":57.833333333333336,"d":"57.8"},{"v":56,"d":"56.0"},{"v":37.666666666666664,"d":"37.7"},null,{"v":47.666666666666664,"d":"47.7"},{"v":49,"d":"49.0"},{"v":49.333333333333336,"d":"49.3"},{"v":56.666666666666664,"d":"56.7"},{"v":60.666666666666664,"d":"60.7"},{"v":47.333333333333336,"d":"47.3"},{"v":63,"d":"63.0"},50.5,{"v":49.166666666666664,"d":"49.2"},{"v":36.666666666666664,"d":"36.7"},{"v":74,"d":"74.0"},{"v":41.333333333333336,"d":"41.3"},{"v":36.666666666666664,"d":"36.7"},{"v":78.83333333333333,"d":"78.8"},{"v":49.666666666666664,"d":"49.7"},{"v":32.166666666666664,"d":"32.2"},null,{"v":50.666666666666664,"d":"50.7"},21.5,{"v":50,"d":"50.0"},{"v":35,"d":"35.0"},{"v":47.333333333333336,"d":"47.3"},{"v":41.333333333333336,"d":"41.3"},{"v":27.666666666666668,"d":"27.7"},{"v":41.333333333333336,"d":"41.3"},{"v":34,"d":"34.0"},{"v":54.333333333333336,"d":"54.3"},{"v":52.666666666666664,"d":"52.7"},{"v":36.333333333333336,"d":"36.3"},{"v":42.666666666666664,"d":"42.7"},{"v":29.333333333333332,"d":"29.3"},{"v":19.333333333333332,"d":"19.3"},{"v":50.666666666666664,"d":"50.7"},{"v":30.666666666666668,"d":"30.7"},{"v":101.66666666666667,"d":"101.7"},{"v":37,"d":"37.0"},{"v":68.66666666666667,"d":"68.7"},21.5,{"v":63,"d":"63.0"},null,null,{"v":54,"d":"54.0"},{"v":50,"d":"50.0"},{"v":69.83333333333333,"d":"69.8"},{"v":40.666666666666664,"d":"40.7"},{"v":47.333333333333336,"d":"47.3"},{"v":80,"d":"80.0"},{"v":80,"d":"80.0"},{"v":75.33333333333333,"d":"75.3"},null,{"v":22.333333333333332,"d":"22.3"},{"v":62.666666666666664,"d":"62.7"},25.5,{"v":27.666666666666668,"d":"27.7"},{"v":70,"d":"70.0"},{"v":47.666666666666664,"d":"47.7"},{"v":118,"d":"118.0"},null,{"v":74.83333333333333,"d":"74.8"},{"v":39.166666666666664,"d":"39.2"},{"v":65.33333333333333,"d":"65.3"},{"v":64,"d":"64.0"},69.5,{"v":52.666666666666664,"d":"52.7"},{"v":26.666666666666668,"d":"26.7"},{"v":40.666666666666664,"d":"40.7"},{"v":64.33333333333333,"d":"64.3"},{"v":55,"d":"55.0"},{"v":47.333333333333336,"d":"47.3"},49.5,{"v":26.333333333333332,"d":"26.3"},{"v":61.333333333333336,"d":"61.3"},{"v":67.33333333333333,"d":"67.3"},{"v":67.33333333333333,"d":"67.3"},{"v":32.666666666666664,"d":"32.7"},{"v":22,"d":"22.0"},{"v":69.83333333333333,"d":"69.8"},{"v":46.166666666666664,"d":"46.2"},{"v":43,"d":"43.0"},{"v":52.333333333333336,"d":"52.3"},{"v":41,"d":"41.0"},49.5,{"v":51,"d":"51.0"},{"v":87.16666666666667,"d":"87.2"},{"v":33.333333333333336,"d":"33.3"},{"v":29.666666666666668,"d":"29.7"},{"v":19.333333333333332,"d":"19.3"},null,{"v":69.83333333333333,"d":"69.8"},{"v":53.833333333333336,"d":"53.8"},{"v":74,"d":"74.0"},{"v":51.333333333333336,"d":"51.3"},{"v":27.666666666666668,"d":"27.7"},{"v":56.666666666666664,"d":"56.7"},{"v":87.16666666666667,"d":"87.2"},{"v":49.666666666666664,"d":"49.7"},{"v":80,"d":"80.0"},null,{"v":40,"d":"40.0"},{"v":27.666666666666668,"d":"27.7"},{"v":46,"d":"46.0"},{"v":46,"d":"46.0"},{"v":26.333333333333332,"d":"26.3"},{"v":46,"d":"46.0"},{"v":68.66666666666667,"d":"68.7"},{"v":49.666666666666664,"d":"49.7"},{"v":32,"d":"32.0"},{"v":55,"d":"55.0"},{"v":90.66666666666667,"d":"90.7"},{"v":38.666666666666664,"d":"38.7"},{"v":86,"d":"86.0"},{"v":51,"d":"51.0"},{"v":51.166666666666664,"d":"51.2"},{"v":69.83333333333333,"d":"69.8"},{"v":44,"d":"44.0"},{"v":50.666666666666664,"d":"50.7"},{"v":50.666666666666664,"d":"50.7"},{"v":32,"d":"32.0"},{"v":34.666666666666664,"d":"34.7"},{"v":62,"d":"62.0"},{"v":77.33333333333333,"d":"77.3"},{"v":46.666666666666664,"d":"46.7"},{"v":36.166666666666664,"d":"36.2"},{"v":53.833333333333336,"d":"53.8"},{"v":52.666666666666664,"d":"52.7"},{"v":44.666666666666664,"d":"44.7"},{"v":39.166666666666664,"d":"39.2"},{"v":32,"d":"32.0"},{"v":76.66666666666667,"d":"76.7"},{"v":43.666666666666664,"d":"43.7"},{"v":63,"d":"63.0"},null,{"v":35.333333333333336,"d":"35.3"},{"v":57.333333333333336,"d":"57.3"},null,null,50.5,{"v":68.33333333333333,"d":"68.3"},{"v":28.666666666666668,"d":"28.7"},{"v":74.83333333333333,"d":"74.8"},{"v":40,"d":"40.0"},{"v":36.666666666666664,"d":"36.7"},{"v":87.16666666666667,"d":"87.2"},{"v":32,"d":"32.0"},{"v":40.666666666666664,"d":"40.7"},{"v":39,"d":"39.0"},{"v":61,"d":"61.0"},{"v":62.666666666666664,"d":"62.7"},null,{"v":94.33333333333333,"d":"94.3"},{"v":62,"d":"62.0"},{"v":65,"d":"65.0"},{"v":47.333333333333336,"d":"47.3"},{"v":51.166666666666664,"d":"51.2"},{"v":41,"d":"41.0"},{"v":57,"d":"57.0"},{"v":48.666666666666664,"d":"48.7"},{"v":51.833333333333336,"d":"51.8"},{"v":44.333333333333336,"d":"44.3"},{"v":34,"d":"34.0"},{"v":22.666666666666668,"d":"22.7"},{"v":31.666666666666668,"d":"31.7"},{"v":36.166666666666664,"d":"36.2"},{"v":54.333333333333336,"d":"54.3"},{"v":27.666666666666668,"d":"27.7"},{"v":35.333333333333336,"d":"35.3"},{"v":68.66666666666667,"d":"68.7"},{"v":37.333333333333336,"d":"37.3"},{"v":66.33333333333333,"d":"66.3"},{"v":91.33333333333333,"d":"91.3"},{"v":50.333333333333336,"d":"50.3"},{"v":59,"d":"59.0"},{"v":63,"d":"63.0"},{"v":36.666666666666664,"d":"36.7"},{"v":31.666666666666668,"d":"31.7"},{"v":67,"d":"67.0"},null,{"v":56,"d":"56.0"},{"v":61,"d":"61.0"},{"v":54.333333333333336,"d":"54.3"},{"v":52.666666666666664,"d":"52.7"},{"v":59.666666666666664,"d":"59.7"},null,30.5,{"v":28,"d":"28.0"},{"v":30.333333333333332,"d":"30.3"},{"v":33,"d":"33.0"},{"v":46.666666666666664,"d":"46.7"},{"v":115.33333333333333,"d":"115.3"},{"v":51,"d":"51.0"},{"v":37.333333333333336,"d":"37.3"},{"v":70,"d":"70.0"},{"v":54,"d":"54.0"},{"v":42,"d":"42.0"},{"v":80.66666666666667,"d":"80.7"},{"v":23.666666666666668,"d":"23.7"},{"v":50,"d":"50.0"},{"v":50,"d":"50.0"},{"v":50,"d":"50.0"},{"v":50,"d":"50.0"},{"v":50,"d":"50.0"},{"v":63,"d":"63.0"},{"v":63,"d":"63.0"},{"v":64.66666666666667,"d":"64.7"},{"v":59.666666666666664,"d":"59.7"},{"v":54,"d":"54.0"},{"v":64,"d":"64.0"},{"v":50,"d":"50.0"},null,{"v":52,"d":"52.0"},{"v":50.666666666666664,"d":"50.7"},{"v":46,"d":"46.0"},{"v":61,"d":"61.0"},{"v":61.333333333333336,"d":"61.3"},{"v":32.166666666666664,"d":"32.2"},{"v":94.33333333333333,"d":"94.3"},{"v":49.333333333333336,"d":"49.3"},{"v":26.333333333333332,"d":"26.3"},{"v":39.166666666666664,"d":"39.2"},{"v":45.333333333333336,"d":"45.3"},{"v":37.333333333333336,"d":"37.3"},{"v":31.666666666666668,"d":"31.7"},{"v":23.333333333333332,"d":"23.3"},{"v":36,"d":"36.0"},42.5,{"v":64.33333333333333,"d":"64.3"},{"v":47.333333333333336,"d":"47.3"},{"v":30.333333333333332,"d":"30.3"},{"v":75.33333333333333,"d":"75.3"},{"v":37.333333333333336,"d":"37.3"},{"v":34,"d":"34.0"},{"v":87.16666666666667,"d":"87.2"},{"v":80,"d":"80.0"},{"v":52.333333333333336,"d":"52.3"},{"v":23.333333333333332,"d":"23.3"},{"v":26.333333333333332,"d":"26.3"},{"v":39,"d":"39.0"},{"v":46,"d":"46.0"},{"v":36.666666666666664,"d":"36.7"},{"v":23,"d":"23.0"},{"v":48.666666666666664,"d":"48.7"},{"v":54,"d":"54.0"},{"v":41.333333333333336,"d":"41.3"},{"v":55,"d":"55.0"},{"v":50,"d":"50.0"},{"v":143.16666666666666,"d":"143.2"},{"v":40.333333333333336,"d":"40.3"},{"v":37,"d":"37.0"},{"v":61,"d":"61.0"},{"v":28.666666666666668,"d":"28.7"},{"v":36,"d":"36.0"},{"v":64.66666666666667,"d":"64.7"},{"v":23.666666666666668,"d":"23.7"},{"v":37.333333333333336,"d":"37.3"},{"v":30.333333333333332,"d":"30.3"},{"v":74,"d":"74.0"},{"v":29.333333333333332,"d":"29.3"},{"v":44.666666666666664,"d":"44.7"},{"v":36.166666666666664,"d":"36.2"},{"v":28,"d":"28.0"},{"v":58,"d":"58.0"},{"v":32.333333333333336,"d":"32.3"},{"v":69,"d":"69.0"},{"v":118,"d":"118.0"},{"v":36.666666666666664,"d":"36.7"},{"v":23,"d":"23.0"},{"v":51,"d":"51.0"},{"v":70,"d":"70.0"},69.5,{"v":89.33333333333333,"d":"89.3"},{"v":29.666666666666668,"d":"29.7"},{"v":51.333333333333336,"d":"51.3"},{"v":74.66666666666667,"d":"74.7"},{"v":36,"d":"36.0"},{"v":78.83333333333333,"d":"78.8"},{"v":46,"d":"46.0"},{"v":80,"d":"80.0"},null,69.5,{"v":28.666666666666668,"d":"28.7"},{"v":61.333333333333336,"d":"61.3"},null,{"v":39.333333333333336,"d":"39.3"},{"v":51,"d":"51.0"},null,{"v":25.666666666666668,"d":"25.7"},{"v":44.666666666666664,"d":"44.7"},{"v":56,"d":"56.0"},{"v":89.33333333333333,"d":"89.3"},{"v":89.33333333333333,"d":"89.3"},{"v":54,"d":"54.0"},{"v":54,"d":"54.0"},{"v":89.33333333333333,"d":"89.3"},{"v":46.333333333333336,"d":"46.3"},{"v":62.333333333333336,"d":"62.3"},{"v":77.33333333333333,"d":"77.3"},{"v":32.666666666666664,"d":"32.7"},{"v":76.66666666666667,"d":"76.7"},{"v":54,"d":"54.0"},69.5,69.5,{"v":37.333333333333336,"d":"37.3"},{"v":118,"d":"118.0"},50.5,50.5,{"v":43.666666666666664,"d":"43.7"},{"v":51.333333333333336,"d":"51.3"},{"v":60.666666666666664,"d":"60.7"},{"v":74.83333333333333,"d":"74.8"},{"v":23,"d":"23.0"},{"v":44.666666666666664,"d":"44.7"},{"v":40.666666666666664,"d":"40.7"},{"v":102.66666666666667,"d":"102.7"},{"v":47.333333333333336,"d":"47.3"},{"v":47.333333333333336,"d":"47.3"},null,{"v":59,"d":"59.0"},{"v":42.666666666666664,"d":"42.7"},{"v":56.666666666666664,"d":"56.7"},{"v":71.33333333333333,"d":"71.3"},54.5,{"v":34.333333333333336,"d":"34.3"},{"v":52.333333333333336,"d":"52.3"},{"v":59.666666666666664,"d":"59.7"},{"v":61.333333333333336,"d":"61.3"},{"v":74,"d":"74.0"},{"v":62.333333333333336,"d":"62.3"},{"v":39,"d":"39.0"},{"v":54.333333333333336,"d":"54.3"},null,{"v":42.666666666666664,"d":"42.7"},{"v":29.333333333333332,"d":"29.3"},{"v":62.333333333333336,"d":"62.3"},54.5,{"v":118,"d":"118.0"},{"v":43,"d":"43.0"},{"v":47.333333333333336,"d":"47.3"},{"v":40.333333333333336,"d":"40.3"},{"v":91.33333333333333,"d":"91.3"},{"v":47.333333333333336,"d":"47.3"},{"v":48.166666666666664,"d":"48.2"},{"v":63,"d":"63.0"},null,{"v":54,"d":"54.0"},{"v":32.666666666666664,"d":"32.7"},null,{"v":56.666666666666664,"d":"56.7"},{"v":54,"d":"54.0"},{"v":61.833333333333336,"d":"61.8"},{"v":17.666666666666668,"d":"17.7"},{"v":80.66666666666667,"d":"80.7"},{"v":17.666666666666668,"d":"17.7"},{"v":41.333333333333336,"d":"41.3"},{"v":56.666666666666664,"d":"56.7"},{"v":50.666666666666664,"d":"50.7"},{"v":36.166666666666664,"d":"36.2"},{"v":44.666666666666664,"d":"44.7"},{"v":63,"d":"63.0"},{"v":65,"d":"65.0"},{"v":89.33333333333333,"d":"89.3"},{"v":19.333333333333332,"d":"19.3"},{"v":57.833333333333336,"d":"57.8"},{"v":50.666666666666664,"d":"50.7"},{"v":36.666666666666664,"d":"36.7"},{"v":108.16666666666667,"d":"108.2"},{"v":87.16666666666667,"d":"87.2"},{"v":39,"d":"39.0"},{"v":40.666666666666664,"d":"40.7"},null,{"v":25,"d":"25.0"},{"v":56.666666666666664,"d":"56.7"},{"v":64.33333333333333,"d":"64.3"},30.5,{"v":63,"d":"63.0"},{"v":39.333333333333336,"d":"39.3"},25.5,{"v":32,"d":"32.0"},{"v":47.333333333333336,"d":"47.3"},{"v":47.333333333333336,"d":"47.3"},{"v":46.333333333333336,"d":"46.3"},{"v":118,"d":"118.0"},{"v":51.833333333333336,"d":"51.8"},{"v":26,"d":"26.0"}]
["EIQ Impacto trabalhador rural (<  80; 80 - 128; > 128)",null,{"v":90,"d":"90.0"},{"v":100,"d":"100.0"},{"v":150,"d":"150.0"},{"v":48,"d":"48.0"},{"v":64,"d":"64.0"},{"v":40,"d":"40.0"},{"v":40,"d":"40.0"},{"v":40,"d":"40.0"},{"v":32,"d":"32.0"},{"v":60,"d":"60.0"},{"v":80,"d":"80.0"},{"v":48,"d":"48.0"},{"v":56,"d":"56.0"},{"v":80,"d":"80.0"},{"v":28,"d":"28.0"},{"v":100,"d":"100.0"},{"v":80,"d":"80.0"},{"v":64,"d":"64.0"},{"v":56,"d":"56.0"},{"v":72,"d":"72.0"},{"v":90,"d":"90.0"},{"v":64,"d":"64.0"},{"v":24,"d":"24.0"},{"v":24,"d":"24.0"},{"v":64,"d":"64.0"},{"v":80,"d":"80.0"},{"v":64,"d":"64.0"},{"v":60,"d":"60.0"},{"v":36,"d":"36.0"},{"v":48,"d":"48.0"},{"v":100,"d":"100.0"},{"v":60,"d":"60.0"},{"v":80,"d":"80.0"},{"v":64,"d":"64.0"},{"v":24,"d":"24.0"},{"v":24,"d":"24.0"},null,{"v":90,"d":"90.0"},{"v":80,"d":"80.0"},{"v":72,"d":"72.0"},{"v":120,"d":"120.0"},{"v":150,"d":"150.0"},{"v":80,"d":"80.0"},{"v":64,"d":"64.0"},{"v":56,"d":"56.0"},{"v":80,"d":"80.0"},{"v":72,"d":"72.0"},{"v":100,"d":"100.0"},{"v":72,"d":"72.0"},{"v":80,"d":"80.0"},{"v":90,"d":"90.0"},{"v":80,"d":"80.0"},{"v":100,"d":"100.0"},{"v":80,"d":"80.0"},{"v":80,"d":"80.0"},{"v":48,"d":"48.0"},null,{"v":80,"d":"80.0"},{"v":80,"d":"80.0"},{"v":60,"d":"60.0"},{"v":80,"d":"80.0"},{"v":90,"d":"90.0"},null,{"v":64,"d":"64.0"},{"v":64,"d":"64.0"},{"v":40,"d":"40.0"},{"v":70,"d":"70.0"},{"v":56,"d":"56.0"},{"v":56,"d":"56.0"},{"v":64,"d":"64.0"},{"v":72,"d":"72.0"},{"v":72,"d":"72.0"},{"v":32,"d":"32.0"},{"v":72,"d":"72.0"},{"v":100,"d":"100.0"},{"v":70,"d":"70.0"},{"v":70,"d":"70.0"},{"v":72,"d":"72.0"},{"v":56,"d":"56.0"},{"v":80,"d":"80.0"},{"v":40,"d":"40.0"},{"v":80,"d":"80.0"},{"v":80,"d":"80.0"},{"v":32,"d":"32.0"},{"v":80,"d":"80.0"},{"v":72,"d":"72.0"},{"v":64,"d":"64.0"},{"v":60,"d":"60.0"},{"v":32,"d":"32.0"},{"v":80,"d":"80.0"},{"v":80,"d":"80.0"},{"v":40,"d":"40.0"},{"v":80,"d":"80.0"},{"v":32,"d":"32.0"},{"v":80,"d":"80.0"},{"v":32,"d":"32.0"},{"v":80,"d":"80.0"},{"v":48,"d":"48.0"},{"v":48,"d":"48.0"},{"v":80,"d":"80.0"},{"v":72,"d":"72.0"},{"v":72,"d":"72.0"},{"v":70,"d":"70.0"},{"v":48,"d":"48.0"},{"v":74,"d":"74.0"},{"v":80,"d":"80.0"},{"v":60,"d":"60.0"},{"v":60,"d":"60.0"},{"v":72,"d":"72.0"},{"v":64,"d":"64.0"},{"v":250,"d":"250.0"},{"v":80,"d":"80.0"},{"v":90,"d":"90.0"},{"v":90,"d":"90.0"},{"v":72,"d":"72.0"},{"v":90,"d":"90.0"},{"v":90,"d":"90.0"},{"v":100,"d":"100.0"},{"v":80,"d":"80.0"},{"v":80,"d":"80.0"},{"v":80,"d":"80.0"},{"v":80,"d":"80.0"},{"v":56,"d":"56.0"},{"v":80,"d":"80.0"},{"v":70,"d":"70.0"},{"v":64,"d":"64.0"},{"v":64,"d":"64.0"},null,null,{"v":100,"d":"100.0"},{"v":80,"d":"80.0"},{"v":105,"d":"105.0"},{"v":40,"d":"40.0"},{"v":150,"d":"150.0"},{"v":56,"d":"56.0"},{"v":64,"d":"64.0"},{"v":100,"d":"100.0"},{"v":80,"d":"80.0"},{"v":80,"d":"80.0"},{"v":90,"d":"90.0"},{"v":32,"d":"32.0"},{"v":60,"d":"60.0"},{"v":40,"d":"40.0"},{"v":80,"d":"80.0"},{"v":80,"d":"80.0"},{"v":32,"d":"32.0"},{"v":90,"d":"90.0"},{"v":64,"d":"64.0"},{"v":60,"d":"60.0"},{"v":80,"d":"80.0"},{"v":100,"d":"100.0"},{"v":72,"d":"72.0"},{"v":100,"d":"100.0"},{"v":64,"d":"64.0"},{"v":64,"d":"64.0"},{"v":48,"d":"48.0"},{"v":60,"d":"60.0"},{"v":32,"d":"32.0"},{"v":48,"d":"48.0"},null,{"v":48,"d":"48.0"},{"v":90,"d":"90.0"},{"v":64,"d":"64.0"},{"v":64,"d":"64.0"},{"v":64,"d":"64.0"},{"v":80,"d":"80.0"},{"v":105,"d":"105.0"},{"v":100,"d":"100.0"},{"v":80,"d":"80.0"},{"v":80,"d":"80.0"},{"v":64,"d":"64.0"},{"v":80,"d":"80.0"},{"v":60,"d":"60.0"},{"v":64,"d":"64.0"},{"v":32,"d":"32.0"},{"v":80,"d":"80.0"},{"v":200,"d":"200.0"},{"v":80,"d":"80.0"},{"v":70,"d":"70.0"},{"v":60,"d":"60.0"},{"v":28,"d":"28.0"},{"v":80,"d":"80.0"},{"v":72,"d":"72.0"},{"v":90,"d":"90.0"},{"v":80,"d":"80.0"},{"v":80,"d":"80.0"},{"v":80,"d":"80.0"},{"v":48,"d":"48.0"},{"v":72,"d":"72.0"},{"v":80,"d":"80.0"},{"v":80,"d":"80.0"},{"v":80,"d":"80.0"},{"v":48,"d":"48.0"},{"v":80,"d":"80.0"},{"v":80,"d":"80.0"},{"v":28,"d":"28.0"},{"v":32,"d":"32.0"},{"v":72,"d":"72.0"},{"v":64,"d":"64.0"},{"v":32,"d":"32.0"},{"v":72,"d":"72.0"},{"v":100,"d":"100.0"},{"v":100,"d":"100.0"},{"v":70,"d":"70.0"},{"v":64,"d":"64.0"},{"v":70,"d":"70.0"},{"v":100,"d":"100.0"},null,{"v":72,"d":"72.0"},{"v":48,"d":"48.0"},{"v":60,"d":"60.0"},{"v":80,"d":"80.0"},{"v":80,"d":"80.0"},{"v":60,"d":"60.0"},{"v":90,"d":"90.0"},{"v":32,"d":"32.0"},{"v":56,"d":"56.0"},{"v":56,"d":"56.0"},null,{"v":30,"d":"30.0"},{"v":70,"d":"70.0"},{"v":72,"d":"72.0"},{"v":60,"d":"60.0"},{"v":64,"d":"64.0"},{"v":28,"d":"28.0"},{"v":72,"d":"72.0"},{"v":32,"d":"32.0"},{"v":32,"d":"32.0"},{"v":100,"d":"100.0"},{"v":60,"d":"60.0"},{"v":80,"d":"80.0"},{"v":32,"d":"32.0"},{"v":64,"d":"64.0"},{"v":60,"d":"60.0"},{"v":70,"d":"70.0"},{"v":80,"d":"80.0"},{"v":72,"d":"72.0"},{"v":64,"d":"64.0"},{"v":60,"d":"60.0"},{"v":64,"d":"64.0"},{"v":64,"d":"64.0"},null,{"v":40,"d":"40.0"},{"v":70,"d":"70.0"},{"v":56,"d":"56.0"},{"v":80,"d":"80.0"},{"v":80,"d":"80.0"},{"v":64,"d":"64.0"},{"v":80,"d":"80.0"},{"v":60,"d":"60.0"},{"v":80,"d":"80.0"},{"v":56,"d":"56.0"},{"v":135,"d":"135.0"},{"v":48,"d":"48.0"},{"v":64,"d":"64.0"},{"v":70,"d":"70.0"},{"v":48,"d":"48.0"},{"v":48,"d":"48.0"},{"v":120,"d":"120.0"},{"v":90,"d":"90.0"},{"v":60,"d":"60.0"},{"v":105,"d":"105.0"},{"v":72,"d":"72.0"},{"v":80,"d":"80.0"},{"v":96,"d":"96.0"},{"v":80,"d":"80.0"},{"v":56,"d":"56.0"},{"v":32,"d":"32.0"},{"v":64,"d":"64.0"},{"v":64,"d":"64.0"},{"v":70,"d":"70.0"},{"v":72,"d":"72.0"},{"v":100,"d":"100.0"},{"v":32,"d":"32.0"},{"v":32,"d":"32.0"},{"v":80,"d":"80.0"},{"v":80,"d":"80.0"},{"v":64,"d":"64.0"},{"v":72,"d":"72.0"},{"v":64,"d":"64.0"},null,{"v":80,"d":"80.0"},{"v":40,"d":"40.0"},{"v":150,"d":"150.0"},{"v":72,"d":"72.0"},{"v":70,"d":"70.0"},{"v":90,"d":"90.0"},{"v":90,"d":"90.0"},{"v":96,"d":"96.0"},{"v":32,"d":"32.0"},{"v":40,"d":"40.0"},{"v":64,"d":"64.0"},{"v":64,"d":"64.0"},null,{"v":90,"d":"90.0"},{"v":90,"d":"90.0"},{"v":80,"d":"80.0"},{"v":64,"d":"64.0"},{"v":80,"d":"80.0"},{"v":80,"d":"80.0"},{"v":80,"d":"80.0"},{"v":70,"d":"70.0"},{"v":96,"d":"96.0"},{"v":64,"d":"64.0"},{"v":100,"d":"100.0"},{"v":56,"d":"56.0"},{"v":40,"d":"40.0"},{"v":120,"d":"120.0"},{"v":72,"d":"72.0"},{"v":32,"d":"32.0"},null,{"v":80,"d":"80.0"},{"v":24,"d":"24.0"},{"v":80,"d":"80.0"},{"v":64,"d":"64.0"},{"v":80,"d":"80.0"},{"v":80,"d":"80.0"},{"v":60,"d":"60.0"},{"v":80,"d":"80.0"},{"v":48,"d":"48.0"},{"v":64,"d":"64.0"},{"v":70,"d":"70.0"},{"v":64,"d":"64.0"},{"v":80,"d":"80.0"},{"v":56,"d":"56.0"},{"v":24,"d":"24.0"},{"v":80,"d":"80.0"},{"v":32,"d":"32.0"},{"v":80,"d":"80.0"},{"v":64,"d":"64.0"},{"v":100,"d":"100.0"},{"v":24,"d":"24.0"},{"v":80,"d":"80.0"},null,null,{"v":80,"d":"80.0"},{"v":64,"d":"64.0"},{"v":128,"d":"128.0"},{"v":80,"d":"80.0"},{"v":80,"d":"80.0"},{"v":100,"d":"100.0"},{"v":100,"d":"100.0"},{"v":80,"d":"80.0"},null,{"v":32,"d":"32.0"},{"v":80,"d":"80.0"},{"v":32,"d":"32.0"},{"v":32,"d":"32.0"},{"v":60,"d":"60.0"},{"v":90,"d":"90.0"},{"v":150,"d":"150.0"},null,{"v":80,"d":"80.0"},{"v":60,"d":"60.0"},{"v":70,"d":"70.0"},{"v":90,"d":"90.0"},{"v":80,"d":"80.0"},{"v":64,"d":"64.0"},{"v":32,"d":"32.0"},{"v":80,"d":"80.0"},{"v":80,"d":"80.0"},{"v":90,"d":"90.0"},{"v":80,"d":"80.0"},{"v":80,"d":"80.0"},{"v":48,"d":"48.0"},{"v":80,"d":"80.0"},{"v":80,"d":"80.0"},{"v":80,"d":"80.0"},{"v":60,"d":"60.0"},{"v":32,"d":"32.0"},{"v":84,"d":"84.0"},{"v":60,"d":"60.0"},{"v":80,"d":"80.0"},{"v":80,"d":"80.0"},{"v":80,"d":"80.0"},{"v":80,"d":"80.0"},{"v":80,"d":"80.0"},{"v":105,"d":"105.0"},{"v":48,"d":"48.0"},{"v":32,"d":"32.0"},{"v":24,"d":"24.0"},null,{"v":84,"d":"84.0"},{"v":70,"d":"70.0"},{"v":100,"d":"100.0"},{"v":64,"d":"64.0"},{"v":60,"d":"60.0"},{"v":80,"d":"80.0"},{"v":105,"d":"105.0"},{"v":72,"d":"72.0"},{"v":100,"d":"100.0"},null,{"v":60,"d":"60.0"},{"v":32,"d":"32.0"},{"v":80,"d":"80.0"},{"v":80,"d":"80.0"},{"v":14,"d":"14.0"},{"v":80,"d":"80.0"},{"v":70,"d":"70.0"},{"v":72,"d":"72.0"},{"v":36,"d":"36.0"},{"v":72,"d":"72.0"},{"v":72,"d":"72.0"},{"v":64,"d":"64.0"},{"v":72,"d":"72.0"},{"v":48,"d":"48.0"},{"v":90,"d":"90.0"},{"v":128,"d":"128.0"},{"v":80,"d":"80.0"},{"v":60,"d":"60.0"},{"v":60,"d":"60.0"},{"v":36,"d":"36.0"},{"v":60,"d":"60.0"},{"v":64,"d":"64.0"},{"v":120,"d":"120.0"},{"v":80,"d":"80.0"},{"v":30,"d":"30.0"},{"v":70,"d":"70.0"},{"v":64,"d":"64.0"},{"v":80,"d":"80.0"},{"v":60,"d":"60.0"},{"v":64,"d":"64.0"},{"v":80,"d":"80.0"},{"v":40,"d":"40.0"},{"v":96,"d":"96.0"},null,{"v":48,"d":"48.0"},{"v":40,"d":"40.0"},null,null,{"v":70,"d":"70.0"},{"v":80,"d":"80.0"},{"v":48,"d":"48.0"},{"v":80,"d":"80.0"},{"v":60,"d":"60.0"},{"v":40,"d":"40.0"},{"v":105,"d":"105.0"},{"v":64,"d":"64.0"},{"v":64,"d":"64.0"},{"v":64,"d":"64.0"},{"v":90,"d":"90.0"},{"v":80,"d":"80.0"},null,{"v":100,"d":"100.0"},{"v":64,"d":"64.0"},{"v":72,"d":"72.0"},{"v":40,"d":"40.0"},{"v":90,"d":"90.0"},{"v":80,"d":"80.0"},{"v":70,"d":"70.0"},{"v":60,"d":"60.0"},{"v":64,"d":"64.0"},{"v":64,"d":"64.0"},{"v":48,"d":"48.0"},{"v":32,"d":"32.0"},{"v":60,"d":"60.0"},{"v":64,"d":"64.0"},{"v":64,"d":"64.0"},{"v":60,"d":"60.0"},{"v":48,"d":"48.0"},{"v":100,"d":"100.0"},{"v":64,"d":"64.0"},{"v":90,"d":"90.0"},{"v":100,"d":"100.0"},{"v":90,"d":"90.0"},{"v":72,"d":"72.0"},{"v":96,"d":"96.0"},{"v":64,"d":"64.0"},{"v":60,"d":"60.0"},{"v":80,"d":"80.0"},null,{"v":60,"d":"60.0"},{"v":64,"d":"64.0"},{"v":64,"d":"64.0"},{"v":70,"d":"70.0"},{"v":80,"d":"80.0"},null,{"v":48,"d":"48.0"},{"v":32,"d":"32.0"},{"v":48,"d":"48.0"},{"v":28,"d":"28.0"},{"v":80,"d":"80.0"},{"v":100,"d":"100.0"},{"v":80,"d":"80.0"},{"v":64,"d":"64.0"},{"v":80,"d":"80.0"},{"v":70,"d":"70.0"},{"v":48,"d":"48.0"},{"v":80,"d":"80.0"},{"v":32,"d":"32.0"},{"v":80,"d":"80.0"},{"v":80,"d":"80.0"},{"v":80,"d":"80.0"},{"v":80,"d":"80.0"},{"v":80,"d":"80.0"},{"v":72,"d":"72.0"},{"v":72,"d":"72.0"},{"v":72,"d":"72.0"},{"v":80,"d":"80.0"},{"v":90,"d":"90.0"},{"v":72,"d":"72.0"},{"v":90,"d":"90.0"},null,{"v":64,"d":"64.0"},{"v":80,"d":"80.0"},{"v":80,"d":"80.0"},{"v":90,"d":"90.0"},{"v":80,"d":"80.0"},{"v":56,"d":"56.0"},{"v":100,"d":"100.0"},{"v":80,"d":"80.0"},{"v":48,"d":"48.0"},{"v":60,"d":"60.0"},{"v":64,"d":"64.0"},{"v":60,"d":"60.0"},{"v":60,"d":"60.0"},{"v":32,"d":"32.0"},{"v":64,"d":"64.0"},{"v":72,"d":"72.0"},{"v":80,"d":"80.0"},{"v":40,"d":"40.0"},{"v":48,"d":"48.0"},{"v":80,"d":"80.0"},{"v":64,"d":"64.0"},{"v":60,"d":"60.0"},{"v":105,"d":"105.0"},{"v":105,"d":"105.0"},{"v":48,"d":"48.0"},{"v":32,"d":"32.0"},{"v":14,"d":"14.0"},{"v":64,"d":"64.0"},{"v":80,"d":"80.0"},{"v":40,"d":"40.0"},{"v":32,"d":"32.0"},{"v":60,"d":"60.0"},{"v":90,"d":"90.0"},{"v":80,"d":"80.0"},{"v":90,"d":"90.0"},{"v":56,"d":"56.0"},{"v":250,"d":"250.0"},{"v":60,"d":"60.0"},{"v":64,"d":"64.0"},{"v":64,"d":"64.0"},{"v":48,"d":"48.0"},{"v":64,"d":"64.0"},{"v":72,"d":"72.0"},{"v":32,"d":"32.0"},{"v":64,"d":"64.0"},{"v":48,"d":"48.0"},{"v":100,"d":"100.0"},{"v":56,"d":"56.0"},{"v":80,"d":"80.0"},{"v":30,"d":"30.0"},{"v":32,"d":"32.0"},{"v":80,"d":"80.0"},{"v":60,"d":"60.0"},{"v":64,"d":"64.0"},{"v":150,"d":"150.0"},{"v":64,"d":"64.0"},{"v":48,"d":"48.0"},{"v":80,"d":"80.0"},{"v":60,"d":"60.0"},{"v":80,"d":"80.0"},{"v":100,"d":"100.0"},{"v":32,"d":"32.0"},{"v":64,"d":"64.0"},{"v":72,"d":"72.0"},{"v":64,"d":"64.0"},{"v":120,"d":"120.0"},{"v":80,"d":"80.0"},{"v":105,"d":"105.0"},null,{"v":80,"d":"80.0"},{"v":48,"d":"48.0"},{"v":80,"d":"80.0"},null,{"v":64,"d":"64.0"},{"v":80,"d":"80.0"},null,{"v":36,"d":"36.0"},{"v":56,"d":"56.0"},{"v":60,"d":"60.0"},{"v":135,"d":"135.0"},{"v":135,"d":"135.0"},{"v":90,"d":"90.0"},{"v":90,"d":"90.0"},{"v":135,"d":"135.0"},{"v":80,"d":"80.0"},{"v":100,"d":"100.0"},{"v":120,"d":"120.0"},{"v":60,"d":"60.0"},{"v":80,"d":"80.0"},{"v":80,"d":"80.0"},{"v":80,"d":"80.0"},{"v":80,"d":"80.0"},{"v":60,"d":"60.0"},{"v":150,"d":"150.0"},{"v":70,"d":"70.0"},{"v":70,"d":"70.0"},{"v":40,"d":"40.0"},{"v":64,"d":"64.0"},{"v":80,"d":"80.0"},{"v":80,"d":"80.0"},{"v":48,"d":"48.0"},{"v":80,"d":"80.0"},{"v":80,"d":"80.0"},{"v":200,"d":"200.0"},{"v":64,"d":"64.0"},{"v":64,"d":"64.0"},null,{"v":64,"d":"64.0"},{"v":80,"d":"80.0"},{"v":80,"d":"80.0"},{"v":64,"d":"64.0"},{"v":90,"d":"90.0"},{"v":28,"d":"28.0"},{"v":100,"d":"100.0"},{"v":80,"d":"80.0"},{"v":80,"d":"80.0"},{"v":100,"d":"100.0"},{"v":100,"d":"100.0"},{"v":64,"d":"64.0"},{"v":64,"d":"64.0"},null,{"v":32,"d":"32.0"},{"v":48,"d":"48.0"},{"v":100,"d":"100.0"},{"v":80,"d":"80.0"},{"v":150,"d":"150.0"},{"v":80,"d":"80.0"},{"v":80,"d":"80.0"},{"v":60,"d":"60.0"},{"v":100,"d":"100.0"},{"v":40,"d":"40.0"},{"v":90,"d":"90.0"},{"v":72,"d":"72.0"},null,{"v":80,"d":"80.0"},{"v":32,"d":"32.0"},null,{"v":80,"d":"80.0"},{"v":70,"d":"70.0"},{"v":100,"d":"100.0"},{"v":24,"d":"24.0"},{"v":80,"d":"80.0"},{"v":24,"d":"24.0"},{"v":80,"d":"80.0"},{"v":72,"d":"72.0"},{"v":60,"d":"60.0"},{"v":64,"d":"64.0"},{"v":80,"d":"80.0"},{"v":72,"d":"72.0"},{"v":72,"d":"72.0"},{"v":100,"d":"100.0"},{"v":24,"d":"24.0"},{"v":40,"d":"40.0"},{"v":60,"d":"60.0"},{"v":48,"d":"48.0"},{"v":150,"d":"150.0"},{"v":105,"d":"105.0"},{"v":64,"d":"64.0"},{"v":64,"d":"64.0"},null,{"v":32,"d":"32.0"},{"v":80,"d":"80.0"},{"v":64,"d":"64.0"},{"v":48,"d":"48.0"},{"v":72,"d":"72.0"},{"v":64,"d":"64.0"},{"v":32,"d":"32.0"},{"v":64,"d":"64.0"},{"v":80,"d":"80.0"},{"v":80,"d":"80.0"},{"v":80,"d":"80.0"},{"v":150,"d":"150.0"},{"v":64,"d":"64.0"},{"v":32,"d":"32.0"}]
["EIQ Impacto consumidor (< 20,5; 20,5 - 36,25; > 36,25)",null,{"v":9,"d":"9.0"},{"v":77,"d":"77.0"},19.5,{"v":10,"d":"10.0"},{"v":11,"d":"11.0"},{"v":33,"d":"33.0"},{"v":33,"d":"33.0"},{"v":33,"d":"33.0"},{"v":15,"d":"15.0"},{"v":8,"d":"8.0"},{"v":32,"d":"32.0"},{"v":11,"d":"11.0"},{"v":9,"d":"9.0"},{"v":47,"d":"47.0"},{"v":19,"d":"19.0"},{"v":20,"d":"20.0"},{"v":18,"d":"18.0"},{"v":11,"d":"11.0"},{"v":20,"d":"20.0"},{"v":45,"d":"45.0"},15.5,{"v":12,"d":"12.0"},{"v":7,"d":"7.0"},{"v":7,"d":"7.0"},{"v":50,"d":"50.0"},13.5,{"v":29,"d":"29.0"},15.5,{"v":10,"d":"10.0"},{"v":39,"d":"39.0"},70.5,13.5,13.5,{"v":10,"d":"10.0"},{"v":6,"d":"6.0"},{"v":6,"d":"6.0"},null,{"v":9,"d":"9.0"},{"v":18,"d":"18.0"},{"v":45,"d":"45.0"},{"v":13,"d":"13.0"},19.5,{"v":64,"d":"64.0"},{"v":11,"d":"11.0"},{"v":9,"d":"9.0"},{"v":55,"d":"55.0"},{"v":16,"d":"16.0"},70.5,{"v":39,"d":"39.0"},{"v":14,"d":"14.0"},16.5,{"v":14,"d":"14.0"},70.5,{"v":13,"d":"13.0"},{"v":13,"d":"13.0"},{"v":8,"d":"8.0"},null,{"v":19,"d":"19.0"},{"v":19,"d":"19.0"},{"v":13,"d":"13.0"},{"v":19,"d":"19.0"},{"v":18,"d":"18.0"},null,{"v":11,"d":"11.0"},{"v":20,"d":"20.0"},{"v":33,"d":"33.0"},{"v":17,"d":"17.0"},{"v":21,"d":"21.0"},{"v":21,"d":"21.0"},{"v":16,"d":"16.0"},{"v":45,"d":"45.0"},{"v":45,"d":"45.0"},{"v":9,"d":"9.0"},{"v":8,"d":"8.0"},{"v":78,"d":"78.0"},26.5,19.5,{"v":56,"d":"56.0"},{"v":26,"d":"26.0"},39.5,{"v":24,"d":"24.0"},{"v":32,"d":"32.0"},{"v":32,"d":"32.0"},{"v":9,"d":"9.0"},{"v":13,"d":"13.0"},{"v":13,"d":"13.0"},{"v":50,"d":"50.0"},8.5,{"v":9,"d":"9.0"},13.5,13.5,{"v":33,"d":"33.0"},{"v":32,"d":"32.0"},{"v":7,"d":"7.0"},13.5,{"v":13,"d":"13.0"},{"v":37,"d":"37.0"},{"v":11,"d":"11.0"},{"v":7,"d":"7.0"},{"v":24,"d":"24.0"},{"v":56,"d":"56.0"},{"v":56,"d":"56.0"},26.5,{"v":12,"d":"12.0"},10.4,{"v":63,"d":"63.0"},8.5,{"v":9,"d":"9.0"},{"v":16,"d":"16.0"},{"v":20,"d":"20.0"},20.5,{"v":13,"d":"13.0"},14.5,{"v":19,"d":"19.0"},{"v":56,"d":"56.0"},15.5,15.5,{"v":17,"d":"17.0"},13.5,{"v":13,"d":"13.0"},39.5,39.5,{"v":23,"d":"23.0"},39.5,{"v":32,"d":"32.0"},{"v":28,"d":"28.0"},{"v":11,"d":"11.0"},null,null,{"v":21,"d":"21.0"},{"v":16,"d":"16.0"},19.5,{"v":33,"d":"33.0"},{"v":78,"d":"78.0"},{"v":21,"d":"21.0"},{"v":10,"d":"10.0"},{"v":48,"d":"48.0"},{"v":12,"d":"12.0"},{"v":16,"d":"16.0"},{"v":18,"d":"18.0"},{"v":5,"d":"5.0"},{"v":19,"d":"19.0"},{"v":24,"d":"24.0"},{"v":14,"d":"14.0"},{"v":63,"d":"63.0"},{"v":6,"d":"6.0"},{"v":18,"d":"18.0"},{"v":9,"d":"9.0"},{"v":18,"d":"18.0"},13.5,70.5,{"v":38,"d":"38.0"},25.5,{"v":13,"d":"13.0"},{"v":10,"d":"10.0"},{"v":6,"d":"6.0"},10.5,{"v":8,"d":"8.0"},{"v":39,"d":"39.0"},null,{"v":8,"d":"8.0"},{"v":48,"d":"48.0"},{"v":13,"d":"13.0"},{"v":13,"d":"13.0"},{"v":13,"d":"13.0"},{"v":12,"d":"12.0"},19.5,{"v":78,"d":"78.0"},{"v":47,"d":"47.0"},13.5,{"v":15,"d":"15.0"},{"v":63,"d":"63.0"},{"v":48,"d":"48.0"},{"v":25,"d":"25.0"},{"v":9,"d":"9.0"},{"v":37,"d":"37.0"},{"v":33,"d":"33.0"},{"v":19,"d":"19.0"},39.5,{"v":48,"d":"48.0"},{"v":19,"d":"19.0"},{"v":12,"d":"12.0"},{"v":31,"d":"31.0"},{"v":7,"d":"7.0"},{"v":12,"d":"12.0"},{"v":12,"d":"12.0"},{"v":12,"d":"12.0"},{"v":7,"d":"7.0"},{"v":8,"d":"8.0"},{"v":16,"d":"16.0"},{"v":14,"d":"14.0"},{"v":16,"d":"16.0"},{"v":39,"d":"39.0"},39.5,39.5,{"v":4,"d":"4.0"},{"v":9,"d":"9.0"},{"v":14,"d":"14.0"},{"v":17,"d":"17.0"},{"v":10,"d":"10.0"},{"v":50,"d":"50.0"},{"v":17,"d":"17.0"},{"v":17,"d":"17.0"},26.5,{"v":38,"d":"38.0"},26.5,{"v":17,"d":"17.0"},null,{"v":52,"d":"52.0"},{"v":9,"d":"9.0"},15.5,{"v":13,"d":"13.0"},{"v":14,"d":"14.0"},15.5,{"v":9,"d":"9.0"},{"v":9,"d":"9.0"},{"v":19,"d":"19.0"},{"v":19,"d":"19.0"},null,15.5,39.5,{"v":45,"d":"45.0"},{"v":6,"d":"6.0"},{"v":38,"d":"38.0"},{"v":19,"d":"19.0"},{"v":11,"d":"11.0"},{"v":9,"d":"9.0"},{"v":7,"d":"7.0"},{"v":77,"d":"77.0"},{"v":18,"d":"18.0"},{"v":50,"d":"50.0"},{"v":9,"d":"9.0"},{"v":39,"d":"39.0"},{"v":11,"d":"11.0"},8.5,{"v":13,"d":"13.0"},{"v":11,"d":"11.0"},{"v":9,"d":"9.0"},{"v":6,"d":"6.0"},{"v":10,"d":"10.0"},{"v":11,"d":"11.0"},null,{"v":33,"d":"33.0"},8.5,{"v":22,"d":"22.0"},{"v":19,"d":"19.0"},{"v":19,"d":"19.0"},{"v":20,"d":"20.0"},{"v":50,"d":"50.0"},{"v":8,"d":"8.0"},13.5,{"v":21,"d":"21.0"},14.5,{"v":5,"d":"5.0"},{"v":17,"d":"17.0"},{"v":16,"d":"16.0"},{"v":7,"d":"7.0"},{"v":20,"d":"20.0"},13.5,13.5,{"v":8,"d":"8.0"},{"v":17,"d":"17.0"},{"v":50,"d":"50.0"},{"v":19,"d":"19.0"},{"v":18,"d":"18.0"},{"v":32,"d":"32.0"},{"v":23,"d":"23.0"},{"v":8,"d":"8.0"},{"v":10,"d":"10.0"},{"v":15,"d":"15.0"},19.5,{"v":19,"d":"19.0"},{"v":21,"d":"21.0"},{"v":10,"d":"10.0"},{"v":8,"d":"8.0"},15.5,15.5,{"v":51,"d":"51.0"},{"v":57,"d":"57.0"},{"v":40,"d":"40.0"},null,{"v":14,"d":"14.0"},{"v":33,"d":"33.0"},{"v":78,"d":"78.0"},{"v":57,"d":"57.0"},39.5,15.5,15.5,{"v":18,"d":"18.0"},{"v":9,"d":"9.0"},{"v":24,"d":"24.0"},{"v":38,"d":"38.0"},{"v":29,"d":"29.0"},null,{"v":7,"d":"7.0"},{"v":18,"d":"18.0"},{"v":32,"d":"32.0"},{"v":15,"d":"15.0"},39.5,{"v":12,"d":"12.0"},13.5,39.5,{"v":18,"d":"18.0"},{"v":10,"d":"10.0"},{"v":17,"d":"17.0"},{"v":26,"d":"26.0"},{"v":10,"d":"10.0"},13.5,{"v":31,"d":"31.0"},{"v":8,"d":"8.0"},null,{"v":18,"d":"18.0"},{"v":6,"d":"6.0"},{"v":19,"d":"19.0"},{"v":11,"d":"11.0"},{"v":12,"d":"12.0"},{"v":12,"d":"12.0"},{"v":8,"d":"8.0"},{"v":12,"d":"12.0"},{"v":8,"d":"8.0"},{"v":17,"d":"17.0"},{"v":12,"d":"12.0"},{"v":16,"d":"16.0"},{"v":12,"d":"12.0"},{"v":11,"d":"11.0"},{"v":6,"d":"6.0"},{"v":14,"d":"14.0"},{"v":13,"d":"13.0"},{"v":63,"d":"63.0"},{"v":15,"d":"15.0"},{"v":26,"d":"26.0"},{"v":6,"d":"6.0"},13.5,null,null,{"v":16,"d":"16.0"},{"v":25,"d":"25.0"},{"v":12,"d":"12.0"},{"v":14,"d":"14.0"},{"v":12,"d":"12.0"},{"v":62,"d":"62.0"},{"v":62,"d":"62.0"},{"v":64,"d":"64.0"},null,{"v":9,"d":"9.0"},{"v":20,"d":"20.0"},{"v":11,"d":"11.0"},{"v":13,"d":"13.0"},{"v":48,"d":"48.0"},{"v":7,"d":"7.0"},{"v":78,"d":"78.0"},null,{"v":55,"d":"55.0"},15.5,{"v":17,"d":"17.0"},{"v":48,"d":"48.0"},13.5,{"v":19,"d":"19.0"},{"v":6,"d":"6.0"},{"v":14,"d":"14.0"},{"v":47,"d":"47.0"},{"v":18,"d":"18.0"},{"v":12,"d":"12.0"},14.5,{"v":7,"d":"7.0"},{"v":47,"d":"47.0"},{"v":16,"d":"16.0"},{"v":16,"d":"16.0"},{"v":8,"d":"8.0"},{"v":9,"d":"9.0"},{"v":15,"d":"15.0"},15.5,{"v":16,"d":"16.0"},{"v":19,"d":"19.0"},{"v":13,"d":"13.0"},14.5,{"v":24,"d":"24.0"},19.5,{"v":12,"d":"12.0"},{"v":7,"d":"7.0"},{"v":7,"d":"7.0"},null,{"v":15,"d":"15.0"},26.5,{"v":17,"d":"17.0"},{"v":20,"d":"20.0"},{"v":8,"d":"8.0"},{"v":18,"d":"18.0"},19.5,{"v":31,"d":"31.0"},{"v":62,"d":"62.0"},null,{"v":7,"d":"7.0"},{"v":13,"d":"13.0"},{"v":13,"d":"13.0"},{"v":13,"d":"13.0"},{"v":8,"d":"8.0"},{"v":13,"d":"13.0"},{"v":32,"d":"32.0"},{"v":31,"d":"31.0"},{"v":18,"d":"18.0"},{"v":19,"d":"19.0"},{"v":52,"d":"52.0"},{"v":12,"d":"12.0"},{"v":56,"d":"56.0"},{"v":7,"d":"7.0"},15.5,{"v":12,"d":"12.0"},{"v":13,"d":"13.0"},13.5,13.5,{"v":18,"d":"18.0"},{"v":9,"d":"9.0"},{"v":44,"d":"44.0"},{"v":13,"d":"13.0"},{"v":13,"d":"13.0"},15.5,26.5,{"v":19,"d":"19.0"},{"v":14,"d":"14.0"},15.5,{"v":11,"d":"11.0"},{"v":63,"d":"63.0"},{"v":31,"d":"31.0"},{"v":53,"d":"53.0"},null,{"v":12,"d":"12.0"},{"v":33,"d":"33.0"},null,null,39.5,{"v":13,"d":"13.0"},{"v":10,"d":"10.0"},{"v":55,"d":"55.0"},{"v":7,"d":"7.0"},{"v":10,"d":"10.0"},19.5,{"v":11,"d":"11.0"},{"v":9,"d":"9.0"},{"v":9,"d":"9.0"},18.5,{"v":20,"d":"20.0"},null,{"v":77,"d":"77.0"},{"v":44,"d":"44.0"},{"v":57,"d":"57.0"},{"v":33,"d":"33.0"},15.5,{"v":13,"d":"13.0"},{"v":16,"d":"16.0"},{"v":17,"d":"17.0"},{"v":44,"d":"44.0"},{"v":27,"d":"27.0"},{"v":8,"d":"8.0"},{"v":8,"d":"8.0"},{"v":8,"d":"8.0"},{"v":13,"d":"13.0"},{"v":17,"d":"17.0"},{"v":8,"d":"8.0"},{"v":12,"d":"12.0"},{"v":26,"d":"26.0"},{"v":14,"d":"14.0"},13.5,{"v":78,"d":"78.0"},{"v":19,"d":"19.0"},{"v":39,"d":"39.0"},{"v":53,"d":"53.0"},{"v":10,"d":"10.0"},{"v":19,"d":"19.0"},{"v":47,"d":"47.0"},null,{"v":11,"d":"11.0"},{"v":13,"d":"13.0"},{"v":39,"d":"39.0"},{"v":12,"d":"12.0"},{"v":37,"d":"37.0"},null,{"v":9,"d":"9.0"},{"v":8,"d":"8.0"},{"v":5,"d":"5.0"},{"v":4,"d":"4.0"},{"v":13,"d":"13.0"},{"v":78,"d":"78.0"},{"v":24,"d":"24.0"},{"v":10,"d":"10.0"},{"v":32,"d":"32.0"},{"v":16,"d":"16.0"},{"v":39,"d":"39.0"},{"v":63,"d":"63.0"},{"v":10,"d":"10.0"},{"v":19,"d":"19.0"},{"v":19,"d":"19.0"},{"v":19,"d":"19.0"},{"v":19,"d":"19.0"},{"v":19,"d":"19.0"},{"v":45,"d":"45.0"},{"v":45,"d":"45.0"},{"v":50,"d":"50.0"},{"v":37,"d":"37.0"},40.5,{"v":13,"d":"13.0"},{"v":7,"d":"7.0"},null,{"v":17,"d":"17.0"},{"v":18,"d":"18.0"},{"v":13,"d":"13.0"},18.5,{"v":47,"d":"47.0"},{"v":9,"d":"9.0"},{"v":77,"d":"77.0"},{"v":32,"d":"32.0"},{"v":7,"d":"7.0"},15.5,{"v":20,"d":"20.0"},{"v":13,"d":"13.0"},{"v":8,"d":"8.0"},{"v":8,"d":"8.0"},{"v":11,"d":"11.0"},{"v":14,"d":"14.0"},{"v":47,"d":"47.0"},{"v":33,"d":"33.0"},{"v":5,"d":"5.0"},{"v":64,"d":"64.0"},{"v":14,"d":"14.0"},10.5,19.5,{"v":17,"d":"17.0"},{"v":9,"d":"9.0"},{"v":8,"d":"8.0"},{"v":8,"d":"8.0"},{"v":11,"d":"11.0"},{"v":13,"d":"13.0"},{"v":10,"d":"10.0"},{"v":7,"d":"7.0"},{"v":17,"d":"17.0"},40.5,{"v":12,"d":"12.0"},{"v":18,"d":"18.0"},{"v":9,"d":"9.0"},20.5,{"v":6,"d":"6.0"},{"v":15,"d":"15.0"},{"v":13,"d":"13.0"},{"v":10,"d":"10.0"},{"v":11,"d":"11.0"},{"v":50,"d":"50.0"},{"v":10,"d":"10.0"},{"v":10,"d":"10.0"},{"v":5,"d":"5.0"},{"v":17,"d":"17.0"},{"v":11,"d":"11.0"},{"v":14,"d":"14.0"},15.5,{"v":8,"d":"8.0"},{"v":13,"d":"13.0"},{"v":13,"d":"13.0"},{"v":40,"d":"40.0"},{"v":78,"d":"78.0"},{"v":10,"d":"10.0"},{"v":8,"d":"8.0"},{"v":24,"d":"24.0"},{"v":48,"d":"48.0"},13.5,70.5,{"v":10,"d":"10.0"},{"v":20,"d":"20.0"},{"v":56,"d":"56.0"},{"v":11,"d":"11.0"},13.5,{"v":13,"d":"13.0"},{"v":17,"d":"17.0"},null,13.5,{"v":10,"d":"10.0"},{"v":47,"d":"47.0"},null,{"v":10,"d":"10.0"},{"v":24,"d":"24.0"},null,{"v":10,"d":"10.0"},{"v":22,"d":"22.0"},{"v":11,"d":"11.0"},14.5,14.5,40.5,40.5,14.5,15.5,{"v":48,"d":"48.0"},{"v":13,"d":"13.0"},{"v":8,"d":"8.0"},{"v":63,"d":"63.0"},{"v":16,"d":"16.0"},13.5,13.5,{"v":13,"d":"13.0"},{"v":78,"d":"78.0"},39.5,39.5,{"v":31,"d":"31.0"},{"v":20,"d":"20.0"},39.5,{"v":55,"d":"55.0"},{"v":8,"d":"8.0"},{"v":14,"d":"14.0"},{"v":14,"d":"14.0"},{"v":33,"d":"33.0"},{"v":15,"d":"15.0"},{"v":15,"d":"15.0"},null,{"v":38,"d":"38.0"},{"v":12,"d":"12.0"},{"v":16,"d":"16.0"},{"v":50,"d":"50.0"},14.5,{"v":19,"d":"19.0"},{"v":20,"d":"20.0"},{"v":37,"d":"37.0"},{"v":47,"d":"47.0"},{"v":17,"d":"17.0"},{"v":48,"d":"48.0"},{"v":11,"d":"11.0"},{"v":17,"d":"17.0"},null,{"v":5,"d":"5.0"},{"v":6,"d":"6.0"},{"v":48,"d":"48.0"},{"v":18,"d":"18.0"},{"v":78,"d":"78.0"},{"v":13,"d":"13.0"},{"v":12,"d":"12.0"},{"v":6,"d":"6.0"},{"v":78,"d":"78.0"},{"v":33,"d":"33.0"},16.5,{"v":45,"d":"45.0"},null,{"v":32,"d":"32.0"},{"v":9,"d":"9.0"},null,{"v":16,"d":"16.0"},{"v":16,"d":"16.0"},25.5,{"v":5,"d":"5.0"},{"v":63,"d":"63.0"},{"v":5,"d":"5.0"},{"v":12,"d":"12.0"},{"v":38,"d":"38.0"},8.5,{"v":13,"d":"13.0"},{"v":14,"d":"14.0"},{"v":45,"d":"45.0"},{"v":57,"d":"57.0"},70.5,{"v":6,"d":"6.0"},{"v":24,"d":"24.0"},13.5,{"v":20,"d":"20.0"},19.5,19.5,{"v":11,"d":"11.0"},{"v":28,"d":"28.0"},null,{"v":9,"d":"9.0"},{"v":16,"d":"16.0"},{"v":51,"d":"51.0"},{"v":9,"d":"9.0"},{"v":45,"d":"45.0"},{"v":10,"d":"10.0"},{"v":11,"d":"11.0"},{"v":11,"d":"11.0"},{"v":12,"d":"12.0"},{"v":12,"d":"12.0"},15.5,{"v":78,"d":"78.0"},{"v":44,"d":"44.0"},{"v":6,"d":"6.0"}]
["EIQ Impacto ambiental (< 75; 75 - 136,5; > 136,5)",null,{"v":17,"d":"17.0"},{"v":106,"d":"106.0"},{"v":155,"d":"155.0"},{"v":28,"d":"28.0"},{"v":21,"d":"21.0"},{"v":69,"d":"69.0"},{"v":69,"d":"69.0"},{"v":69,"d":"69.0"},{"v":66,"d":"66.0"},{"v":30,"d":"30.0"},{"v":46,"d":"46.0"},{"v":36,"d":"36.0"},{"v":85,"d":"85.0"},{"v":74,"d":"74.0"},{"v":56,"d":"56.0"},{"v":37,"d":"37.0"},{"v":72,"d":"72.0"},{"v":33,"d":"33.0"},{"v":26,"d":"26.0"},{"v":72,"d":"72.0"},40.5,{"v":40,"d":"40.0"},{"v":27,"d":"27.0"},{"v":27,"d":"27.0"},{"v":98,"d":"98.0"},95.5,{"v":20,"d":"20.0"},{"v":42,"d":"42.0"},{"v":31,"d":"31.0"},{"v":39,"d":"39.0"},97.5,78.5,95.5,{"v":44,"d":"44.0"},34.5,34.5,null,{"v":17,"d":"17.0"},65.5,{"v":72,"d":"72.0"},{"v":36,"d":"36.0"},{"v":155,"d":"155.0"},{"v":82,"d":"82.0"},{"v":42,"d":"42.0"},31.5,89.5,{"v":76,"d":"76.0"},97.5,{"v":66,"d":"66.0"},{"v":28,"d":"28.0"},{"v":38,"d":"38.0"},{"v":34,"d":"34.0"},97.5,{"v":30,"d":"30.0"},{"v":30,"d":"30.0"},36.5,null,{"v":51,"d":"51.0"},{"v":51,"d":"51.0"},{"v":24,"d":"24.0"},{"v":51,"d":"51.0"},{"v":57,"d":"57.0"},null,{"v":33,"d":"33.0"},{"v":70,"d":"70.0"},{"v":69,"d":"69.0"},{"v":109,"d":"109.0"},{"v":39,"d":"39.0"},{"v":29,"d":"29.0"},{"v":29,"d":"29.0"},{"v":72,"d":"72.0"},{"v":72,"d":"72.0"},{"v":34,"d":"34.0"},{"v":41,"d":"41.0"},{"v":96,"d":"96.0"},{"v":65,"d":"65.0"},{"v":92,"d":"92.0"},{"v":130,"d":"130.0"},{"v":42,"d":"42.0"},62.5,109.5,{"v":98,"d":"98.0"},{"v":98,"d":"98.0"},{"v":34,"d":"34.0"},{"v":36,"d":"36.0"},{"v":107,"d":"107.0"},{"v":98,"d":"98.0"},83.5,{"v":25,"d":"25.0"},{"v":115,"d":"115.0"},{"v":115,"d":"115.0"},{"v":69,"d":"69.0"},{"v":46,"d":"46.0"},{"v":30,"d":"30.0"},{"v":115,"d":"115.0"},{"v":47,"d":"47.0"},{"v":62,"d":"62.0"},{"v":36,"d":"36.0"},{"v":98,"d":"98.0"},{"v":49,"d":"49.0"},{"v":96,"d":"96.0"},{"v":96,"d":"96.0"},{"v":65,"d":"65.0"},{"v":40,"d":"40.0"},76.3,{"v":84,"d":"84.0"},83.5,{"v":35,"d":"35.0"},{"v":76,"d":"76.0"},{"v":70,"d":"70.0"},{"v":159,"d":"159.0"},{"v":39,"d":"39.0"},{"v":59,"d":"59.0"},{"v":42,"d":"42.0"},{"v":96,"d":"96.0"},{"v":48,"d":"48.0"},{"v":48,"d":"48.0"},{"v":105,"d":"105.0"},{"v":115,"d":"115.0"},{"v":81,"d":"81.0"},62.5,62.5,{"v":20,"d":"20.0"},62.5,{"v":104,"d":"104.0"},{"v":30,"d":"30.0"},{"v":33,"d":"33.0"},null,null,{"v":91,"d":"91.0"},{"v":33,"d":"33.0"},{"v":137,"d":"137.0"},{"v":69,"d":"69.0"},{"v":126,"d":"126.0"},{"v":36,"d":"36.0"},{"v":38,"d":"38.0"},{"v":39,"d":"39.0"},{"v":50,"d":"50.0"},{"v":74,"d":"74.0"},{"v":57,"d":"57.0"},{"v":91,"d":"91.0"},{"v":16,"d":"16.0"},109.5,{"v":58,"d":"58.0"},{"v":162,"d":"162.0"},{"v":42,"d":"42.0"},{"v":39,"d":"39.0"},{"v":44,"d":"44.0"},{"v":21,"d":"21.0"},95.5,97.5,{"v":60,"d":"60.0"},{"v":60,"d":"60.0"},31.5,{"v":38,"d":"38.0"},{"v":34,"d":"34.0"},31.5,{"v":28,"d":"28.0"},{"v":39,"d":"39.0"},null,36.5,{"v":54,"d":"54.0"},31.5,31.5,31.5,{"v":50,"d":"50.0"},{"v":137,"d":"137.0"},{"v":168,"d":"168.0"},{"v":74,"d":"74.0"},95.5,{"v":91,"d":"91.0"},{"v":84,"d":"84.0"},{"v":102,"d":"102.0"},{"v":61,"d":"61.0"},{"v":26,"d":"26.0"},{"v":62,"d":"62.0"},{"v":75,"d":"75.0"},{"v":51,"d":"51.0"},{"v":42,"d":"42.0"},{"v":102,"d":"102.0"},{"v":56,"d":"56.0"},{"v":50,"d":"50.0"},{"v":46,"d":"46.0"},{"v":53,"d":"53.0"},{"v":50,"d":"50.0"},{"v":50,"d":"50.0"},{"v":50,"d":"50.0"},{"v":98,"d":"98.0"},{"v":41,"d":"41.0"},{"v":106,"d":"106.0"},{"v":71,"d":"71.0"},{"v":106,"d":"106.0"},{"v":39,"d":"39.0"},62.5,62.5,{"v":67,"d":"67.0"},{"v":100,"d":"100.0"},41.5,{"v":82,"d":"82.0"},{"v":47,"d":"47.0"},{"v":72,"d":"72.0"},{"v":79,"d":"79.0"},{"v":79,"d":"79.0"},{"v":61,"d":"61.0"},{"v":66,"d":"66.0"},{"v":61,"d":"61.0"},{"v":79,"d":"79.0"},null,{"v":148,"d":"148.0"},{"v":100,"d":"100.0"},{"v":63,"d":"63.0"},{"v":45,"d":"45.0"},{"v":71,"d":"71.0"},{"v":63,"d":"63.0"},{"v":17,"d":"17.0"},{"v":34,"d":"34.0"},{"v":44,"d":"44.0"},{"v":44,"d":"44.0"},null,{"v":63,"d":"63.0"},{"v":42,"d":"42.0"},{"v":72,"d":"72.0"},{"v":55,"d":"55.0"},{"v":75,"d":"75.0"},{"v":56,"d":"56.0"},{"v":55,"d":"55.0"},{"v":57,"d":"57.0"},{"v":50,"d":"50.0"},{"v":106,"d":"106.0"},{"v":21,"d":"21.0"},{"v":134,"d":"134.0"},{"v":46,"d":"46.0"},{"v":60,"d":"60.0"},{"v":97,"d":"97.0"},58.5,{"v":112,"d":"112.0"},{"v":55,"d":"55.0"},{"v":49,"d":"49.0"},{"v":55,"d":"55.0"},{"v":36,"d":"36.0"},{"v":30,"d":"30.0"},null,{"v":69,"d":"69.0"},58.5,{"v":56,"d":"56.0"},{"v":51,"d":"51.0"},{"v":51,"d":"51.0"},{"v":52,"d":"52.0"},{"v":134,"d":"134.0"},{"v":15,"d":"15.0"},95.5,{"v":36,"d":"36.0"},118.5,{"v":38,"d":"38.0"},{"v":75,"d":"75.0"},{"v":85,"d":"85.0"},{"v":98,"d":"98.0"},{"v":42,"d":"42.0"},{"v":103,"d":"103.0"},95.5,{"v":15,"d":"15.0"},{"v":118,"d":"118.0"},{"v":72,"d":"72.0"},{"v":58,"d":"58.0"},33.5,{"v":50,"d":"50.0"},{"v":20,"d":"20.0"},56.5,{"v":36,"d":"36.0"},{"v":91,"d":"91.0"},{"v":92,"d":"92.0"},{"v":74,"d":"74.0"},{"v":91,"d":"91.0"},{"v":29,"d":"29.0"},{"v":30,"d":"30.0"},43.5,43.5,{"v":78,"d":"78.0"},{"v":66,"d":"66.0"},{"v":103,"d":"103.0"},null,{"v":34,"d":"34.0"},{"v":99,"d":"99.0"},{"v":126,"d":"126.0"},{"v":66,"d":"66.0"},{"v":42,"d":"42.0"},40.5,40.5,33.5,{"v":46,"d":"46.0"},109.5,{"v":66,"d":"66.0"},{"v":20,"d":"20.0"},null,{"v":46,"d":"46.0"},{"v":39,"d":"39.0"},{"v":36,"d":"36.0"},{"v":91,"d":"91.0"},62.5,{"v":50,"d":"50.0"},95.5,{"v":42,"d":"42.0"},33.5,{"v":36,"d":"36.0"},{"v":105,"d":"105.0"},{"v":42,"d":"42.0"},{"v":60,"d":"60.0"},{"v":103,"d":"103.0"},{"v":46,"d":"46.0"},56.5,null,{"v":54,"d":"54.0"},34.5,{"v":51,"d":"51.0"},{"v":30,"d":"30.0"},{"v":50,"d":"50.0"},{"v":32,"d":"32.0"},{"v":15,"d":"15.0"},{"v":32,"d":"32.0"},{"v":46,"d":"46.0"},{"v":82,"d":"82.0"},{"v":76,"d":"76.0"},{"v":29,"d":"29.0"},{"v":36,"d":"36.0"},{"v":21,"d":"21.0"},{"v":28,"d":"28.0"},{"v":58,"d":"58.0"},{"v":47,"d":"47.0"},{"v":162,"d":"162.0"},{"v":32,"d":"32.0"},{"v":80,"d":"80.0"},34.5,95.5,null,null,{"v":66,"d":"66.0"},{"v":61,"d":"61.0"},69.5,{"v":28,"d":"28.0"},{"v":50,"d":"50.0"},{"v":78,"d":"78.0"},{"v":78,"d":"78.0"},{"v":82,"d":"82.0"},null,{"v":26,"d":"26.0"},{"v":88,"d":"88.0"},33.5,{"v":38,"d":"38.0"},{"v":102,"d":"102.0"},{"v":46,"d":"46.0"},{"v":126,"d":"126.0"},null,89.5,{"v":42,"d":"42.0"},{"v":109,"d":"109.0"},{"v":54,"d":"54.0"},{"v":115,"d":"115.0"},{"v":75,"d":"75.0"},{"v":42,"d":"42.0"},{"v":28,"d":"28.0"},{"v":66,"d":"66.0"},{"v":57,"d":"57.0"},{"v":50,"d":"50.0"},{"v":54,"d":"54.0"},{"v":24,"d":"24.0"},{"v":57,"d":"57.0"},{"v":106,"d":"106.0"},{"v":106,"d":"106.0"},{"v":30,"d":"30.0"},{"v":25,"d":"25.0"},110.5,{"v":63,"d":"63.0"},{"v":33,"d":"33.0"},{"v":58,"d":"58.0"},{"v":30,"d":"30.0"},{"v":54,"d":"54.0"},{"v":49,"d":"49.0"},{"v":137,"d":"137.0"},{"v":40,"d":"40.0"},{"v":50,"d":"50.0"},{"v":27,"d":"27.0"},null,110.5,{"v":65,"d":"65.0"},{"v":105,"d":"105.0"},{"v":70,"d":"70.0"},{"v":15,"d":"15.0"},{"v":72,"d":"72.0"},{"v":137,"d":"137.0"},{"v":46,"d":"46.0"},{"v":78,"d":"78.0"},null,{"v":53,"d":"53.0"},{"v":38,"d":"38.0"},{"v":45,"d":"45.0"},{"v":45,"d":"45.0"},{"v":57,"d":"57.0"},{"v":45,"d":"45.0"},{"v":104,"d":"104.0"},{"v":46,"d":"46.0"},{"v":42,"d":"42.0"},{"v":74,"d":"74.0"},{"v":148,"d":"148.0"},{"v":40,"d":"40.0"},{"v":130,"d":"130.0"},{"v":98,"d":"98.0"},{"v":48,"d":"48.0"},69.5,{"v":39,"d":"39.0"},78.5,78.5,{"v":42,"d":"42.0"},{"v":35,"d":"35.0"},{"v":78,"d":"78.0"},{"v":99,"d":"99.0"},{"v":47,"d":"47.0"},{"v":63,"d":"63.0"},{"v":65,"d":"65.0"},{"v":75,"d":"75.0"},{"v":40,"d":"40.0"},{"v":42,"d":"42.0"},{"v":21,"d":"21.0"},{"v":87,"d":"87.0"},{"v":60,"d":"60.0"},{"v":40,"d":"40.0"},null,{"v":46,"d":"46.0"},{"v":99,"d":"99.0"},null,null,{"v":42,"d":"42.0"},{"v":112,"d":"112.0"},{"v":28,"d":"28.0"},89.5,{"v":53,"d":"53.0"},{"v":60,"d":"60.0"},{"v":137,"d":"137.0"},{"v":21,"d":"21.0"},{"v":49,"d":"49.0"},{"v":44,"d":"44.0"},74.5,{"v":88,"d":"88.0"},null,{"v":106,"d":"106.0"},{"v":78,"d":"78.0"},{"v":66,"d":"66.0"},{"v":69,"d":"69.0"},{"v":48,"d":"48.0"},{"v":30,"d":"30.0"},{"v":85,"d":"85.0"},{"v":69,"d":"69.0"},47.5,{"v":42,"d":"42.0"},{"v":46,"d":"46.0"},{"v":28,"d":"28.0"},{"v":27,"d":"27.0"},31.5,{"v":82,"d":"82.0"},{"v":15,"d":"15.0"},{"v":46,"d":"46.0"},{"v":80,"d":"80.0"},{"v":34,"d":"34.0"},95.5,{"v":96,"d":"96.0"},{"v":42,"d":"42.0"},{"v":66,"d":"66.0"},{"v":40,"d":"40.0"},{"v":36,"d":"36.0"},{"v":16,"d":"16.0"},{"v":74,"d":"74.0"},null,{"v":97,"d":"97.0"},{"v":106,"d":"106.0"},{"v":60,"d":"60.0"},{"v":76,"d":"76.0"},{"v":62,"d":"62.0"},null,34.5,{"v":44,"d":"44.0"},{"v":38,"d":"38.0"},{"v":67,"d":"67.0"},{"v":47,"d":"47.0"},{"v":168,"d":"168.0"},{"v":49,"d":"49.0"},{"v":38,"d":"38.0"},{"v":98,"d":"98.0"},{"v":76,"d":"76.0"},{"v":39,"d":"39.0"},{"v":99,"d":"99.0"},{"v":29,"d":"29.0"},{"v":51,"d":"51.0"},{"v":51,"d":"51.0"},{"v":51,"d":"51.0"},{"v":51,"d":"51.0"},{"v":51,"d":"51.0"},{"v":72,"d":"72.0"},{"v":72,"d":"72.0"},{"v":72,"d":"72.0"},{"v":62,"d":"62.0"},31.5,{"v":107,"d":"107.0"},{"v":53,"d":"53.0"},null,{"v":75,"d":"75.0"},{"v":54,"d":"54.0"},{"v":45,"d":"45.0"},74.5,{"v":57,"d":"57.0"},31.5,{"v":106,"d":"106.0"},{"v":36,"d":"36.0"},{"v":24,"d":"24.0"},{"v":42,"d":"42.0"},{"v":52,"d":"52.0"},{"v":39,"d":"39.0"},{"v":27,"d":"27.0"},{"v":30,"d":"30.0"},{"v":33,"d":"33.0"},41.5,{"v":66,"d":"66.0"},{"v":69,"d":"69.0"},{"v":38,"d":"38.0"},{"v":82,"d":"82.0"},{"v":34,"d":"34.0"},31.5,{"v":137,"d":"137.0"},{"v":118,"d":"118.0"},{"v":100,"d":"100.0"},{"v":30,"d":"30.0"},{"v":57,"d":"57.0"},{"v":42,"d":"42.0"},{"v":45,"d":"45.0"},{"v":60,"d":"60.0"},{"v":30,"d":"30.0"},{"v":69,"d":"69.0"},31.5,{"v":32,"d":"32.0"},{"v":57,"d":"57.0"},{"v":85,"d":"85.0"},{"v":159,"d":"159.0"},{"v":55,"d":"55.0"},{"v":32,"d":"32.0"},{"v":106,"d":"106.0"},{"v":28,"d":"28.0"},{"v":33,"d":"33.0"},{"v":72,"d":"72.0"},{"v":29,"d":"29.0"},{"v":38,"d":"38.0"},{"v":38,"d":"38.0"},{"v":105,"d":"105.0"},{"v":21,"d":"21.0"},{"v":40,"d":"40.0"},{"v":63,"d":"63.0"},{"v":44,"d":"44.0"},{"v":81,"d":"81.0"},{"v":24,"d":"24.0"},{"v":103,"d":"103.0"},{"v":126,"d":"126.0"},{"v":36,"d":"36.0"},{"v":13,"d":"13.0"},{"v":49,"d":"49.0"},{"v":102,"d":"102.0"},{"v":115,"d":"115.0"},97.5,{"v":47,"d":"47.0"},{"v":70,"d":"70.0"},{"v":96,"d":"96.0"},{"v":33,"d":"33.0"},{"v":103,"d":"103.0"},{"v":45,"d":"45.0"},{"v":118,"d":"118.0"},null,{"v":115,"d":"115.0"},{"v":28,"d":"28.0"},{"v":57,"d":"57.0"},null,{"v":44,"d":"44.0"},{"v":49,"d":"49.0"},null,{"v":31,"d":"31.0"},{"v":56,"d":"56.0"},{"v":97,"d":"97.0"},118.5,118.5,31.5,31.5,118.5,43.5,{"v":39,"d":"39.0"},{"v":99,"d":"99.0"},{"v":30,"d":"30.0"},{"v":87,"d":"87.0"},{"v":66,"d":"66.0"},{"v":115,"d":"115.0"},{"v":115,"d":"115.0"},{"v":39,"d":"39.0"},{"v":126,"d":"126.0"},{"v":42,"d":"42.0"},{"v":42,"d":"42.0"},{"v":60,"d":"60.0"},{"v":70,"d":"70.0"},62.5,89.5,{"v":13,"d":"13.0"},{"v":40,"d":"40.0"},{"v":28,"d":"28.0"},{"v":75,"d":"75.0"},{"v":63,"d":"63.0"},{"v":63,"d":"63.0"},null,{"v":75,"d":"75.0"},{"v":36,"d":"36.0"},{"v":74,"d":"74.0"},{"v":100,"d":"100.0"},{"v":59,"d":"59.0"},{"v":56,"d":"56.0"},{"v":37,"d":"37.0"},{"v":62,"d":"62.0"},{"v":57,"d":"57.0"},{"v":105,"d":"105.0"},{"v":39,"d":"39.0"},{"v":42,"d":"42.0"},{"v":82,"d":"82.0"},null,{"v":91,"d":"91.0"},{"v":34,"d":"34.0"},{"v":39,"d":"39.0"},65.5,{"v":126,"d":"126.0"},{"v":36,"d":"36.0"},{"v":50,"d":"50.0"},{"v":55,"d":"55.0"},{"v":96,"d":"96.0"},{"v":69,"d":"69.0"},{"v":38,"d":"38.0"},{"v":72,"d":"72.0"},null,{"v":50,"d":"50.0"},{"v":57,"d":"57.0"},null,{"v":74,"d":"74.0"},{"v":76,"d":"76.0"},{"v":60,"d":"60.0"},{"v":24,"d":"24.0"},{"v":99,"d":"99.0"},{"v":24,"d":"24.0"},{"v":32,"d":"32.0"},{"v":60,"d":"60.0"},83.5,31.5,{"v":40,"d":"40.0"},{"v":72,"d":"72.0"},{"v":66,"d":"66.0"},97.5,{"v":28,"d":"28.0"},109.5,78.5,{"v":42,"d":"42.0"},{"v":155,"d":"155.0"},{"v":137,"d":"137.0"},{"v":42,"d":"42.0"},{"v":30,"d":"30.0"},null,{"v":34,"d":"34.0"},{"v":74,"d":"74.0"},{"v":78,"d":"78.0"},34.5,{"v":72,"d":"72.0"},{"v":44,"d":"44.0"},33.5,{"v":21,"d":"21.0"},{"v":50,"d":"50.0"},{"v":50,"d":"50.0"},43.5,{"v":126,"d":"126.0"},47.5,{"v":40,"d":"40.0"}]
["Produto banido na União Européia (X)",null,null,"x",{"$nulls":3},"x","x","x",null,"x",null,"x","x",null,"x",null,"x",{"$nulls":5},"x","x",null,"x",null,"x",null,null,"x",null,"x",null,"x","x","x",{"$nulls":3},"x",null,null,"x","x",null,null,"x","x","x",null,null,"x","x","x","x",null,"x","x","x","x","x","x",null,"x","x",{"$nulls":8},"x","x",null,null,"x","x",null,"x","x",{"$nulls":4},"x",null,"x","x","x",null,null,"x",null,null,"x","x",{"$nulls":3},"x","x","x",null,"x",null,null,"x","x",null,"x",{"$nulls":4},"x","x","x","x","x",null,"x","x",null,null,"x","x","x","x","x","x",null,"x",null,"x","x","x","x","x","x",null,null,"x","x",{"$nulls":3},"x","x",{"$nulls":8},"x","x",{"$nulls":4},"x","x","x",null,"x",null,null,"x",null,"x",null,"x","x",null,"x","x","x","x","x","x","x","x","x",{"$nulls":5},"x","x","x","x",null,"x",{"$nulls":4},"x",null,"x",null,"x","x","x","x","x",null,"x",{"$nulls":4},"x","x",{"$nulls":4},"x",{"$nulls":3},"x",null,"x",{"$nulls":9},"x",null,"x",null,null,"x","x",null,"x","x","x","x","x",{"$nulls":3},"x","x",null,"x","x","x",null,null,"x",{"$nulls":7},"x","x",{"$nulls":14},"x",{"$nulls":5},"x",{"$nulls":3},"x","x","x",null,"x",null,"x","x","x",null,"x",null,null,"x","x","x","x","x",null,"x",null,null,"x",{"$nulls":4},"x",null,null,"x",null,null,"x","x","x","x",{"$nulls":4},"x",{"$nulls":3},"x","x","x","x",null,"x","x",{"$nulls":3},"x",null,null,"x",null,"x",null,null,"x","x",null,null,"x",null,null,"x",null,null,"x","x",null,"x",null,null,"x","x",null,"x","x",null,"x","x","x","x","x","x","x",null,"x","x",null,"x","x",null,"x","x","x",null,null,"x",null,null,"x",{"$nulls":8},"x",null,"x","x",null,null,"x",{"$nulls":4},"x",{"$nulls":3},"x",{"$nulls":4},"x","x","x",{"$nulls":3},"x","x","x","x",null,null,"x",null,"x",null,"x",{"$nulls":6},"x","x",{"$nulls":3},"x","x",null,"x",null,null,"x",null,"x",{"$nulls":5},"x",null,"x",null,"x",null,"x",null,null,"x","x",null,null,"x","x","x","x","x","x",{"$nulls":4},"x",null,"x","x",null,"x","x","x","x","x","x",null,null,"x",null,"x",{"$nulls":5},"x",{"$nulls":4},"x","x","x",null,null,"x","x","x",null,"x","x",null,"x","x","x",{"$nulls":6},"x",null,null,"x",null,null,"x","x","x","x",{"$nulls":5},"x","x","x",null,"x",{"$nulls":3},"x","x","x","x",null,"x",{"$nulls":3},"x",{"$nulls":3},"x","x","x","x","x",null,"x","x","x",null,null,"x","x","x",{"$nulls":4},"x","x",{"$nulls":3},"x","x",{"$nulls":5},"x",null,"x","x",null,null,"x","x","x","x","x","x","x",null,"x",{"$nulls":3},"x",null,"x","x",null,null,"x",null,null,"x","x","x",{"$nulls":6},"x",{"$nulls":4},"x","x",null,null,"x",null,"x","x",{"$nulls":3},"x",{"$nulls":4},"x",null,"x","x"]
["Número de princípios ativos registrados no Brasil (2019-2022)",null,49,8,14,12,6,11,11,11,25,{"$nulls":4},24,13,2,null,3,null,66,1,{"$nulls":3},5,6,1,null,3,4,44,null,3,4,31,31,10,49,null,66,null,14,2,2,null,null,2,44,13,null,22,26,44,null,null,2,1,52,52,14,52,1,null,3,17,11,23,{"$nulls":3},66,66,{"$nulls":3},19,4,5,null,17,11,{"$nulls":4},1,5,1,1,41,41,2,null,6,41,2,17,null,null,33,5,5,19,{"$nulls":3},1,null,2,17,null,22,1,27,5,3,3,13,41,null,17,17,null,17,null,null,3,1,1,1,1,null,11,10,null,24,17,28,3,1,5,7,11,null,6,{"$nulls":3},8,3,44,3,null,15,24,null,24,1,4,14,2,null,15,15,15,28,null,1,24,3,16,null,25,4,9,17,null,52,35,25,13,28,10,5,28,28,28,null,null,3,null,3,4,17,17,13,22,31,null,2,38,13,13,null,10,null,13,10,9,4,24,33,null,24,49,{"$nulls":3},2,29,35,66,null,2,13,20,2,2,8,8,1,null,1,1,null,null,20,1,{"$nulls":4},11,null,12,52,52,null,1,64,6,null,1,null,3,null,null,3,null,1,64,49,38,1,12,11,null,4,2,16,4,10,1,null,null,26,26,null,4,1,1,26,1,10,13,35,1,1,12,null,11,10,1,2,null,null,27,16,17,28,3,35,12,2,13,null,10,null,10,4,2,null,31,52,null,28,44,64,44,1,{"$nulls":3},3,null,6,null,2,6,2,2,31,3,30,30,1,4,null,null,28,1,1,2,10,9,null,19,null,25,null,10,4,null,null,23,null,41,11,null,null,1,1,28,4,22,3,3,3,null,1,19,24,1,1,null,4,33,null,null,2,null,2,19,19,13,17,64,null,null,10,1,30,9,null,33,33,5,33,null,10,8,10,9,null,5,null,3,null,22,null,null,8,{"$nulls":4},29,19,11,6,null,6,null,null,5,null,null,1,null,2,35,null,12,null,9,10,null,6,1,{"$nulls":3},10,8,null,13,11,3,{"$nulls":3},6,6,1,1,null,15,null,64,null,2,2,1,null,27,13,5,2,7,24,14,1,null,1,null,17,null,5,null,null,13,null,1,33,24,null,null,4,null,null,52,52,52,52,52,66,66,38,17,3,1,5,null,3,null,3,null,3,null,8,27,22,null,null,3,null,null,3,31,1,11,null,2,2,24,27,49,4,null,5,2,33,10,6,null,3,44,1,{"$nulls":3},2,null,12,3,38,null,24,null,13,null,6,29,null,null,14,1,10,null,null,33,25,41,44,2,17,5,3,null,3,49,null,41,12,3,4,null,33,null,3,12,1,1,1,3,3,1,26,17,{"$nulls":3},1,41,41,3,10,35,35,null,17,17,null,null,6,null,null,6,6,null,2,3,3,8,1,13,2,17,3,13,17,2,null,30,5,null,17,null,10,null,28,null,null,2,22,66,null,11,2,null,3,null,null,16,null,16,44,3,1,15,6,66,4,44,6,11,null,3,14,27,2,{"$nulls":3},3,null,5,66,4,19,6,28,28,26,10,6]
[]
["DATABASE (QUESTIONNAIRE; INDICATORS; REPORT)",null,"Q2DATA","Q3ENTREVISTADOR_NOME","Q3ENTREVISTADOR_CPF","Q4PRODUTOR_NOME","Q4PRODUTOR_CPF","Q4PRODUTOR_IDADE","Q5IMOVEL_GEOLOCALIZACAO","Q5MUNICIPIO","Q5ESTADO","Q5CURSO_DAGUA_PRINCIPAL","Q6POSSE","Q6PROCESSO_SUCESSORIO","Q6PARTICIPACAO_DA_MULHER","Q7IMOVEL_NOME","Q7IMOVEL_AREA","Q7ENQUADRAMENTO_AGRICULTURA_FAMILIAR","Q7AREA_NAO_CONTIGUA_DESCRICAO","Q7AREA_NAO_CONTIGUA_HECTARES","Q8LAVOURAS_PERMANENTES","Q8LAVOURAS_TEMPORARIAS","Q8PASTAGENS","Q8SILVICULTURA","Q8AREA_NAO_AGRICOLA","Q8POUSIO","Q8CORPOS_DAGUA","Q8VEGETACAO_NATIVA","Q8AREAS_NAO_APROVEITAVEIS","Q8AREA_TOTAL","Q9CAR_APP_AREA_TOTAL","Q9CAR_APP_RECUPERAR","Q10RESERVA_LEGAL_AREA","Q10RESERVA_LEGAL_AREA_VEGETACAO_NATIVA_EXCEDENTE","Q11CURSOS_DAGUA","Q11NASCENTES","Q11LAGOS_LAGOAS_NATURAIS","Q11REPRESAS","Q11USO_AGUA_SUPERFICIAL","Q11USO_AGUA_SUBTERRANEA","Q11AGUA_DISPONIBILIDADE_PROBLEMAS","Q11AGUA_DISPONIBILIDADE_PROBLEMAS_ESPECIFICACAO","Q12OUTORGA_USO_AGUA","Q12LICENCIAMENTO_AMBIENTAL","Q13PONTOS_CRITICOS_DESCRICAO1","Q13PONTOS_CRITICOS_DESCRICAO2","Q13PONTOS_CRITICOS_DESCRICAO3","I1RECEITA_BRUTA_ATIVIDADE_DESCRICAO1","I1RECEITA_BRUTA_VALOR_ESTIMADO1","I1RECEITA_BRUTA_ATIVIDADE_DESCRICAO2","I1RECEITA_BRUTA_VALOR_ESTIMADO2","I1RECEITA_BRUTA_ATIVIDADE_DESCRICAO3","I1RECEITA_BRUTA_VALOR_ESTIMADO3","I1ATIVIDADE1_DESCRICAO","I1ATIVIDADE1_UNID","I1ATIVIDADE1_PRODUTIVIDADE","I1ATIVIDADE1_PRECO","I1ATIVIDADE1_PRODUTIVIDE_REGIONAL","I1ATIVIDADE1_PRECO_REGIONAL","I1ATIVIDADE2_DESCRICAO","I1ATIVIDADE2_UNID","I1ATIVIDADE2_PRODUTIVIDADE","I1ATIVIDADE2_PRECO","I1ATIVIDADE2_PRODUTIVIDE_REGIONAL","I1ATIVIDADE2_PRECO_REGIONAL","I1ATIVIDADE3_DESCRICAO","I1ATIVIDADE3_UNID","I1ATIVIDADE3_PRODUTIVIDADE","I1ATIVIDADE3_PRECO","I1ATIVIDADE3_PRODUTIVIDE_REGIONAL","I1ATIVIDADE3_PRECO_REGIONAL","I1RESULTADO","I2ATIVIDADE_DESCRICAO1","I2ATIVIDADE_VALOR1","I2ATIVIDADE_DESCRICAO2","I2ATIVIDADE.VALOR2","I2ATIVIDADE_DESCRICAO3","I2ATIVIDADE_VALOR3","I2PENSAO_APOSENTADORIA_BOLSAS","I2OUTRAS_ATIVIDADES_PRESTACAO_SERVICOS","I2ATIVIDADES_AGRICOLAS_IMOVEL","I2OUTRAS_ATIVIDADES_IMOVEL","I2ATIVIDADES_FORA_DO_IMOVEL","I2PENSAO_APOSENTADORIA_BOLSAS","I2CONCENTRACAO_DE_RENDA_ATIVIDADE","I2RESULTADO","I3PERIODO_DE_AVALIACAO","I3BENFEITORIAS_RECENTES","I3BENFEITORIAS_RECENTES_VALOR","I3BENFEITORIAS_EXISTENTES","I3BENFEITORIAS_EXISTENTES_VALOR","I3BENFEITORIAS_TOTAL","I3EQUIPAMENTOS_RECENTES","I3EQUIPAMENTOS_RECENTES_VALOR","I3EQUIPAMENTOS_EXISTENTES","I3EQUIPAMENTOS_EXISTENTES_VALOR","I3EQUIPAMENTOS_TOTAL","I3SEMOVENTES_ESTOQUE_TOTAL","I3SEMOVENTES_ESTOQUE_TOTAL_HIST","I3IRRIGACAO_TIPO","I3IRRIGACAO_AREA","I3IRRIGACAO_HISTORICO_AREA","I3USO_DO_SOLO_AREA_TOTAL","I3USO_DO_SOLO_AREA_TOTAL_HIST","I3VALOR_DA_TERRA","I3VALOR_DA_TERRA_HIST","I3ESTIMATIVA_PATRIMONIAL","I3ESTIMATIVA_PATRIMONIAL_HIST","I3VALORIZACAO_DA_TERRA","I3EVOLUCAO_BENFEITORIAS","I3EVOLUCAO_EQUIPAMENTOS","I3EVOLUCAO_SEMOVENTES","I3EVOLUCAO_AREAS_AGRICOLAS_IRRIGACAO","I3EVOLUCAO_PATRIMONIAL_TOTAL","I3EVOLUCAO_PATRIMONIAL_TOTAL_SEM_VALORIZACAO_DA_TERRA","I3RESULTADO","I4FINANCIAMENTOS_COMPROMISSOS_FINANCEIROS","I4FINANCIAMENTOS_COMPROMISSOS_FINANCEIROS_PROPORCAO_ESTIMATIVA_PATRIMONIAL","I4RESULTADO","I5RESIDENCIAS","I5DISPONIBILIDADE_DE_AGUA","I5ENERGIA_ELETRICA","I5ESTRADA_DE_ACESSO","I5SERVICO_DE_SAUDE","I5TRANSPORTE_ESCOLAR","I5SEGURANCA","I5INTERNET","I5COLETADELIXO","I5RESULTADO_PARCIAL1","I5HORTALICAS","I5POMAR","I5ANIMAIS","I5RESULTADO_PARCIAL2","I5RESULTADO","I6FAMILIA","I6FAMILIA_ESCOLARIDADE_MENOR_9ANOS","I6FAMILIA_FUNDAMENTAL","I6FAMILIA_ENSINO_MEDIO","I6FAMILIA_CURSO_SUPERIOR","I6COLABORADORES","I6COLABORADORES_ESCOLARIDADE_MENOR_9ANOS","I6COLABORADORES_FUNDAMENTAL","I6COLABORADORES_ENSINO_MEDIO","I6COLABORADORES_CURSO_SUPERIOR","I6FAMILIA_CAPACITACAO_CURTA","I6FAMILIA_CAPACITACAO_LONGA","I6COLABORADORES_CAPACITACAO_CURTA","I6COLABORADORES_CAPACITACAO_LONGA","I6FAMILIA_6A18ANOS","I6FAMILIA_6A18ANOS_FREQ_ESCOLA","I6COLABORADORES_6A18ANOS","I6COLABORADORES_6A18ANOS_FREQ_ESCOLA","I6RESULTADO","I7FUNCIONARIOS","I7FUNCIONARIOS_REGISTRADOS","I7PGTO_HORA_EXTRA_AUSENCIA_HORA_EXTRA","I7SM>1","I7AUXILIO_ALIMENTACAO","I7AUXILIO_MORADIA","I7AUXILIO_EDUCACAO","I7PARTICIPACAO_LUCROS","I7SEGURO_ACIDENTES","I7ACESSO_LAZER","I7ESPACO_CULTIVOS","I7_FUNCIONARIOS_TEMPORARIOS_PROPORCAO","I7RESULTADO","I8FLUXO_DE_CAIXA","I8CUSTO_DE_PRODUCAO","I8ASSITENCIA_TECNICA","I8PARTICIPACAO_ASSOCIATIVA","I8REGUULARIZACAO_AMBIENTAL","I8CREDITO_INVESTIMENTOS","I8CREDITO_CUSTEIO","I8CREDITO_COMERCIALIZACAO","I8RESULTADO","I9INFORMACAO_COMPRADORES_DIVERSIFICADOS","I9PRODUTOS_CERTIFICADOS_MERCADO_INSTITUCIONAL","I9INOVACAO_ADOCAO","I9INOVACAO_ADOCAO_DESCRICAO","I9INOVACAO_CAPACIDADE_LIDERANCA","I9INOVACAO_CAPACIDADE_LIDERANCA_DESCRICAO","I9USO_DE_BIOINSUMOS","I9USO_DE_BIOINSUMOS_PROPORCAO","I9PLANTAS_DE_COBERTURA_OU_ESPECIES_ARBÓREAS","I9PLANTAS_DE_COBERTURA_OU_ESPECIES_ARBÓREAS_PROPORCAO","I9RESULTADO","I10ESGOTO1","I10ESGOTO2","I10LIXO1","I10LIXO2","I10COLETA_DESTINACAO_ADEQUADA_RESIDUOS_SOLIDOS","I10COLETA_DESTINACAO_ADEQUADA_EFLUENTES_LIQUIDOS","I10COLETA_DESTINACAO_ADEQUADA_EFLUENTES_GASOSOS","I10PONTO_CRITICO","I10PONTO_CRITICO_DESCRICAO","I10RESULTADO","I11AGROTOXICOS_MANUSEIO_PESSOAS","I11AGROTOXICOS_EPI_PESSOAS","I11AGROTOXICOS_ARMAZENAMENTO_ADEQUADO","I11AGROTOXICOS_DEVOLUCAO_EMBALAGENS","I11RESULTADO","I12DESCRICAO","I12ARGILA","I12MOS_DAGKG-1","I12MOS","I12P_MGDM-3","I12P","I12CALCIO_CMOLDM-3","I12CALCIO","I12MAGNESIO_CMOLDM-3","I12MAGNESIO","I12POTASSIO_MGDM-3","I12POTASSIO","I12PH_UNIDADE","I12PH","I12ALUMINIO_CMOLDM-3","I12ALUMINIO","I12CTC_EFETIVA_CMOLDM-3","I12CTC_EFETIVA","I12SATURACAO_POR_BASES_%","I12SATURACAO_POR_BASES","I12RESULTADO_PARCIAL1","I12ARILSULFATASE_MGPNITROFENOLKG-1H-1","I12BETAGLICOSIDASE_MGPNITROFENOLKG-1H-1","I12MOS_PROF010_DAGKG-1","I1IQS_BIOLOGICO","I12IQS_QUIMICO","I12SUPRIMENTO_NUTRIENTES","I12.2.7.IQS Químico ","I12.2.8.IQS FertBio","I12.2..IQS BIOLOGICO.RESULTADO PARCIAL","I12.RESULTADO","I13MONTANTE_MARGENS\n","I13JUSANTE_MARGENS\n","I13MONTANTE_ALTERACOES_ANTROPICAS\n","I13JUSANTE_ALTERACOES_ANTROPICAS\n","I13MONTANTE_SOMBREAMENTO\n","I13JUSANTE_SOMBREAMENTO\n","I13MONTANTE_EROSAO\n","I13JUSANTE_EROSAO\n","I13MONTANTE_TRANSPARENCIA\n","I13JUSANTE_TRANSPARENCIA\n","I13MONTANTE_ODOR\n","I13JUSANTE_ODOR\n","I13MONTANTE_FUNDO\n","I13JUSANTE_FUNDO\n","I13MONTANTE_ECOSSISTEMA_AQUÁTICO\n","I13JUSANTE_ECOSSISTEMA_AQUATICO\n","I13.AGUA_SUPERFICIAL_MONTANTE","I13.AGUA_SUPERFICIAL_JUSANTE","I13AGUA_SUBTERRANEA","I13RESULTADO","I14PRODUTO1","I14CULTURA1","I14AREA1","I14VOLUME_POR_HECTARE1 ","I14VOLUME_TOTAL1","I14PRINCIPIO_ATIVO1","I14POTENCIAL_CONTAMINACAO1","I14TALHAO_VULNERABILIDADE1","I14RISCO_DE_CONTAMINACAO1","I14PRODUTO2","I14CULTURA2","I14AREA2","I14VOLUME_POR_HECTARE2","I14VOLUME_TOTAL2","I14PRINCIPIO_ATIVO2","I14POTENCIAL_CONTAMINACAO2","I14TALHAO_VULNERABILIDADE2","I14RISCO_DE_CONTAMINACAO2","I14PRODUTO3","I14CULTURA3","I14AREA3","I14VOLUME_POR_HECTARE3","I14VOLUME_TOTAL3","I14PRINCIPIO_ATIVO3","I14POTENCIAL_CONTAMINACAO3","I14TALHAO_VULNERABILIDADE3","I14RISCO_DE_CONTAMINACAO3","I14CULTURA_DESCRICAO1","I14CULTURA_AREA1","I14CULTURA_RISCO_MAXIMO1","I14CULTURA_DESCRICAO2","I14CULTURA_AREA2","I14CULTURA_RISCO_MAXIMO2","I14CULTURA_DESCRICAO3","I14CULTURA_AREA3","I14CULTURA_RISCO_MAXIMO3","I14RESULTADO","I15ESTAGIO","I15AREA","I15PROPORCAO_AREA_TOTAL","I15TENDENCIA_COMPORTAMENTO","I15RESULTADO","I16PRATICAS_CONSERVACIONISTAS_SUFICIENTE\n\n\n","I16PRATICAS_CONSERVACIONISTAS_INSUFICIENTE\n\n\n","I16PRATICAS_CONSERVACIONISTAS_SITUACAO_CRITICA\n\n\n","I16SITUACAO_CRITICA_ESPECIFICACAO\n\n\n","I16AGUA_PRATICAS_CONSERVACIONISTAS_RESERVACAO\n\n\n","I16.RESULTADO","I17ESTRADAS_DRENAGEM\n","I17ESTRADAS_LOMBADAS\n","I17ESTRADAS_CAIXAS_INFILTRACAO\n","I17ESTRADAS_BURACOS\n","I17ESTRADAS_SULCOS_DE_EROSAO\n","I17PONTO_CRITICO\n","I17PONTO_CRITICO_DESCRICAO\n","I17RESULTADO","I18FITOFISIONOMIA1\n","I18FITOFISIONOMIA_ESTAGIO_SUCESSIONAL_AVANCADO1\n","I18FITOFISIONOMIA_ESTAGIO_SUCESSIONAL_MEDIO1\n","I18FITOFISIONOMIA_ESTAGIO_SUCESSIONAL_INICIAL1\n","I18FITOFISIONOMIA2\n","I18FITOFISIONOMIA_ESTAGIO_SUCESSIONAL_AVANCADO2\n","I18FITOFISIONOMIA_ESTAGIO_SUCESSIONAL_MEDIO2\n","I18FITOFISIONOMIA_ESTAGIO_SUCESSIONAL_INICIAL2\n","I18FITOFISIONOMIA3\n","I18FITOFISIONOMIA_ESTAGIO_SUCESSIONAL_AVANCADO3\n","I18FITOFISIONOMIA_ESTAGIO_SUCESSIONAL_MEDIO3\n","I18FITOFISIONOMIA_ESTAGIO_SUCESSIONAL_INICIAL3\n","I18FITOFISIONOMIA4\n","I18FITOFISIONOMIA_ESTAGIO_SUCESSIONAL_AVANCADO4\n","I18FITOFISIONOMIA_ESTAGIO_SUCESSIONAL_MEDIO4\n","I18FITOFISIONOMIA_ESTAGIO_SUCESSIONAL_INICIAL4\n","I18FRAGMENTOS_VEGETACAO_NATIVA\n","I18CONEXAO_FRAGMENTOS\n","I18PROTECAO_INCENDIO_PASTOREIO\n","I18RESULTADO","I19APP_USO_CONSOLIDADO_VEGETACAO_NATIVA","I19APP_RECOMPOSICAO","I19APP_PROTECAO_CONSERVACAO","19RESULTADO","I20RL","I20VEGETACAO_NATIVA_EXCEDENTE","I20RL_FORA_DO_IMOVEL_RURAL","I20RL_NAO_PASSIVEL_DE_RECOMPOSICAO","I20RL_NECESSITA_RECOMPOSICAO","I20RESULTADO","I21PRATICAS_INDUCAO_AGROBIODIVERSIDADE_SUFICIENTE\n\n\n","I21PRATICAS_INDUCAO_AGROBIODIVERSIDADE_INSUFICIENTE\n\n\n","I21PRATICAS_INDUCAO_AGROBIODIVERSIDADE_SITUACAO_CRITICA\n\n\n","I21SITUACAO_CRITICA_ESPECIFICACAO\n\n\n","I21INDUCAO_AGROBIODIVERSIDADE_RESULTADO\n\n\n","I21INDICE_SHANON","I21INDICE_SHANON_RESULTADO","I21AREAS_LIMITROFES_PRESSAO_DE_MONOCULTIVOS","I21RESULTADO","INDICE_SUSTENTABILIDADE","DESVIO_PADRAO","I1PRODUTIVIDADE","I2DIVERSIFICACAO_DA_RENDA","I3_EVOLUCAO_PATRIMONIAL","I4_GRAU_DE_ENDIVIDAMENTO","I5_SERVICOS_BASICOS_SEGURANCA_ALIMENTAR","I6ESCOLARIDADE_CAPACITACAO","I7QUALIDADE_DO_EMPREGO","I8GESTAO","I9COMERCIALIZACAO_INOVACAO","I10GERENCIAMENTO_RESIDUOS","I11SEGURANCA_DO_TRABALHO","I12SAUDE_DO_SOLO","I13QUALIDADE_DA_AGUA","I14RISCO_DE_CONTAMINACAO_DA_AGUA","I15AVALIACAO_SOLOS_DEGRADADOS","I16PRATICAS_CONSERVACAO","I17ESTRADAS","I18FITOFISIONOMIAS","I19APPS","I20RESERVA_LEGAL","I21DIVERSIFICACAO_DA_PAISAGEM","R1RENDA_BRUTA_ANUAL","R1RENDA_BRUTA_ANUAL_R$HA-1 ","R1RENDA_BRUTA_ANUAL_ESTIMATIVA_PATRIMONIAL-1 ","R1TERRA_VALOR_DE_REFERENCIA","R1ESTIMATIVA_PATRIMONIAL","R1EVOLUCAO_PATRIMONIAL_SEM_VALORIZACAO_DA_TERRA","R1QTE_AGROTOXICOS_AREA_CULTIVADA-1","R1IEQ_CUMULATIVO","R1NUMERO_DE_PRODUTOS_COMERCIAIS","R1IEQ_MEDIO","R1IEQ_MAX","R1IEQ_TRABALHADOR_RURAL_MEDIO","R1IEQ_TRABALHADOR_RURAL_MAX","R1IEQ_CONSUMIDOR_MEDIO","R1IEQ_CONSUMIDOR_MAX","R1IEQ_MEIO_AMBIENTE_MEDIO","R1IEQ_MEIO_AMBIENTE_MAX","R1PROPORCAO_PRODUTOS_UTILIZADOS_BANIDOS_UNIAO_EUROPEIA"]
[{"$f":"COUNTA(C22:NX22)","v":386},null,{"$f":"'1 Questionário'!C34","v":"00:00:00"},{"$f":"'1 Questionário'!C38","v":0},{"$f":"'1 Questionário'!C40","v":0},{"$f":"'1 Questionário'!C44","v":0},{"$f":"'1 Questionário'!C46","v":0},{"$f":"'1 Questionário'!C48","v":0},{"$f":"'1 Questionário'!C52","v":0},{"$f":"'1 Questionário'!C54","v":0},{"$f":"'1 Questionário'!C56","v":0},{"$f":"'1 Questionário'!C58","v":0},{"$f":"'1 Questionário'!D62","v":0},{"$f":"'1 Questionário'!D64","v":0},{"$f":"'1 Questionário'!D66","v":0},{"$f":"'1 Questionário'!D70","v":0},{"$f":"'1 Questionário'!D72","v":0},{"$f":"'1 Questionário'!D76","v":0},{"$f":"'1 Questionário'!D79","v":0},{"$f":"'1 Questionário'!D81","v":0},{"$f":"'1 Questionário'!D86","v":0},{"$f":"'1 Questionário'!D87","v":0},{"$f":"'1 Questionário'!D88","v":0},{"$f":"'1 Questionário'!D89","v":0},{"$f":"'1 Questionário'!D90","v":0},{"$f":"'1 Questionário'!D91","v":0},{"$f":"'1 Questionário'!D92","v":0},{"$f":"'1 Questionário'!D93","v":0},{"$f":"'1 Questionário'!D94","v":0},{"$f":"'1 Questionário'!H94","v":{"v":0,"d":"0.00"}},{"$f":"'1 Questionário'!D99","v":{"v":0,"d":"0.00"}},{"$f":"'1 Questionário'!D101","v":{"v":0,"d":"0.00"}},{"$f":"'1 Questionário'!D72*'1 Questionário'!E105","v":{"v":0,"d":"0.00"}},{"$f":"'1 Questionário'!E106","v":{"v":0,"d":"0.00"}},{"$f":"'1 Questionário'!E110","v":0},{"$f":"'1 Questionário'!E111","v":0},{"$f":"'1 Questionário'!E112","v":0},{"$f":"'1 Questionário'!E113","v":0},{"$f":"'1 Questionário'!E117","v":0},{"$f":"'1 Questionário'!E118","v":0},{"$f":"'1 Questionário'!E121","v":0},{"$f":"'1 Questionário'!E123","v":0},{"$f":"'1 Questionário'!E127","v":0},{"$f":"'1 Questionário'!E129","v":0},{"$f":"'1 Questionário'!C136","v":0},{"$f":"'1 Questionário'!C138","v":0},{"$f":"'1 Questionário'!C140","v":0},{"$f":"'2 Indicadores'!C9","v":0},{"$f":"'2 Indicadores'!D9","v":0},{"$f":"'2 Indicadores'!C10","v":0},{"$f":"'2 Indicadores'!D10","v":0},{"$f":"'2 Indicadores'!C11","v":0},{"$f":"'2 Indicadores'!D11","v":0},{"$f":"'2 Indicadores'!D15","v":0},{"$f":"'2 Indicadores'!D16","v":0},{"$f":"'2 Indicadores'!D17","v":0},{"$f":"'2 Indicadores'!D18","v":0},{"$f":"'2 Indicadores'!D19","v":0},{"$f":"'2 Indicadores'!D20","v":0},{"$f":"'2 Indicadores'!E15","v":0},{"$f":"'2 Indicadores'!E16","v":0},{"$f":"'2 Indicadores'!E17","v":0},{"$f":"'2 Indicadores'!E18","v":0},{"$f":"'2 Indicadores'!E19","v":0},{"$f":"'2 Indicadores'!E20","v":0},{"$f":"'2 Indicadores'!F15","v":0},{"$f":"'2 Indicadores'!F16","v":0},{"$f":"'2 Indicadores'!F17","v":0},{"$f":"'2 Indicadores'!F18","v":0},{"$f":"'2 Indicadores'!F19","v":0},{"$f":"'2 Indicadores'!F20","v":0},{"$f":"'2 Indicadores'!C23","v":{"v":0,"d":"0.00"}},{"$f":"'2 Indicadores'!C29","v":0},{"$f":"'2 Indicadores'!D29","v":0},{"$f":"'2 Indicadores'!C30","v":0},{"$f":"'2 Indicadores'!D30","v":0},{"$f":"'2 Indicadores'!C31","v":0},{"$f":"'2 Indicadores'!D31","v":0},{"$f":"'2 Indicadores'!D35","v":0},{"$f":"'2 Indicadores'!D36","v":0},{"$f":"'2 Indicadores'!F40","v":{"$error":"#DIV/0!"}},{"$f":"'2 Indicadores'!F41","v":{"$error":"#DIV/0!"}},{"$f":"'2 Indicadores'!F42","v":{"$error":"#DIV/0!"}},{"$f":"'2 Indicadores'!F43","v":{"$error":"#DIV/0!"}},{"$f":"'2 Indicadores'!F44:F44","v":{"$error":"#DIV/0!"}},{"$f":"'2 Indicadores'!C46","v":{"$error":"#DIV/0!"}},{"$f":"'2 Indicadores'!D50","v":1},{"$f":"'2 Indicadores'!B55","v":0},{"$f":"'2 Indicadores'!C55","v":{"v":1E-3,"d":"R$ 0.00"}},{"$f":"'2 Indicadores'!B60","v":0},{"$f":"'2 Indicadores'!C60","v":{"v":1E-3,"d":"R$ 0.00"}},{"$f":"'2 Indicadores'!D61","v":{"v":2E-3,"d":"R$ 0.00"}},{"$f":"'2 Indicadores'!B65","v":0},{"$f":"'2 Indicadores'!C65","v":{"v":1E-3,"d":"R$ 0.00"}},{"$f":"'2 Indicadores'!B70","v":0},{"$f":"'2 Indicadores'!C70","v":{"v":1E-3,"d":"R$ 0.00"}},{"$f":"'2 Indicadores'!D71","v":{"v":2E-3,"d":"R$ 0.00"}},{"$f":"'2 Indicadores'!D77","v":{"v":1E-3,"d":"R$ 0.00"}},{"$f":"'2 Indicadores'!F77","v":{"v":1E-3,"d":"R$ 0.00"}},{"$f":"'2 Indicadores'!B81","v":0},{"$f":"'2 Indicadores'!C81","v":{"v":0,"d":"0.0"}},{"$f":"'2 Indicadores'!D81","v":{"v":0,"d":"0.0"}},{"$f":"'2 Indicadores'!C94","v":0},{"$f":"'2 Indicadores'!D94","v":0},{"$f":"'2 Indicadores'!C98","v":0},{"$f":"'2 Indicadores'!D98","v":0},{"$f":"'2 Indicadores'!C102","v":{"$error":"#DIV/0!"}},{"$f":"'2 Indicadores'!D102","v":{"$error":"#DIV/0!"}},{"$f":"'2 Indicadores'!F107","v":""},{"$f":"'2 Indicadores'!F108","v":{"v":0.9199938560196605,"d":"92.0%"}},{"$f":"'2 Indicadores'!F109","v":{"v":0.8999992400003041,"d":"90.0%"}},{"$f":"'2 Indicadores'!F110","v":{"v":0,"d":"0.0%"}},{"$f":"'2 Indicadores'!F111","v":{"$error":"#DIV/0!"}},{"$f":"'2 Indicadores'!F112","v":{"$error":"#DIV/0!"}},{"$f":"'2 Indicadores'!F113","v":{"$error":"#DIV/0!"}},{"$f":"'2 Indicadores'!C115","v":{"$error":"#DIV/0!"}},{"$f":"'2 Indicadores'!E120","v":0},{"$f":"'2 Indicadores'!E121","v":{"$error":"#DIV/0!"}},{"$f":"'2 Indicadores'!C123","v":{"$error":"#DIV/0!"}},{"$f":"'2 Indicadores'!D127","v":0},{"$f":"IF(SUM('2 Indicadores'!$E$131:$E$138)=0,'2 Indicadores'!D131,('2 Indicadores'!D131+'2 Indicadores'!E131)/2)","v":0},{"$f":"IF(SUM('2 Indicadores'!$E$131:$E$138)=0,'2 Indicadores'!D132,('2 Indicadores'!D132+'2 Indicadores'!E132)/2)","v":0},{"$f":"IF(SUM('2 Indicadores'!$E$131:$E$138)=0,'2 Indicadores'!D133,('2 Indicadores'!D133+'2 Indicadores'!E133)/2)","v":0},{"$f":"IF(SUM('2 Indicadores'!$E$131:$E$138)=0,'2 Indicadores'!D134,('2 Indicadores'!D134+'2 Indicadores'!E134)/2)","v":0},{"$f":"IF(SUM('2 Indicadores'!$E$131:$E$138)=0,'2 Indicadores'!D135,('2 Indicadores'!D135+'2 Indicadores'!E135)/2)","v":0},{"$f":"IF(SUM('2 Indicadores'!$E$131:$E$138)=0,'2 Indicadores'!D136,('2 Indicadores'!D136+'2 Indicadores'!E136)/2)","v":0},{"$f":"IF(SUM('2 Indicadores'!$E$131:$E$138)=0,'2 Indicadores'!D137,('2 Indicadores'!D137+'2 Indicadores'!E137)/2)","v":0},{"$f":"IF(SUM('2 Indicadores'!$E$131:$E$138)=0,'2 Indicadores'!D138,('2 Indicadores'!D138+'2 Indicadores'!E138)/2)","v":0},{"$f":"'2 Indicadores'!C140","v":{"v":0,"d":"0.00"}},{"$f":"IF(SUM('2 Indicadores'!$E$144:$E$146)=0,'2 Indicadores'!D144,('2 Indicadores'!D144+'2 Indicadores'!E144)/2)","v":0},{"$f":"IF(SUM('2 Indicadores'!$E$144:$E$146)=0,'2 Indicadores'!D145,('2 Indicadores'!D145+'2 Indicadores'!E145)/2)","v":0},{"$f":"IF(SUM('2 Indicadores'!$E$144:$E$146)=0,'2 Indicadores'!D146,('2 Indicadores'!D146+'2 Indicadores'!E146)/2)","v":0},{"$f":"'2 Indicadores'!C147","v":{"v":0,"d":"0.00"}},{"$f":"'2 Indicadores'!C149","v":{"v":0,"d":"0.00"}},{"$f":"'2 Indicadores'!D154","v":0},{"$f":"'2 Indicadores'!D155","v":0},{"$f":"'2 Indicadores'!D156","v":0},{"$f":"'2 Indicadores'!D157","v":0},{"$f":"'2 Indicadores'!D158","v":0},{"$f":"'2 Indicadores'!E154","v":0},{"$f":"'2 Indicadores'!E155","v":0},{"$f":"'2 Indicadores'!E156","v":0},{"$f":"'2 Indicadores'!E157","v":0},{"$f":"'2 Indicadores'!E158","v":0},{"$f":"'2 Indicadores'!D162","v":0},{"$f":"'2 Indicadores'!D163","v":0},{"$f":"'2 Indicadores'!E162","v":0},{"$f":"'2 Indicadores'!E163","v":0},{"$f":"'2 Indicadores'!D168","v":0},{"$f":"'2 Indicadores'!D169","v":0},{"$f":"'2 Indicadores'!E168","v":0},{"$f":"'2 Indicadores'!E169","v":0},{"$f":"'2 Indicadores'!C171","v":{"$error":"#DIV/0!"}},{"$f":"'2 Indicadores'!E177+'2 Indicadores'!F177","v":0},{"$f":"'2 Indicadores'!E178+'2 Indicadores'!F178","v":0},{"$f":"'2 Indicadores'!E179+'2 Indicadores'!F179","v":0},{"$f":"'2 Indicadores'!E184","v":0},{"$f":"'2 Indicadores'!E185","v":0},{"$f":"'2 Indicadores'!E186","v":0},{"$f":"'2 Indicadores'!E187","v":0},{"$f":"'2 Indicadores'!E188","v":0},{"$f":"'2 Indicadores'!E189","v":0},{"$f":"'2 Indicadores'!E190","v":0},{"$f":"'2 Indicadores'!E191","v":0},{"$f":"IF('2 Indicadores'!F177>0,'2 Indicadores'!F177/('2 Indicadores'!F177+'2 Indicadores'!E177),\"\")","v":""},{"$f":"'2 Indicadores'!C193","v":{"v":0.7,"d":"0.70"}},{"$f":"'2 Indicadores'!E198","v":0},{"$f":"'2 Indicadores'!E199","v":0},{"$f":"'2 Indicadores'!E200","v":0},{"$f":"'2 Indicadores'!E201","v":0},{"$f":"'2 Indicadores'!E202","v":0},{"$f":"'2 Indicadores'!E203","v":0},{"$f":"'2 Indicadores'!E204","v":0},{"$f":"'2 Indicadores'!E205","v":0},{"$f":"'2 Indicadores'!C208","v":{"v":0,"d":"0.00"}},{"$f":"'2 Indicadores'!E213","v":0},{"$f":"'2 Indicadores'!E214","v":0},{"$f":"'2 Indicadores'!E217","v":0},{"$f":"'2 Indicadores'!E218","v":0},{"$f":"'2 Indicadores'!E219","v":0},{"$f":"'2 Indicadores'!E220","v":0},{"$f":"'2 Indicadores'!D224","v":0},{"$f":"'2 Indicadores'!E224","v":{"v":0,"d":"0%"}},{"$f":"'2 Indicadores'!D225","v":0},{"$f":"'2 Indicadores'!E225","v":{"v":0,"d":"0%"}},{"$f":"'2 Indicadores'!C228","v":{"v":0,"d":"0.00"}},{"$f":"'2 Indicadores'!D234","v":0},{"$f":"'2 Indicadores'!E234","v":0},{"$f":"'2 Indicadores'!D235","v":0},{"$f":"'2 Indicadores'!E235","v":0},{"$f":"'2 Indicadores'!F238","v":{"v":0,"d":"0%"}},{"$f":"IF('2 Indicadores'!F241=\"\",\"sem efluente\",'2 Indicadores'!F241)","v":"sem efluente"},{"$f":"IF('2 Indicadores'!F242=\"\",\"sem efluente\",'2 Indicadores'!F242)","v":"sem efluente"},{"$f":"'2 Indicadores'!F245","v":0},{"$f":"'2 Indicadores'!F246","v":0},{"$f":"'2 Indicadores'!C248","v":{"v":0.7,"d":"0.70"}},{"$f":"'2 Indicadores'!E253","v":0},{"$f":"'2 Indicadores'!E254","v":0},{"$f":"'2 Indicadores'!E256","v":0},{"$f":"'2 Indicadores'!E257","v":0},{"$f":"'2 Indicadores'!C259","v":{"v":0.7,"d":"0.70"}},{"$f":"'2 Indicadores'!C263","v":0},{"$f":"'2 Indicadores'!C265/100","v":{"v":0,"d":"0%"}},{"$f":"'2 Indicadores'!C266","v":{"v":0,"d":"0.00"}},{"$f":"'2 Indicadores'!E266","v":{"v":0,"d":"0.00"}},{"$f":"'2 Indicadores'!C267","v":{"v":0,"d":"0.00"}},{"$f":"'2 Indicadores'!E267","v":{"v":0,"d":"0.00"}},{"$f":"'2 Indicadores'!C268","v":0},{"$f":"'2 Indicadores'!E268","v":{"v":0,"d":"0.00"}},{"$f":"'2 Indicadores'!C269","v":0},{"$f":"'2 Indicadores'!E269","v":{"v":0,"d":"0.00"}},{"$f":"'2 Indicadores'!C270","v":0},{"$f":"'2 Indicadores'!E270","v":{"v":0,"d":"0.00"}},{"$f":"'2 Indicadores'!C271","v":0},{"$f":"'2 Indicadores'!E271","v":{"v":0,"d":"0.00"}},{"$f":"'2 Indicadores'!C272","v":0},{"$f":"'2 Indicadores'!E272","v":{"v":0,"d":"0.00"}},{"$f":"'2 Indicadores'!C273","v":0},{"$f":"'2 Indicadores'!E273","v":{"v":0,"d":"0.00"}},{"$f":"'2 Indicadores'!C274","v":0},{"$f":"'2 Indicadores'!E274","v":{"v":0,"d":"0.00"}},{"$f":"'2 Indicadores'!C295","v":{"v":0,"d":"0.00"}},{"$f":"'2 Indicadores'!C278","v":0},{"$f":"'2 Indicadores'!C279","v":0},{"$f":"'2 Indicadores'!C280","v":{"v":0,"d":"0.00"}},{"$f":"'2 Indicadores'!C281","v":{"v":0,"d":"0.00"}},{"$f":"'2 Indicadores'!C282","v":{"v":0,"d":"0.00"}},{"$f":"'2 Indicadores'!C283","v":{"v":0,"d":"0.00"}},{"$f":"'2 Indicadores'!C284","v":{"v":0,"d":"0.00"}},{"$f":"'2 Indicadores'!C285","v":{"v":0,"d":"0.00"}},{"$f":"'2 Indicadores'!C286","v":{"v":0,"d":"0.00"}},{"$f":"'2 Indicadores'!C295","v":{"v":0,"d":"0.00"}},{"$f":"'2 Indicadores'!D302","v":0},{"$f":"'2 Indicadores'!D303","v":0},{"$f":"'2 Indicadores'!D304","v":0},{"$f":"'2 Indicadores'!D305","v":0},{"$f":"'2 Indicadores'!D306","v":0},{"$f":"'2 Indicadores'!D307","v":0},{"$f":"'2 Indicadores'!D308","v":0},{"$f":"'2 Indicadores'!D309","v":0},{"$f":"'2 Indicadores'!D310","v":0},{"$f":"'2 Indicadores'!D311","v":0},{"$f":"'2 Indicadores'!D312","v":0},{"$f":"'2 Indicadores'!D313","v":0},{"$f":"'2 Indicadores'!D314","v":0},{"$f":"'2 Indicadores'!D315","v":0},{"$f":"'2 Indicadores'!D329","v":{"v":0,"d":"0.00"}},{"$f":"'2 Indicadores'!D330","v":{"v":0,"d":"0.00"}},{"$f":"'2 Indicadores'!D332","v":{"v":0,"d":"0.00"}},{"$f":"'2 Indicadores'!D333","v":{"v":0,"d":"0.00"}},{"$f":"'2 Indicadores'!D341","v":""},{"$f":"'2 Indicadores'!C343","v":{"v":0,"d":"0.00"}},{"$f":"'2 Indicadores'!D348","v":0},{"$f":"'2 Indicadores'!D350","v":0},{"$f":"'2 Indicadores'!D351","v":0},{"$f":"'2 Indicadores'!D352","v":0},{"$f":"'2 Indicadores'!D353","v":0},{"$f":"'2 Indicadores'!D354","v":""},{"$f":"'2 Indicadores'!D361","v":""},{"$f":"'2 Indicadores'!D372","v":""},{"$f":"'2 Indicadores'!D373","v":""},{"$f":"'2 Indicadores'!E348","v":0},{"$f":"'2 Indicadores'!E350","v":0},{"$f":"'2 Indicadores'!E351","v":0},{"$f":"'2 Indicadores'!E352","v":0},{"$f":"'2 Indicadores'!E353","v":0},{"$f":"'2 Indicadores'!E354","v":""},{"$f":"'2 Indicadores'!E361","v":""},{"$f":"'2 Indicadores'!E372","v":""},{"$f":"'2 Indicadores'!E373","v":""},{"$f":"'2 Indicadores'!F348","v":0},{"$f":"'2 Indicadores'!F350","v":0},{"$f":"'2 Indicadores'!F351","v":0},{"$f":"'2 Indicadores'!F352","v":0},{"$f":"'2 Indicadores'!F353","v":0},{"$f":"'2 Indicadores'!F354","v":""},{"$f":"'2 Indicadores'!F361","v":""},{"$f":"'2 Indicadores'!F372","v":""},{"$f":"'2 Indicadores'!F373","v":""},{"$f":"'2 Indicadores'!D376","v":0},{"$f":"'2 Indicadores'!D377","v":0},{"$f":"'2 Indicadores'!D378","v":0},{"$f":"'2 Indicadores'!E376","v":0},{"$f":"'2 Indicadores'!E377","v":0},{"$f":"'2 Indicadores'!E378","v":0},{"$f":"'2 Indicadores'!F376","v":0},{"$f":"'2 Indicadores'!F377","v":0},{"$f":"'2 Indicadores'!F378","v":0},{"$f":"'2 Indicadores'!C379","v":{"v":1,"d":"1.00"}},{"$f":"'2 Indicadores'!D384","v":{"v":0,"d":"0.00"}},{"$f":"'2 Indicadores'!E384","v":{"v":0,"d":"0.00"}},{"$f":"'2 Indicadores'!F384","v":" "},{"$f":"'2 Indicadores'!D387","v":0},{"$f":"'2 Indicadores'!C390","v":{"v":0.7,"d":"0.70"}},{"$f":"SUM('2 Indicadores'!D396:G396)","v":{"v":0,"d":"0.00"}},{"$f":"SUM('2 Indicadores'!D398:G398)","v":{"v":0,"d":"0.00"}},{"$f":"SUM('2 Indicadores'!D399:G399)","v":{"v":0,"d":"0.00"}},{"$f":"'2 Indicadores'!D400","v":0},{"$f":"'2 Indicadores'!D403","v":0},{"$f":"'2 Indicadores'!C407","v":""},{"$f":"'2 Indicadores'!E412","v":{"v":0,"d":"0%"}},{"$f":"'2 Indicadores'!E413","v":{"v":0,"d":"0%"}},{"$f":"'2 Indicadores'!E414","v":{"v":0,"d":"0%"}},{"$f":"'2 Indicadores'!E417","v":{"v":0,"d":"0%"}},{"$f":"'2 Indicadores'!E418","v":{"v":0,"d":"0%"}},{"$f":"IF('2 Indicadores'!E421=\"x\",1,0)","v":0},{"$f":"'2 Indicadores'!E422","v":0},{"$f":"'2 Indicadores'!C424","v":{"v":0,"d":"0.00"}},{"$f":"'2 Indicadores'!D428","v":0},{"$f":"'2 Indicadores'!D429","v":0},{"$f":"'2 Indicadores'!D430","v":0},{"$f":"'2 Indicadores'!D431","v":0},{"$f":"'2 Indicadores'!E428","v":0},{"$f":"'2 Indicadores'!E429","v":0},{"$f":"'2 Indicadores'!E430","v":0},{"$f":"'2 Indicadores'!E431","v":0},{"$f":"'2 Indicadores'!F428","v":0},{"$f":"'2 Indicadores'!F429","v":0},{"$f":"'2 Indicadores'!F430","v":0},{"$f":"'2 Indicadores'!F431","v":0},{"$f":"'2 Indicadores'!G428","v":0},{"$f":"'2 Indicadores'!G429","v":0},{"$f":"'2 Indicadores'!G430","v":0},{"$f":"'2 Indicadores'!G431","v":0},{"$f":"'2 Indicadores'!F435","v":0},{"$f":"'2 Indicadores'!F438","v":0},{"$f":"'2 Indicadores'!F441","v":0},{"$f":"'2 Indicadores'!C443","v":{"v":0,"d":"0.00"}},{"$f":"'2 Indicadores'!G448","v":{"v":0,"d":"0.00"}},{"$f":"'2 Indicadores'!G449","v":{"v":0,"d":"0.00"}},{"$f":"'2 Indicadores'!G452","v":{"v":0,"d":"0.0%"}},{"$f":"'2 Indicadores'!C454","v":{"v":0,"d":"0.00"}},{"$f":"'1 Questionário'!D72*'1 Questionário'!E105","v":{"v":0,"d":"0.00"}},{"$f":"'2 Indicadores'!F462","v":{"v":0,"d":"0.00"}},{"$f":"'2 Indicadores'!F463","v":{"v":0,"d":"0.00"}},{"$f":"'2 Indicadores'!F464","v":{"v":0,"d":"0.00"}},{"$f":"'2 Indicadores'!F465","v":{"v":0,"d":"0.00"}},{"$f":"'2 Indicadores'!C468","v":{"$error":"#DIV/0!"}},{"$f":"SUM('2 Indicadores'!D474:G474)","v":{"v":0,"d":"0.00"}},{"$f":"SUM('2 Indicadores'!D476:G476)","v":{"v":0,"d":"0.00"}},{"$f":"SUM('2 Indicadores'!D477:G477)","v":{"v":0,"d":"0.00"}},{"$f":"'2 Indicadores'!D478","v":0},{"$f":"'2 Indicadores'!C481","v":{"$error":"#DIV/0!"}},{"$f":"'2 Indicadores'!E483","v":{"$error":"#DIV/0!"}},{"$f":"'2 Indicadores'!C484","v":{"$error":"#DIV/0!"}},{"$f":"IF('2 Indicadores'!G486=\"x\",1,0)","v":0},{"$f":"'2 Indicadores'!C488","v":{"$error":"#DIV/0!"}},{"$f":"'3 Relatório'!Q68","v":""},{"$f":"'3 Relatório'!P67","v":{"$error":"#DIV/0!"}},{"$f":"'3 Relatório'!Q69","v":{"v":0,"d":"0.00"}},{"$f":"'3 Relatório'!Q70","v":{"$error":"#DIV/0!"}},{"$f":"'3 Relatório'!Q71","v":{"$error":"#DIV/0!"}},{"$f":"'3 Relatório'!Q72","v":{"$error":"#DIV/0!"}},{"$f":"'3 Relatório'!Q73","v":{"v":0,"d":"0.00"}},{"$f":"'3 Relatório'!Q74","v":{"$error":"#DIV/0!"}},{"$f":"'3 Relatório'!Q75","v":{"v":0.7,"d":"0.70"}},{"$f":"'3 Relatório'!Q76","v":{"v":0,"d":"0.00"}},{"$f":"'3 Relatório'!Q77","v":{"v":0,"d":"0.00"}},{"$f":"'3 Relatório'!Q78","v":{"v":0.7,"d":"0.70"}},{"$f":"'3 Relatório'!Q79","v":{"v":0.7,"d":"0.70"}},{"$f":"'3 Relatório'!Q80","v":{"v":0,"d":"0.00"}},{"$f":"'3 Relatório'!Q81","v":{"v":0,"d":"0.00"}},{"$f":"'3 Relatório'!Q82","v":{"v":1,"d":"1.00"}},{"$f":"'3 Relatório'!Q83","v":{"v":0.7,"d":"0.70"}},{"$f":"'3 Relatório'!Q84","v":""},{"$f":"'3 Relatório'!Q85","v":{"v":0,"d":"0.00"}},{"$f":"'3 Relatório'!Q86","v":{"v":0,"d":"0.00"}},{"$f":"'3 Relatório'!Q87","v":{"v":0,"d":"0.00"}},{"$f":"'3 Relatório'!Q88","v":{"$error":"#DIV/0!"}},{"$f":"'3 Relatório'!Q89","v":{"$error":"#DIV/0!"}},{"$f":"'3 Relatório'!K42","v":{"$error":"#DIV/0!"}},{"$f":"'3 Relatório'!K39","v":{"$error":"#DIV/0!"}},{"$f":"'3 Relatório'!K41","v":{"$error":"#DIV/0!"}},{"$f":"'3 Relatório'!J95","v":0},{"$f":"'3 Relatório'!J96","v":0},{"$f":"'3 Relatório'!K46","v":{"$error":"#DIV/0!"}},{"$f":"'3 Relatório'!K51","v":""},{"$f":"'3 Relatório'!K53","v":0},{"$f":"COUNTA('2 Indicadores'!D348:F348,Fórmulas!D391:L391,Fórmulas!D420:L420,Fórmulas!D448:I448)","v":0},{"$f":"NN23/NO23","v":{"$error":"#DIV/0!"}},{"$f":"MAX('2 Indicadores'!D365:F365,Fórmulas!D409:L409,Fórmulas!D438:L438,Fórmulas!D466:I466)","v":{"v":0,"d":"0.0"}},{"$f":"AVERAGE('2 Indicadores'!D362:F362,Fórmulas!D406:L406,Fórmulas!D435:L435,Fórmulas!D463:I463)","v":{"$error":"#DIV/0!"}},{"$f":"MAX('2 Indicadores'!D362:F362,Fórmulas!D406:L406,Fórmulas!D435:L435,Fórmulas!D463:I463)","v":{"v":0,"d":"0.0"}},{"$f":"AVERAGE('2 Indicadores'!D363:F363,Fórmulas!D407:L407,Fórmulas!D436:L436,Fórmulas!D464:I464)","v":{"$error":"#DIV/0!"}},{"$f":"MAX('2 Indicadores'!D363:F363,Fórmulas!D407:L407,Fórmulas!D436:L436,Fórmulas!D464:I464)","v":{"v":0,"d":"0.0"}},{"$f":"AVERAGE('2 Indicadores'!D364:F364,Fórmulas!D408:L408,Fórmulas!D437:L437,Fórmulas!D465:I465)","v":{"$error":"#DIV/0!"}},{"$f":"MAX('2 Indicadores'!D364:F364,Fórmulas!D408:L408,Fórmulas!D437:L437,Fórmulas!D465:I465)","v":{"v":0,"d":"0.0"}},{"$f":"Fórmulas!N468/'Base de dados'!NO23","v":{"$error":"#DIV/0!"}}]
[]
[{"$nulls":20},"Áreas não aproveitáveis",{"$f":"AC23/AD23","v":{"$error":"#DIV/0!"}},{"$nulls":272},{"$f":"KI23","v":{"v":0,"d":"0.0"}},{"$f":"KJ23","v":{"v":0,"d":"0.0"}},{"v":0,"d":"0.0"},{"$nulls":41},{"$f":"MA23","v":{"v":0,"d":"0.0"}},{"$f":"MB23","v":{"v":0,"d":"0.0"}},{"v":0,"d":"0.0"}]
[null,null,"REFERÊNCIAS",{"$nulls":17},"Pousio",{"$f":"Z23/AD23","v":{"$error":"#DIV/0!"}},{"$nulls":98},"Coleta de Lixo",{"$f":"DX23","v":{"v":0,"d":"0.0%"}},{"$nulls":172},{"$f":"KI25","v":{"v":0,"d":"0.0"}},{"$f":"KJ25","v":{"v":0,"d":"0.0"}},{"$f":"KK25","v":{"v":0,"d":"0.0"}},{"$nulls":41},{"$f":"MA25","v":{"v":0,"d":"0.0"}},{"$f":"MB25","v":{"v":0,"d":"0.0"}},{"$f":"MC25","v":{"v":0,"d":"0.0"}}]
[{"$nulls":20},"Área não agrícola",{"$f":"Y23/AD23","v":{"$error":"#DIV/0!"}},{"$nulls":86},"Valorização da terra",{"$f":"DE23","v":""},{"$nulls":10},"Segurança Zona Rural",{"$f":"DV23","v":{"v":0,"d":"0.0%"}},{"$nulls":22},"Integrantes da Família (curta duração)","Família (longa duração)","Colaboradores (curta duração)","Colaboradores (longa duração)",{"$nulls":18},"Crédito Comercialização",{"$f":"FR23","v":{"v":0,"d":"0.0%"}},{"$nulls":7},"Comercialização Informação Diversificação venda",{"$f":"FT23","v":0},{"$nulls":55},"Montante",{"$nulls":61},{"$f":"KI26/$KI$28","v":{"$error":"#DIV/0!"}},{"$f":"KJ26/$KI$28","v":{"$error":"#DIV/0!"}},{"$f":"KK26/$KI$28","v":{"$error":"#DIV/0!"}},{"$nulls":3},"Drenagem Abaulamento (%)",{"$f":"KO23","v":{"v":0,"d":"0%"}},{"$nulls":36},{"$f":"MA26/$KI$28","v":{"$error":"#DIV/0!"}},{"$f":"MB26/$KI$28","v":{"$error":"#DIV/0!"}},{"$f":"MC26/$KI$28","v":{"$error":"#DIV/0!"}}]
[null,null,"Astier, M., García-Barrios, L., Galván-Miyoshi, Y., González-Esquivel, C. E., & Masera, O. R. (2012). Assessing the sustainability of small farmer natural resource management systems. A critical analysis of the MESMIS program (1995-2010). Ecology and society, 17(3). http://dx.doi.org/10.5751/ES-04910-170325 ",{"$nulls":17},"Corpos d'água",{"$f":"AA23/AD23","v":{"$error":"#DIV/0!"}},{"$nulls":60},"Pensão; aposent; outras fontes",null,{"$f":"CF23","v":{"$error":"#DIV/0!"}},null,null,"Benfeitorias",{"$f":"CN23","v":{"v":2E-3,"d":"R$ 0.00"}},{"$f":"CK28/$CK$32","v":{"$error":"#DIV/0!"}},{"$nulls":18},"Benfeitorias",{"$f":"DF23","v":{"v":0.9199938560196605,"d":"92.0%"}},{"$nulls":10},"Internet",{"$f":"DW23","v":{"v":0,"d":"0.0%"}},{"$nulls":22},{"$f":"IF(EE23=0,\"\",EO23/EE23)","v":""},{"$f":"IF(EE23=0,\"\",EP23/EE23)","v":""},{"$f":"IF(EJ23=0,\"\",EQ23/EJ23)","v":""},{"$f":"IF(EJ23=0,\"\",ER23/EJ23)","v":""},{"$nulls":18},"Crédito Custeio",{"$f":"FQ23","v":{"v":0,"d":"0.0%"}},{"$nulls":7},"Inovação Adoção",{"$f":"FV23","v":0},{"$nulls":15},"Coleta/Destinação adequada Ef. Gasosos",{"$f":"IF('2 Indicadores'!F242=\"\",\"\",'2 Indicadores'!F242)","v":""},{"$nulls":38},"Tipo de ocupação das margens ",{"$f":"HY23","v":{"v":0,"d":"0.00"}},{"$nulls":60},{"$f":"SUM(KI25:KK25)","v":{"v":0,"d":"0.00"}},{"$nulls":5},"Lombadas (%)",{"$f":"KP23","v":{"v":0,"d":"0%"}},{"$nulls":36},{"$f":"SUM(MA26:MC26)","v":{"v":0,"d":"0.00"}}]
[null,null,"Callisto, M., Ferreira, W. R., Moreno, P., Goulart, M., & Petrucio, M. (2002). Aplicação de um protocolo de avaliação rápida da diversidade de habitats em atividade de ensino e pesquisa (MG-RJ). Acta Limnologica Brasiliensia.",{"$nulls":17},"Vegetação Nativa",{"$f":"AB23/AD23","v":{"$error":"#DIV/0!"}},{"$nulls":60},"Atividades fora do imóvel",null,{"$f":"CE23","v":{"$error":"#DIV/0!"}},null,null,"Equipamentos",{"$f":"CS23","v":{"v":2E-3,"d":"R$ 0.00"}},{"$f":"CK29/$CK$32","v":{"$error":"#DIV/0!"}},{"$nulls":18},"Equipamentos",{"$f":"DG23","v":{"v":0.8999992400003041,"d":"90.0%"}},{"$nulls":10},"Serviço de saúde",{"$f":"DT23","v":{"v":0,"d":"0.0%"}},{"$nulls":44},"Crédito Investimentos",{"$f":"FP23","v":{"v":0,"d":"0.0%"}},{"$nulls":7},"Inovação/Capacidade de liderança",{"$f":"FX23","v":0},{"$nulls":15},"Coleta/Destinação adequada Ef. Líquidos",{"$f":"IF('2 Indicadores'!F241=\"\",\"\",'2 Indicadores'!F241)","v":""},{"$nulls":38},"Alterações antrópicas",{"$f":"IA23","v":{"v":0,"d":"0.00"}},{"$nulls":66},"Caixas infiltração (%)",{"$f":"KQ23","v":{"v":0,"d":"0%"}}]
[null,null,"Chaves, H. M. L., & Souza, M. A. (2015). Índice para a avaliação do risco de contaminação da água por pesticidas: desenvolvimento e validação. Revista Brasileira de Recursos Hídricos, 20(2), 286-297.",{"$nulls":17},"Silvicultura",{"$f":"X23/AD23","v":{"$error":"#DIV/0!"}},{"$nulls":60},"Outras atividades no imóvel",null,{"$f":"CD23","v":{"$error":"#DIV/0!"}},null,null,"Semoventes",{"$f":"CT23","v":{"v":1E-3,"d":"R$ 0.00"}},{"$f":"CK30/$CK$32","v":{"$error":"#DIV/0!"}},{"$nulls":18},"Semoventes",{"$f":"DH23","v":{"v":0,"d":"0.0%"}},{"$nulls":10},"Estradas de acesso",{"$f":"DS23","v":{"v":0,"d":"0.0%"}},{"$nulls":44},"Custo de Produção",{"$f":"FL23","v":{"v":0,"d":"0.0%"}},{"$nulls":7},"Comercialização Certificação Mercados Institucionais",{"$f":"FU23","v":0},{"$nulls":15},"Coleta/Destinação adequada Esgoto",{"$f":"'2 Indicadores'!F234","v":{"$error":"#DIV/0!"}},{"$nulls":38},"Cobertura vegetal no leito",{"$f":"IC23","v":{"v":0,"d":"0.00"}},{"$nulls":60},"Suficiente","Insuficiente","Situação Crítica",{"$nulls":41},"Suficiente","Insuficiente","Situação Crítica"]
[null,null,"Deponti, C.M.; Eckert, C.; Azambuja, J.L.B (2002). Strategy for building indicators for assessing sustainability and monitoring systems. Agroecology and Sustainable Rural Development, Porto Alegre, v.3, n.4, p.44-52.",{"$nulls":17},"Lavouras Permanentes",{"$f":"U23/AD23","v":{"$error":"#DIV/0!"}},{"$nulls":60},"Atividades agrícolas no imóvel",null,{"$f":"CC23","v":{"$error":"#DIV/0!"}},null,null,"Valor da terra",{"$f":"CY23*DA23","v":0},{"$f":"CK31/$CK$32","v":{"$error":"#DIV/0!"}},{"$nulls":18},"Área com irrigação",{"$f":"DI23","v":{"$error":"#DIV/0!"}},{"$nulls":10},"Energia Elétrica",{"$f":"DR23","v":{"v":0,"d":"0.0%"}},{"$nulls":44},"Fluxo de Caixa",{"$f":"FK23","v":{"v":0,"d":"0.0%"}},{"$nulls":24},"Destinação adequada Lixo",{"$f":"'2 Indicadores'!F235","v":{"$error":"#DIV/0!"}},{"$nulls":38},"Erosão próxima e/ou nas margens",{"$f":"IE23","v":{"v":0,"d":"0.00"}},{"$nulls":60},{"$f":"KI27","v":{"$error":"#DIV/0!"}},{"$f":"KJ27","v":{"$error":"#DIV/0!"}},{"$f":"KK27","v":{"$error":"#DIV/0!"}},{"$nulls":3},"Buracos (%)",{"$f":"KR23","v":{"v":0,"d":"0%"}},{"$nulls":36},{"$f":"MA27","v":{"$error":"#DIV/0!"}},{"$f":"MB27","v":{"$error":"#DIV/0!"}},{"$f":"MC27","v":{"$error":"#DIV/0!"}}]
[null,null,"Corrêa, I. V. (2007). Indicadores de sustentabilidade para agroecossistemas em transição agroecológica na região sul do Rio Grande do Sul. Pelotas-RS: UFPel-Universidade Federal de Pelotas.",{"$nulls":17},"Lavouras temporárias",{"$f":"V23/AD23","v":{"$error":"#DIV/0!"}},{"$nulls":65},"Estimativa Patrimonial",{"$f":"DC23","v":{"$error":"#DIV/0!"}},{"$nulls":31},"Transporte Escolar",{"$f":"DU23","v":{"v":0,"d":"0.0%"}},{"$nulls":44},"Grau de organização (Associação etc.)",{"$f":"FN23","v":{"v":0,"d":"0.0%"}},{"$nulls":24},"Coleta/Destinação adequada Res. Sólidos",{"$f":"'2 Indicadores'!F238","v":{"v":0,"d":"0.0%"}},{"$nulls":38},"Transparência da água",{"$f":"IG23","v":{"v":0,"d":"0.00"}},{"$nulls":66},"Sulcos de erosão (%)",{"$f":"KS23","v":{"v":0,"d":"0%"}}]
[null,null,"Fidalski, J. (1997). Diagnóstico de manejo e conservação do solo e da água na região noroeste do Paraná. R. Unimar, 19, 845-851.",{"$nulls":17},"Pastagens",{"$f":"W23/AD23","v":{"$error":"#DIV/0!"}},{"$nulls":86},"Evolução Patrimonial Anual Total",{"$f":"DJ23","v":{"$error":"#DIV/0!"}},{"$nulls":10},"Disponibilidade Água",{"$f":"DQ23","v":{"v":0,"d":"0.0%"}},{"$nulls":44},"Assistência Técnica",{"$f":"FM23","v":{"v":0,"d":"0.0%"}},{"$nulls":64},"Odor da água",{"$f":"II23","v":{"v":0,"d":"0.00"}}]
[null,null,"Gitman, L. J., & Zutter, C. J. (2012). Principles of managerial finance 13th edition. Massachusetts: Addison-Wesley Publishing Company.",{"$nulls":105},"Evolução Patrimonial Anual Total s/valorização da terra",{"$f":"DK23","v":{"$error":"#DIV/0!"}},{"$nulls":56},"Regularização Ambiental",{"$f":"FO23","v":{"v":0,"d":"0.0%"}},{"$nulls":64},"Tipo de fundo",{"$f":"IK23","v":{"v":0,"d":"0.00"}}]
[null,null,"Gómez-Limón, J. A., & Sanchez-Fernandez, G. (2010). Empirical evaluation of agricultural sustainability using composite indicators. Ecological economics, 69(5), 1062-1075. https://10.1016/j.ecolecon.2009.11.027 "]
[null,null,"Kovach, J., Petzoldt, C., Degni, J., & Tette, J. (1992). A method to measure the environmental impact of pesticides.",{"$nulls":229},"Jusante"]
[null,null,"López-Ridaura, S., Masera, O., & Astier, M. (2002). Evaluating the sustainability of complex socio-environmental systems. The MESMIS framework. Ecological indicators, 2(1-2), 135-148.",{"$nulls":229},"Tipo de ocupação das margens ",{"$f":"HZ23","v":{"v":0,"d":"0.00"}}]
[null,null,"Matos Filho, A. M. (2004). Agricultura orgânica sob a perspectiva da sustentabilidade: uma análise da região de Florianópolis/SC, Brasil.",{"$nulls":229},"Alterações antrópicas",{"$f":"IB23","v":{"v":0,"d":"0.00"}}]
[null,null,"Mendes, I. C., Souza, L. M., Sousa, D. M. G., Lopes, A. A. C., Reis-Junior, F. B., Lacerda, M. P. C., & Malaquias, J. V. (2019). Critical limits for microbial indicators in tropical Oxisols at post-harvest: The FERTBIO soil sample concept. Applied Soil Ecology, 139, 85–93. https://doi.org/10.1016/j.apsoil.2019.02.025.",{"$nulls":229},"Cobertura vegetal no leito",{"$f":"ID23","v":{"v":0,"d":"0.00"}}]
[null,null,"Pesticide Property Database https://sitem.herts.ac.uk/aeru/ppdb/",{"$nulls":229},"Erosão próxima e/ou nas margens",{"$f":"IF23","v":{"v":0,"d":"0.00"}}]
[null,null,"Qiu, H. J., Zhu, W. B., Wang, H. B., & Cheng, X. (2007). Analysis and design of agricultural sustainability indicators system. Agricultural Sciences in China, 6(4), 475-486.",{"$nulls":229},"Transparência da água",{"$f":"IH23","v":{"v":0,"d":"0.00"}}]
[null,null,"Rao, N. H., & Rogers, P. P. (2006). Assessment of agricultural sustainability. Current science, 439-448.",{"$nulls":229},"Odor da água",{"$f":"IJ23","v":{"v":0,"d":"0.00"}}]
[null,null,"Ribeiro, A. C. (1999). Recomendações para o uso de corretivos e fertilizantes em Minas Gerais: 5. Aproximação. Comissão de fertilidade do solo do Estado de Minas Gerais.",{"$nulls":229},"Tipo de fundo",{"$f":"IL23","v":{"v":0,"d":"0.00"}}]
[null,null,"Rodrigues, G. S., Campanhola, C., & Kitamura, P. C. (2003). An environmental impact assessment system for agricultural R&D. Environmental Impact Assessment Review, 23(2), 219-244."]
[null,null,"Rodrigues, G. S., Rodrigues, I. A., Buschinelli, C. C. de A., & de Barros, I. (2010). Integrated farm sustainability assessment for the environmental management of rural activities. Environmental Impact Assessment Review, 30(4), 229–239. https://doi.org/10.1016/j.eiar.2009.10.002"]
[null,null,"Sala, S., Ciuffo, B., & Nijkamp, P. (2015). A systemic framework for sustainability assessment. Ecological economics, 119, 314-325. http://dx.doi.org/10.1016/j.ecolecon.2015.09.015"]
[null,null,"Sousa, D.M.G.; Lobato, E. (2004). Soil acidity correction. In: Sousa, D.M.G. de; Lobato, E. (Ed.). Cerrado: soil correction and fertilization. 2nd ed. Brasília: Embrapa Technological Information; Planaltina: Embrapa Cerrados, p.81-96."]

{"sheet":"IQS 1","index":13,"n_rows":591,"n_cols":10,"rows_kept":591,"merged":[[0,1,1,1],[9,6,9,7],[10,1,10,5],[11,1,11,2],[11,6,12,6],[11,7,12,7],[12,1,12,2],[13,1,13,2],[14,1,14,2],[16,1,16,2],[17,1,17,2],[19,1,19,2],[20,1,20,2],[21,1,21,2],[22,1,22,2],[23,1,23,2],[24,1,24,2],[25,1,25,2],[26,1,26,2],[27,1,27,2],[29,1,29,2],[43,1,43,2],[44,1,44,2],[46,1,46,2],[47,1,47,2],[48,1,48,2],[49,1,49,2],[50,1,50,2],[55,1,55,2],[70,1,70,2],[83,17,83,18],[83,19,83,20],[86,1,86,2],[87,1,87,5],[89,1,89,2],[90,1,90,5],[97,1,100,1],[101,1,101,2],[103,1,103,2],[105,1,105,2],[106,1,106,2],[114,1,117,1],[118,1,118,2],[120,1,120,2],[121,1,121,2],[122,1,122,2],[123,1,123,2],[127,1,128,1],[127,2,128,2],[145,1,145,2],[146,1,146,2],[147,1,147,2],[176,1,177,2],[179,1,179,3],[179,5,179,7],[180,1,180,2],[180,5,181,7],[181,1,182,2],[181,3,182,3],[183,1,183,2],[184,1,184,2],[191,7,192,7],[192,2,192,3],[220,1,220,5],[220,7,221,8],[221,1,221,4],[221,5,222,5],[222,7,222,8],[223,7,223,8],[224,7,224,8],[225,7,225,8],[229,1,233,1],[229,2,229,3],[229,4,229,5],[234,1,238,1],[234,4,234,5],[239,1,243,1],[239,2,239,3],[239,4,239,5],[244,1,248,1],[244,2,244,3],[244,4,244,5],[251,1,251,5],[252,1,252,4],[252,5,253,5],[261,1,264,1],[261,2,261,3],[261,4,261,5],[261,6,261,7],[265,1,268,1],[265,2,265,3],[265,4,265,5],[265,6,265,7],[269,1,272,1],[269,2,269,3],[269,4,269,5],[269,6,269,7],[273,1,276,1],[273,2,273,3],[273,4,273,5],[273,6,273,7],[280,27,280,28],[283,1,283,2],[292,1,292,7],[293,4,293,5],[293,6,293,7],[300,1,300,2],[309,1,309,7],[310,4,310,5],[310,6,310,7],[316,1,316,2],[325,1,325,7],[326,4,326,5],[326,6,326,7],[332,1,332,2],[340,1,340,5],[347,1,347,2],[355,1,355,5],[362,1,362,2],[370,1,370,5],[377,1,377,2],[385,1,385,5],[386,1,386,2],[386,3,386,5],[392,1,392,3],[393,1,395,3],[397,1,397,2],[411,1,411,2],[436,1,438,8],[440,1,440,2],[444,1,445,1],[444,2,445,2],[467,1,467,2],[483,1,483,2],[502,1,503,1],[506,1,507,1],[510,1,511,1],[514,1,515,1],[518,1,519,1],[522,1,523,1],[526,1,527,1],[530,1,531,1],[534,1,535,1],[538,1,539,1],[542,1,543,1],[548,1,549,1],[552,1,553,1],[556,1,557,1],[560,1,561,1],[564,1,565,1],[568,1,569,1],[572,1,573,1],[576,1,577,1],[580,1,581,1],[584,1,585,1],[588,1,589,1]]}
[null,"ISA"]
[null,null,"ÍNDICE QUALIDADE DO SOLO (IQS)"]
[]
[null,"DATA "]
[null,"Identificação do Talhão"]
[null,"Área"]
[null,"Atividade",null,"Escolha uma opção"]
[]
[1,"PRODUTIVIDADE"]
[{"$nulls":6},"Fator de ponderação \t"]
[null,"1.1 Descrição das atividades agrícolas, pecuárias e florestais no talhão",{"$nulls":4},"> 20%",0.9]
[null,"Atividades",null,{"$f":"C7","v":0},null,null,"produção = local ou referência",0.7]
[null,"Unidades de medida (selecione a unidade)"]
[null,"Produtividade média atual",{"$nulls":4},"< 20%",0.5]
[null,"Produtividade média na região ou do imóvel rural",{"$nulls":4},"< 40%",0.3]
[]
[null,"1.2 Insumos (opcional)"]
[null,"Atividade (selecionar)",null,null,"Escolha uma opção"]
[null,"Calcário (Kg/ha)"]
[null,"Fertilizantes solúveis (desccrição da formulação)"]
[null,"Fertilizantes solúveis (Kg/ha)"]
[null,"Remineralizadores / pós de rocha (descrição)"]
[null,"Remineralizadores / pós de rocha (Kg/ha)"]
[null,"Fertilizantes orgânicos (descrição)"]
[null,"Fertilizantes orgânicos (Kg/ha)"]
[null,"N (Kg) / ha "]
[null,"P (Kg) / ha"]
[null,"K (Kg) / ha "]
[]
[null,"1.3 Análise foliar (opcional)"]
[null,"Atividade (selecionar)",null,"Escolha uma opção","Resultado"]
[null,"P (g/kg)",null,null,{"$f":"IF(ISBLANK(C32),\"\",E487)","v":""}]
[null,"K (g/kg)",null,null,""]
[null,"N (g/kg)",null,null,""]
[null,"S (g/kg)",null,null,""]
[null,"Ca (g/kg)",null,null,""]
[null,"Mg (g/kg)",null,null,""]
[null,"B (mg/kg)",null,null,""]
[null,"Zn (mg/kg)",null,null,""]
[null,"Fe (mg/kg)",null,null,""]
[null,"Mn (mg/kg)",null,null,""]
[null,"Cu (mg/kg)",null,null,""]
[]
[null,"1.4 Análise financeira (opcional)"]
[null,"Fertilizantes (R$/ha)"]
[]
[null,"Total de insumos (R$/ha)",null,null,"Fertilizantes + sementes + pesticidas"]
[null,"Custos Fixos (Conab) (R$/ha)"]
[null,"Total costs (R$/ha)",null,{"$f":"IF(D47>0,D48+D47,\"\")","v":""},{"$f":"IF(D50>0,(D49/D50),\"\")","v":""}]
[null,"Receita Bruta (R$/ha)"]
[null,"Resultado - Receita Líquida (R$/ha)",null,{"$f":"IF(D50>0,D50-D49,\"\")","v":""},{"$f":"IF(D50>0,D51/D50,\"\")","v":""}]
[]
[null,"RESULTADO",{"$f":"IF(D14>0,F188,0)","v":{"v":0,"d":"0.00"}}]
[]
[2,"ANÁLISES QUÍMICAS E BIOLÓGICAS"]
[]
[null,"Identificação do Talhão",{"$f":"C5","v":0}]
[{"$nulls":4},"Resultado"]
[null,"Teor de argila",null,"dag kg-1 (%) Argila",{"$f":"IF(ISBLANK(C59),0,IF(C59<=15,H223,IF(AND(C59>15,C59<35),H224,IF(AND(C59>=35,C59<=60),H225,IF(C59>60,H226)))))","v":{"v":0,"d":"0.00"}}]
[null,"Matéria Orgânica",null,"(dag kg-1)",{"$f":"IF(H234>1,1,IF(H234<0,0,H234))","v":{"v":0,"d":"0.00"}}]
[null,"P disponível",null,"(mg dm-3) (Mehlich-1)",{"$f":"IF(F280>1,1,IF(F280<0,0,F280))","v":{"v":0,"d":"0.00"}}]
[null,"Ca trocável",null,"(cmolc dm-3)",{"$f":"IF(ISBLANK(C62),0,IF(F299>1,1,IF(F299<0,0,F299)))","v":{"v":0,"d":"0.00"}}]
[null,"Mg trocável",null,"(cmolc dm-3)",{"$f":"IF(ISBLANK(C63),0,IF(F315>1,1,IF(F315<0,0,F315)))","v":{"v":0,"d":"0.00"}}]
[null,"K trocável",null,"(mg dm-3)",{"$f":"IF(ISBLANK(C64),0,IF(F331>1,1,IF(F331<0,0,F331)))","v":{"v":0,"d":"0.00"}}]
[null,"pH em água",null,"Índice",{"$f":"IF(ISBLANK(C65),0,IF(E346>1,1,IF(E346<0,0,E346)))","v":{"v":0,"d":"0.00"}}]
[null,"Al trocável",null,"(cmolc dm-3)",{"$f":"IF(C66>2,0,IF(ISBLANK(C66),0,IF(E361>1,1,IF(E361<0,0,E361))))","v":{"v":0,"d":"0.00"}}]
[null,"CTC",null,"(cmolc dm-3)",{"$f":"IF(ISBLANK(C67),0,E376)","v":{"v":0,"d":"0.00"}}]
[null,"Saturação por bases",null,"(%)",{"$f":"IF(ISBLANK(C68),0,IF(E391>0.83,1,IF(E391<0,0,E391)))","v":{"v":0,"d":"0.00"}}]
[null,"Resultado Parcial",{"$f":"AVERAGE(E60,E61,E68)","v":{"v":0,"d":"0.00"}}]
[]
[null,"Avaliação da biologia do solo/BioAS (opcional)"]
[null,"Arilsulfatase",null,"(mg p-nitrofenol kg-1 h-1)"]
[null,"Betaglicosidase",null,"(mg p-nitrofenol kg-1 h-1)"]
[null,"Matéria Orgânica (0-10cm)",null,"(dag kg-1)","Resultado"]
[null,"IQS Biológico ",null,"Índice",{"$f":"IF(C75>0,C75,\"\")","v":""}]
[null,"Índice Armaz. nutrientes",null,"Índice"]
[null,"Índice Sup. nutrientes",null,"Índice"]
[null,"IQS Químico",null,"Índice"]
[null,"IQS FertBio",null,"Índice"]
[null,"Resultado Parcial",{"$f":"C75","v":{"v":0,"d":"0.00"}}]
[]
[null,"RESULTADO",{"$f":"IF(C80>0,(2*C69+C80)/3,C69)","v":{"v":0,"d":"0.00"}}]
[]
[3,"EROSÃO DO SOLO"]
[]
[{"$nulls":3},"Escolha uma opção  ","Área (ha)","Proporção (%) área total","Fator de ponderação"]
[null,"3.1 Intensidade do estágio de degradação*",{"$nulls":3},{"$f":"IF(E87>0,E87/C458,\" \")","v":" "},{"v":1,"d":"1.0"},"Inicial"]
[null,"* Evidências de erosão: Inicial - redução de infiltração de água, raízes expostas; Intermediário - remoção do horizonte superficial, presença de sulcos rasos localizados; Avançado - sulcos profundos e disseminados na área, voçorocas, movimento de massa (deslocamento de um volume de solo).\t",{"$nulls":4},0.8,"Intermediário"]
[]
[null,"3.2 Tendência de comportamento do processo",null,null,"Escolha uma opção  ",null,0.5,"Avançado"]
[null,"** Adoção de medidas de recuperação ou mitigação como terraceamentos, barreiras físicas, barramentos, revegetação, etc."]
[null,"RESULTADO",{"$f":"IF(B422>0,(B422*B423*1.2)+(B422*C423)+(B422*D423*0.8),0.7)","v":{"v":0.7,"d":"0.70"}}]
[]
[4,"GRAU DE ADOÇÃO DE PRÁTICAS CONSERVACIONISTAS - SOLO E ÁGUA"]
[]
[{"$nulls":3},{"$f":"C7","v":0}]
[null,null,"Área  (ha)",{"$f":"C6","v":0},"Fator de ponderação"]
[null,"4.1 Grau de adoção de práticas para a conservação dos solos\n","Adequado",null,0.9]
[null,null,"Médio",null,0.6]
[null,null,"Baixo",null,0.3]
[null,null,"Situação crítica*",null,0.1]
[null,"*Situação crítica (solo/água) - ESPECIFICAR"]
[{"$nulls":3},"Escolha uma opção  ","Fator de ponderação","Verificação área talhão =>",{"$f":"SUM(D98:D101)/C6","v":{"$error":"#DIV/0!"}}]
[null,"4.2  Estratégias infiltração/retenção - água no solo \n",null,null,{"v":1,"d":"1.0"},"Suficiente"]
[{"$nulls":3},"Escolha uma opção  ",0.4,"Insuficiente","Sim"]
[null,"4.3 Uso Sistema Plantio Direto (%)\n",null,null,0.1,"Situação crítica","Não"]
[null,"4.4 Uso plantas de cobertura/cobertura permanente \n"]
[]
[null,"RESULTADO",{"$f":"IF(C461=0,\"\",(((B461*2)+C461)/3))","v":""}]
[]
[5,"GRAU DE ADOÇÃO DE PRÁTICAS CONSERVACIONISTAS - BIODIVERSIDADE"]
[]
[{"$nulls":3},{"$f":"C7","v":0}]
[null,null,"Área  (ha)",{"$f":"C6","v":0},"Fator de ponderação"]
[null,"5.1 Grau de adoção de práticas que auxiliam na agrobiodiversidade\n","Adequado",null,0.9]
[null,null,"Médio",null,0.6]
[null,null,"Baixo",null,0.3]
[null,null,"Situação crítica*",null,0.1]
[null,"*Situação crítica - ESPECIFICAR"]
[{"$nulls":3},"Choose an option",null,"Verificação área talhão =>",{"$f":"SUM(D115:D118)/C6","v":{"$error":"#DIV/0!"}},{"$f":"SUM(D115:D118)","v":0}]
[null,"5.2 Uso de insumos biológicos\n"]
[null,"5.3 Nº de espécies - plantas de cobertura/2ª safra\n"]
[null,"5.4 Data do plantio das plantas de cobertura\n"]
[null,"5.5 Pesticidas (L/ha)\n"]
[]
[null,"RESULTADO",{"$f":"IF(AND(D121=\"Sim\",D107=\"Sim\"),(C475*C469)+(C476*C470)+(C477*C471)+(C478*C472),((C475*C469)+(C476*C470)+(C477*C471)+(C478*C472))*0.8)","v":{"$error":"#DIV/0!"}}]
[]
[null,"IQS",{"$f":"H173","v":{"v":0.09999999999999999,"d":"0.10"}},null,null,"Identificação ",{"$f":"C5","v":0}]
[{"$nulls":5},"Data",{"$f":"C4","v":"00:00:00"}]
[{"$nulls":5},"Área (ha)",{"$f":"C6","v":0}]
[null,"Fertilidade do Solo"]
[null,"Matéria Orgânica do Solo (MOS) (dag kg-1)",null,{"$f":"C60","v":{"v":0,"d":"0.0"}}]
[null,"P disponível (mg dm-3)",null,{"v":0,"d":"0.0"}]
[null,"Ca trocável (cmolc dm-3)",null,{"v":0,"d":"0.0"}]
[null,"Mg trocável (cmolc dm-3)",null,{"v":0,"d":"0.0"}]
[null,"K trocável (mg dm-3)",null,{"v":0,"d":"0.0"}]
[null,"pH",null,{"v":0,"d":"0.0"}]
[null,"Al trocável (cmolc dm-3)",null,{"v":0,"d":"0.0"}]
[null,"CTC (cmolc dm-3)",null,{"v":0,"d":"0.0"}]
[null,"Saturação por bases (%)",null,{"v":0,"d":"0.0"}]
[null,"K/CTC (%) (referência 3 - 5%)",null,{"$f":"IF(D136>0,((D136/1000*2.5577)/D139*100),\"\")","v":""}]
[null,"Ca/CTC (%) (referância 40 - 60%)",null,{"$f":"IF(D134>0,D134/D139*100,\"\")","v":""}]
[null,"Mg/CTC (%) (referência 15 - 20%)",null,{"$f":"IF(D135>0,D135/D139*100,\"\")","v":""}]
[]
[null,"Aporte de Nutrientes ",{"$nulls":3},"Erosão do Solo "]
[null,"N (Kg/ha) ",null,{"$f":"IF(D26=\"\",\"\",D26)","v":""},null,"Área (ha)",null,{"$f":"E87","v":0}]
[null,"P (Kg/ha)",null,{"$f":"IF(D27=\"\",\"\",D27)","v":""},null,"Estágio - degradação",null,{"$f":"D87","v":0}]
[null,"K (Kg/ha) ",null,{"$f":"IF(D28=\"\",\"\",D28)","v":""},null,"Tendência - comportamento",null,{"$f":"D90","v":0}]
[]
[null,"Produtividade",{"$nulls":3},"Cobertura do solo entressafra"]
[null,"Atividade",null,{"$f":"D12","v":{"v":0,"d":"0.0%"}},null,"Nº espécies plantas de cobertura",null,{"$f":"IF(D122>0,D122,\"\")","v":""}]
[null,"Unidade",null,{"$f":"D13","v":0},null,"Data plantio plantas de cobertura",null,{"$f":"IF(D123>0,D123,\"\")","v":""}]
[null,"Produtividade",null,{"$f":"D14","v":0},null,"Pesticidas (L/ha) (safra)",null,{"$f":"IF(D124>0,D124,\"\")","v":""}]
[]
[null,"Resultado Econômico ",{"$nulls":3},"Atividade enzimática no solo"]
[null,"Insumos (R$/ha)",null,{"$f":"D47","v":{"v":0,"d":"R$ 0"}},null,"Arilsulfatase (mg p-nitrofenol kg-1 h-1)",null,{"$f":"IF(C72=\"\",\"\",C72)","v":""}]
[null,"Custo Total (R$/ha)",null,{"$f":"D49","v":""},null,"ß-glucosidase (mg p-nitrofenol kg-1 h-1)",null,{"$f":"IF(C73=\"\",\"\",C73)","v":""}]
[null,"Receita Líquida (R$/ha)",null,{"$f":"D51","v":""},null,"IQS Biológico ",null,{"$f":"IF(C75=\"\",\"\",C75)","v":""}]
[]
[]
[]
[null,"Análise Foliar",{"$nulls":3},"Qualidade do Solo",null,{"$f":"G128","v":0}]
[null,"P (g/kg)",{"$f":"IF(C32>0,C32,\"\")","v":""},{"$f":"IF(C32>0,E32,\"\")","v":""},null,"MOS",null,{"$f":"E60","v":{"v":0,"d":"0.00"}},0.7]
[null,"K (g/kg)","","",null,"P disponível",null,{"$f":"E61","v":{"v":0,"d":"0.00"}},0.7]
[null,"N (g/kg)","","",null,"Saturação por bases",null,{"$f":"E68","v":{"v":0,"d":"0.00"}},0.7]
[null,"S (g/kg)","","",null,"CTC",null,{"$f":"E67","v":{"v":0,"d":"0.00"}},0.7]
[null,"Ca (g/kg)","","",null,"pH",null,{"$f":"E65","v":{"v":0,"d":"0.00"}},0.7]
[null,"Mg (g/kg)","","",null,"Erosão do Solo ",null,{"$f":"C92","v":{"v":0.7,"d":"0.70"}},0.7]
[null,"B (mg/kg)","","",null,"Conservação solo e água",null,{"$f":"C109","v":""},0.7]
[null,"Zn (mg/kg)","","",null,"Conservação biodiversidade",null,{"$f":"IF(H120>0,C126,\"\")","v":""},0.7]
[null,"Fe (mg/kg)","","",null,"Produtividade",null,{"$f":"C53","v":{"v":0,"d":"0.00"}},0.7]
[null,"Mn (mg/kg)","","",null,"IQS Biológico (enzimas)",null,{"$f":"IF(ISBLANK(C75),\"\",C75)","v":""},0.7]
[null,"Cu (mg/kg)","","",null,"Índice de Qualidade do Solo (IQS)",null,{"$f":"AVERAGE(H163:H172)","v":{"v":0.09999999999999999,"d":"0.10"}}]
[]
[]
[]
[null,"FORMULAS"]
[]
[]
[1,"Fator de Ponderação",{"$nulls":3},"Fórmulas\t\t"]
[null,"> 20%",null,0.9,null,"Formula (R parcial) = Yo + ax"]
[null,"produção = local ou referência",null,0.7]
[{"$nulls":5},"yo",{"v":-0.3,"d":"-0.30"}]
[null,"< 20%",null,0.5,null,"a",0.01]
[null,"< 40%",null,0.3,null,{"$f":"IF(ISBLANK(D14),\"\",(G183+G184*(100+(E191*100))))","v":""},{"$f":"IF(ISBLANK(E14),\"\",(G183+G184*(100+(F191*100))))","v":""},{"$f":"IF(ISBLANK(F14),\"\",(G183+G184*(100+(G191*100))))","v":""}]
[]
[]
[{"$nulls":5},{"$f":"AVERAGE(E193:G193)","v":{"$error":"#DIV/0!"}}]
[]
[]
[null,"Variação do item 1.3 em relação ao item 1.5",null,null,{"$f":"IF(D14>0,((D14/D15)-1),\"\")","v":""},{"$f":"IF(E14>0,((E14/E15)-1),\"\")","v":""},{"$f":"IF(F14>0,((F14/F15)-1),\"\")","v":""}]
[{"$nulls":4},{"v":1,"d":"1.0"},{"v":1,"d":"1.0"},{"v":1,"d":"1.0"},"Fator de Ponderação"]
[null,"Resultado Parcial","Produtividade",null,{"$f":"IF(ISBLANK(D14),\"\",IF(F185>1,1,F185))","v":""},{"$f":"IF(ISBLANK(E14),\"\",IF(G185>1,1,G185))","v":""},{"$f":"IF(ISBLANK(F14),\"\",IF(H185>1,1,H185))","v":""}]
[]
[]
[null,"Unidades",null,null,"Unidades"]
[null,"Aquicultura",null,null,"Sc/ha"]
[null,"Pecuária de Leite",null,null,"Ton./ha"]
[null,"Pecuária de Corte",null,null,"Kg/ha"]
[null,"Carne de Frango",null,null," @/ha/ano"]
[null,"Café",null,null,"L de Leite/ha/ano"]
[null,"Algodão",null,null,"L of Leite/vaca/dia"]
[null,"Ovos",null,null,"Kg/dia"]
[null,"Peixes",null,null,"Kg de ração/kg de carne produzida"]
[null,"Silvicultura",null,null,"Leitões comercializados/porca/ano"]
[null,"Fruticultura",null,null,"Ovos/galinha/ano"]
[null,"Grãos",null,null,"Conversão Alimentar/dúzia de ovos"]
[null,"Pecuária  ",null,null,"Conversão Alimentar/Kg"]
[null,"Milho",null,null,"Percentagem de postura de aves"]
[null,"Oleaginosas"]
[null,"Outros"]
[null,"Suínos"]
[null,"Batata"]
[null,"Arroz"]
[null,"Soja"]
[null,"Cana de Açúcar"]
[null,"Hortaliças"]
[null,"Trigo"]
[]
[]
[2,"MO - Fator de Ponderação",{"$nulls":5},"Granulometria do solo (dag kg-1 argila)"]
[null,"Classificação",{"$nulls":3},"Ponderação"]
[null,"Arenosa","Média","Argilosa","Muito Arg.",null,null,"Arenosa",null,"≤ 15"]
[null,{"v":0,"d":"0.00"},{"v":0,"d":"0.00"},{"v":0,"d":"0.00"},{"v":0,"d":"0.00"},{"v":0.1,"d":"0.10"},null,"Média",null,"16 a 34"]
[null,{"v":0.8,"d":"0.80"},{"v":1.6,"d":"1.60"},{"v":2.4,"d":"2.40"},{"v":2.8,"d":"2.80"},{"v":0.5,"d":"0.50"},null,"Argilosa",null,"35 a 60"]
[null,{"v":1.1,"d":"1.10"},{"v":2.1,"d":"2.10"},{"v":3.1,"d":"3.10"},{"v":3.6,"d":"3.60"},{"v":0.7,"d":"0.70"},null,"Muito argilosa",null,"> 60"]
[null,{"v":1.5,"d":"1.50"},{"v":3,"d":"3.00"},{"v":4.5,"d":"4.50"},{"v":5.2,"d":"5.20"},{"v":1,"d":"1.00"}]
[null,{"v":4.5,"d":"4.50"},{"v":9,"d":"9.00"},{"v":13.5,"d":"13.50"},{"v":15.6,"d":"15.60"},{"v":0.7,"d":"0.70"}]
[]
[null,"Arenosa"," Yo + ax + bx2 + cx3 ",null,"Formula2 = Yo + ax ",null,null,{"$f":"IF(AND(E59=\"Arenosa\"),IF(C60<1.5,E233,F233),0)","v":{"v":0,"d":"0.00"}}]
[null,null,"Yo",{"v":0.1,"d":"0.100"},"Yo",1.15,null,{"$f":"IF(AND(E59=\"Média\"),IF(C60<3,E243,F243),0)","v":{"v":0,"d":"0.00"}}]
[null,null,"a",{"v":0.3597,"d":"0.360"},"a",{"v":-0.1,"d":"-0.10"},null,{"$f":"IF(AND(E59=\"Argilosa\"),IF(C60<4.5,E238,F238),0)","v":{"v":0,"d":"0.00"}}]
[null,null,"b",{"v":0.1926,"d":"0.193"},{"$f":"D231+D232*C60+D233*C60^2+D234*C60^3","v":{"v":0.1,"d":"0.10"}},{"$f":"F231+F232*C60","v":1.15},null,{"$f":"IF(AND(E59=\"Muito argilosa\"),IF(C60<5.2,E248,F248),0)","v":{"v":0,"d":"0.00"}}]
[null,null,"c",{"v":-0.0216,"d":"-0.022"},{"$nulls":3},{"$f":"(H230+H231+H232+H233)","v":{"v":0,"d":"0.00"}}]
[null,"Argilosa"," Yo + ax + bx2 + cx3 ",null,"Formula2 = Yo + ax "]
[null,null,"Yo",{"v":0.1,"d":"0.100"},"Yo",1.15]
[null,null,"a",{"v":-0.0452,"d":"-0.045"},"a",{"v":-0.03333,"d":"-0.03"}]
[null,null,"b",{"v":0.1269,"d":"0.127"},{"$f":"D236+D237*C60+D238*C60^2+D239*C60^3","v":{"v":0.1,"d":"0.10"}},{"$f":"F236+F237*C60","v":1.15}]
[null,null,"c",{"v":-0.0161,"d":"-0.016"}]
[null,"Média"," Yo + ax + bx2 + cx3 ",null,"Formula2 = Yo + ax "]
[null,null,"Yo",{"v":0.1,"d":"0.100"},"Yo",1.15]
[null,null,"a",{"v":0.0024,"d":"0.002"},"a",-0.05]
[null,null,"b",{"v":0.2183,"d":"0.218"},{"$f":"D241+D242*C60+D243*C60^2+D244*C60^3","v":{"v":0.1,"d":"0.10"}},{"$f":"F241+F242*C60","v":1.15}]
[null,null,"c",{"v":-0.0397,"d":"-0.040"}]
[null,"Muito Argilosa"," Yo + ax + bx2 + cx3 ",null,"Formula2 = Yo + ax "]
[null,null,"Yo",{"v":0.1,"d":"0.100"},"Yo",1.15]
[null,null,"a",{"v":-0.0486,"d":"-0.049"},"a",{"v":-0.0288,"d":"-0.03"}]
[null,null,"b",{"v":0.0984,"d":"0.098"},{"$f":"D246+D247*C60+D248*C60^2+D249*C60^3","v":{"v":0.1,"d":"0.10"}},{"$f":"F246+F247*C60","v":1.15}]
[null,null,"c",{"v":-0.0107,"d":"-0.011"}]
[]
[]
[null,"P - Fator de Ponderação\t\t\t\t"]
[null,"Classificação",{"$nulls":3},"Ponderação"]
[null,"Arenosa","Média","Argilosa","Muito Arg."]
[null,{"v":0,"d":"0.00"},{"v":0,"d":"0.00"},{"v":0,"d":"0.00"},{"v":0,"d":"0.00"},{"v":0.1,"d":"0.10"}]
[null,{"v":12.1,"d":"12.10"},{"v":10.1,"d":"10.10"},{"v":5.1,"d":"5.10"},{"v":3.1,"d":"3.10"},0.25]
[null,{"v":18.1,"d":"18.10"},{"v":15.1,"d":"15.10"},{"v":8.1,"d":"8.10"},{"v":4.1,"d":"4.10"},{"v":0.5,"d":"0.50"}]
[null,{"v":25.1,"d":"25.10"},{"v":20.1,"d":"20.10"},{"v":12.1,"d":"12.10"},{"v":6.1,"d":"6.10"},{"v":0.7,"d":"0.70"}]
[null,{"v":40,"d":"40.00"},{"v":30,"d":"30.00"},{"v":18,"d":"18.00"},{"v":9,"d":"9.00"},{"v":1,"d":"1.00"}]
[null,{"v":400,"d":"400.00"},{"v":300,"d":"300.00"},{"v":180,"d":"180.00"},{"v":90,"d":"90.00"},{"v":0.7,"d":"0.70"}]
[]
[null,"Arenosa"," Yo + ax ",null,"F2 = Yo + ax + bx2 ",null,"F3 = Yo + ax "]
[null,null,"Yo",{"v":0.1,"d":"0.10"},"Yo",{"v":-0.4748,"d":"-0.47"},"Yo",{"v":1.0233,"d":"1.02"}]
[null,null,"a",{"v":0.0124,"d":"0.01"},"a",{"v":0.0721,"d":"0.07"},"a",{"v":-0.0008,"d":"-0.00"}]
[{"$nulls":4},"b",{"v":-1E-3,"d":"-0.00"}]
[null,"Argilosa","F1 = Yo + ax + bx2 ",null,"F2 = Yo + ax + bx2 ",null,"F3 = Yo + ax "]
[null,null,"Yo",{"v":0.1,"d":"0.10"},"Yo",{"v":0.1034,"d":"0.10"},"Yo",{"v":1.04333,"d":"1.04"}]
[null,null,"a",{"v":-0.0045,"d":"-0.00"},"a",{"v":0.0483,"d":"0.05"},"a",{"v":-1.9E-3,"d":"-0.00"}]
[null,null,"b",{"v":0.0067,"d":"0.01"},"b",{"v":8.56e-05,"d":"0.00"}]
[null,"Média","F1 = Yo + ax + bx2 ",null,"F2 = Yo + ax + bx2 ",null,"F3 = Yo + ax "]
[null,null,"Yo",{"v":0.1,"d":"0.10"},"Yo",{"v":-0.3015,"d":"-0.30"},"Yo",{"v":1.0333,"d":"1.03"}]
[null,null,"a",{"v":-0.0087,"d":"-0.01"},"a",{"v":0.0639,"d":"0.06"},"a",{"v":-0.0011,"d":"-0.00"}]
[null,null,"b",{"v":2.3E-3,"d":"0.00"},"b",{"v":-0.0007,"d":"-0.00"}]
[null,"Muito Argilosa","F1 = Yo + ax + bx2 ",null,"F2 = Yo + ax + bx2 ",null,"F3 = Yo + ax "]
[null,null,"Yo",{"v":0.1,"d":"0.10"},"Yo",{"v":0.1076,"d":"0.11"},"Yo",{"v":1.0333,"d":"1.03"}]
[null,null,"a",{"v":-0.1041,"d":"-0.10"},"a",{"v":0.0928,"d":"0.09"},"a",{"v":-0.0037,"d":"-0.00"}]
[null,null,"b",{"v":0.0492,"d":"0.05"},"b",{"v":0.0007,"d":"0.00"}]
[null,{"$f":"D263+D264*C61","v":{"v":0.1,"d":"0.10"}},{"$f":"F263+F264*C61+F265*C61^2","v":{"v":-0.4748,"d":"-0.47"}},{"$f":"0.1946+0.0201*C61","v":{"v":0.1946,"d":"0.19"}},{"$f":"H263+H264*C61","v":{"v":1.0233,"d":"1.02"}},{"$f":"IF(C61<=12.1,B278,IF(AND(C61>12.1,C61<25.1),C278,IF(C61>40,E278,D278)))","v":{"v":0.1,"d":"0.10"}}]
[null,{"$f":"D267+D268*C61+D269*C61^2","v":{"v":0.1,"d":"0.10"}},{"$f":"F267+F268*C61+F269*C61^2","v":{"v":0.1034,"d":"0.10"}},{"$f":"H267+H268*C61","v":{"v":1.04333,"d":"1.04"}},{"$f":"IF(AND(C61>8.1,C61<18),C279,IF(C61>=18,D279,B279))","v":{"v":0.1,"d":"0.10"}}]
[null,{"$f":"IF(AND(E59=\"Arenosa\"),IF(C61<0,0,IF(F278>1,1,F278)),0)","v":{"v":0,"d":"0.00"}},{"$f":"IF(AND(E59=\"Média\"),IF(C61<0,0,IF(E281>1,1,E281)),0)","v":{"v":0,"d":"0.00"}},{"$f":"IF(AND(E59=\"Argilosa\"),IF(C61<0,0,IF(E279>1,1,E279)),0)","v":{"v":0,"d":"0.00"}},{"$f":"IF(AND(E59=\"Muito argilosa\"),IF(C61<0,0,IF(E282>1,1,E282)),0)","v":{"v":0,"d":"0.00"}},{"$f":"(B280+C280+D280+E280)","v":{"v":0,"d":"0.00"}}]
[null,{"$f":"D271+D272*C61+D273*C61^2","v":{"v":0.1,"d":"0.10"}},{"$f":"F271+F272*C61+F273*C61^2","v":{"v":-0.3015,"d":"-0.30"}},{"$f":"H271+H272*C61","v":{"v":1.0333,"d":"1.03"}},{"$f":"IF(AND(C61>15.1,C61<30),C281,IF(C61>=30,D281,B281))","v":{"v":0.1,"d":"0.10"}}]
[null,{"$f":"D275+D276*C61+D277*C61^2","v":{"v":0.1,"d":"0.10"}},{"$f":"F275+F276*C61+F277*C61^2","v":{"v":0.1076,"d":"0.11"}},{"$f":"H275+H276*C61","v":{"v":1.0333,"d":"1.03"}},{"$f":"IF(AND(C61>4.1,C61<9),C282,IF(C61>=9,D282,B282))","v":{"v":0.1,"d":"0.10"}}]
[]
[null,"Ca - Fator de Ponderação"]
[null,"Classificação","Ponderação"]
[null,{"v":0,"d":"0.00"},{"v":0.1,"d":"0.10"}]
[null,0.41,0.25]
[null,1.21,{"v":0.5,"d":"0.50"}]
[null,2.41,{"v":0.7,"d":"0.70"}]
[null,{"v":4,"d":"4.00"},{"v":1,"d":"1.00"}]
[null,{"v":20,"d":"20.00"},{"v":0.7,"d":"0.70"}]
[]
[null,"Ca - Fórmulas"]
[null,"F1 = Yo + ax + bx2 ",null,null,"F2 = Yo + ax + bx2 ",null,"F3 = Yo + ax "]
[null,"Yo",{"v":0.1,"d":"0.10"},null,"Yo",{"v":0.3213,"d":"0.32"},"Yo",{"v":1.075,"d":"1.08"}]
[null,"a",{"v":0.3839,"d":"0.38"},null,"a",{"v":0.1381,"d":"0.14"},"a",{"v":-0.0188,"d":"-0.02"}]
[null,"b",{"v":-0.0441,"d":"-0.04"},null,"b",{"v":0.0079,"d":"0.01"}]
[]
[null,null,{"$f":"C295+C296*C62+C297*C62^2","v":{"v":0.1,"d":"0.10"}},{"$f":"F295+F296*C62+F297*C62^2","v":{"v":0.3213,"d":"0.32"}},{"$f":"H295+H296*C62","v":{"v":1.075,"d":"1.08"}},{"$f":"IF(AND(C62>1.21,C62<4),D299,IF(C62>=4,E299,C299))","v":{"v":0.1,"d":"0.10"}}]
[]
[null,"Mg - Fator de Ponderação\t"]
[null,"Classificação","Ponderação"]
[null,{"v":0,"d":"0.00"},{"v":0.1,"d":"0.10"}]
[null,0.16,0.25]
[null,0.46,{"v":0.5,"d":"0.50"}]
[null,0.91,{"v":0.7,"d":"0.70"}]
[null,{"v":1.5,"d":"1.50"},{"v":1,"d":"1.00"}]
[null,{"v":7.5,"d":"7.50"},{"v":0.7,"d":"0.70"}]
[]
[null,"Mg - Fórmulas"]
[null,"F1 = Yo + ax + bx2 ",null,null,"F2 = Yo + ax + bx2 ",null,"F3 = Yo + ax "]
[null,"Yo",{"v":0.1,"d":"0.10"},null,"Yo",{"v":0.3213,"d":"0.32"},"Yo",{"v":1.075,"d":"1.08"}]
[null,"a",{"v":0.9737,"d":"0.97"},null,"a",{"v":0.3601,"d":"0.36"},"a",-0.05]
[null,"b",{"v":-0.2264,"d":"-0.23"},null,"b",{"v":0.0616,"d":"0.06"}]
[null,null,{"$f":"C312+C313*C63+C314*C63^2","v":{"v":0.1,"d":"0.10"}},{"$f":"F312+F313*C63+F314*C63^2","v":{"v":0.3213,"d":"0.32"}},{"$f":"H312+H313*C63","v":{"v":1.075,"d":"1.08"}},{"$f":"IF(AND(C63>0.46,C63<1.5),D315,IF(C63>=1.5,E315,C315))","v":{"v":0.1,"d":"0.10"}}]
[]
[null,"K - Fator de Ponderação\t"]
[null,"Classificação","Ponderação"]
[null,{"v":0,"d":"0.00"},{"v":0.1,"d":"0.10"}]
[null,{"v":16,"d":"16.00"},0.25]
[null,{"v":41,"d":"41.00"},{"v":0.5,"d":"0.50"}]
[null,{"v":71,"d":"71.00"},{"v":0.7,"d":"0.70"}]
[null,{"v":120,"d":"120.00"},{"v":1,"d":"1.00"}]
[null,{"v":600,"d":"600.00"},{"v":0.7,"d":"0.70"}]
[]
[null,"K - Fórmulas"]
[null,"F1 = Yo + ax + bx2 ",null,null,"F2 = Yo + ax + bx2 ",null,"F3 = Yo + ax "]
[null,"Yo",{"v":0.1,"d":"0.10"},null,"Yo",{"v":0.2066,"d":"0.21"},"Yo",{"v":1.075,"d":"1.08"}]
[null,"a",{"v":0.0091,"d":"0.01"},null,"a",{"v":0.0074,"d":"0.01"},"a",{"v":-6.2E-4,"d":"-0.00"}]
[null,"b",{"v":1.5244E-5,"d":"0.00"},null,"b",{"v":-6.8888E-6,"d":"-0.00"}]
[null,null,{"$f":"C328+C329*C64+C330*C64^2","v":{"v":0.1,"d":"0.10"}},{"$f":"F328+F329*C64+F330*C64^2","v":{"v":0.2066,"d":"0.21"}},{"$f":"H328+H329*C64","v":{"v":1.075,"d":"1.08"}},{"$f":"IF(AND(C64>41,C64<120),D331,IF(C64>=120,E331,C331))","v":{"v":0.1,"d":"0.10"}}]
[]
[null,"pH - Fator de Ponderação\t"]
[null,"Classificação","Ponderação"]
[null,{"v":5.1,"d":"5.10"},{"v":0.3,"d":"0.30"}]
[null,{"v":5.2,"d":"5.20"},{"v":0.4,"d":"0.40"}]
[null,{"v":5.5,"d":"5.50"},{"v":0.7,"d":"0.70"}]
[null,{"v":6,"d":"6.00"},{"v":1,"d":"1.00"}]
[null,{"v":6.4,"d":"6.40"},{"v":0.7,"d":"0.70"}]
[]
[null,"pH em água - Fórmulas"]
[null,"F1 = Yo + ax + bx2 ",null,null,"F2 = Yo + ax + bx2 "]
[null,"Yo",{"v":-19.1,"d":"-19.10"},null,"Yo",{"v":-42.5,"d":"-42.50"}]
[null,"a",6.35,null,"a",14.75]
[null,"b",{"v":-0.5,"d":"-0.50"},null,"b",-1.25]
[null,{"$f":"-4.8+(1*C65)","v":{"v":-4.8,"d":"-4.80"}},{"$f":"C343+C344*C65+C345*C65^2","v":{"v":-19.1,"d":"-19.10"}},{"$f":"F343+F344*C65+F345*C65^2","v":{"v":-42.5,"d":"-42.50"}},{"$f":"IF(C65>=6.6,F346,IF(AND(C65>=6,C65<6.6),D346,IF(AND(C65>5.2,C65<6),C346,B346)))","v":{"v":-4.8,"d":"-4.80"}}]
[]
[null,"Al - Fator de Ponderação\t"]
[null,"Classificação","Ponderação"]
[null,{"v":0,"d":"0.00"},{"v":0.7,"d":"0.70"}]
[null,0.21,{"v":0.6,"d":"0.60"}]
[null,0.51,{"v":0.5,"d":"0.50"}]
[null,1.01,0.25]
[null,{"v":2,"d":"2.00"},{"v":0,"d":"0.00"}]
[]
[null,"Al - Fórmulas"]
[null,"F1 = Yo + ax + bx2 ",null,null,"F2 = Yo + ax + bx2 "]
[null,"Yo",{"v":0.7,"d":"0.70"},null,"Yo",{"v":0.8406,"d":"0.84"}]
[null,"a",{"v":-0.535,"d":"-0.54"},null,"a",{"v":-0.7525,"d":"-0.75"}]
[null,"b",{"v":0.2801,"d":"0.28"},null,"b",{"v":0.1661,"d":"0.17"}]
[null,null,{"$f":"C358+C359*C66+C360*C66^2","v":{"v":0.7,"d":"0.70"}},{"$f":"F358+F359*C66+F360*C66^2","v":{"v":0.8406,"d":"0.84"}},{"$f":"IF(C66>=0.51,D361,C361)","v":{"v":0.7,"d":"0.70"}}]
[]
[null,"CTC - Fator de Ponderação\t"]
[null,"Classificação","Ponderação"]
[null,{"v":0,"d":"0.00"},{"v":0.1,"d":"0.10"}]
[null,{"v":1.6,"d":"1.60"},0.25]
[null,{"v":4.3,"d":"4.30"},{"v":0.5,"d":"0.50"}]
[null,{"v":8.6,"d":"8.60"},{"v":0.7,"d":"0.70"}]
[null,{"v":15,"d":"15.00"},{"v":1,"d":"1.00"}]
[]
[null,"CTC - Fórmulas"]
[null,"F1 = Yo + ax"]
[null,"Yo",0.1654]
[null,"a",{"v":0.0584,"d":"0.06"}]
[]
[null,null,{"$f":"C373+C374*C67","v":{"v":0.1654,"d":"0.17"}},{"$f":"IF(C376>1,1,C376)","v":{"v":0.1654,"d":"0.17"}},{"$f":"D376","v":{"v":0.1654,"d":"0.17"}}]
[]
[null,"V - Fator de Ponderação\t"]
[null,"Classificação","Ponderação"]
[null,{"v":0,"d":"0.00"},{"v":0.1,"d":"0.10"}]
[null,{"v":15,"d":"15.00"},0.25]
[null,{"v":30,"d":"30.00"},{"v":0.5,"d":"0.50"}]
[null,{"v":60,"d":"60.00"},{"v":0.7,"d":"0.70"}]
[null,{"v":80,"d":"80.00"},{"v":1,"d":"1.00"}]
[]
[null,"V - Fórmulas"]
[null,"Fórmula1 = Yo + ax ",null,"Fórmula2 = Yo + ax+bx2 "]
[null,"Yo",{"v":0.3,"d":"0.30"},null,"Yo",{"v":0.1,"d":"0.10"}]
[null,"a",{"v":0.0067,"d":"0.01"},null,"a",{"v":0.0067,"d":"0.01"}]
[{"$nulls":4},"b",{"v":0.0002,"d":"0.00"}]
[null,null,{"$f":"C388+C389*C68","v":{"v":0.3,"d":"0.30"}},{"$f":"F388+F389*C68+F390*C68^2","v":{"v":0.1,"d":"0.10"}},{"$f":"IF(C68<30,D391,C391)","v":{"v":0.1,"d":"0.10"}}]
[]
[null,"12 - Fórmulas"]
[null,"Fórmula - Média dos resultados parciais da MO, P e V"]
[]
[]
[]
[3,"Fator de Ponderação\t"]
[null,"item 15.1","Ponderação"]
[null,"< 5%",0.55]
[null,"5 - 10%",0.45]
[null,"> 10%",0.35]
[null,"item 15.1","Ponderação"]
[null,"Avançado",{"v":0.5,"d":"0.50"}]
[null,"Intermediário",{"v":0.8,"d":"0.80"}]
[null,"Inicial",1]
[null,"item 15.2","Ponderação"]
[null,"Redução",1.2]
[null,"Inalterado",{"v":1,"d":"1.0"}]
[null,"Intensificação",0.8]
[]
[null,"Fórmulas",null,"< 5%","5% - 10%","> 10%"]
[{"$nulls":3},{"$f":"IF(B421>0,1,\" \")","v":" "},{"$f":"IF(D421>0,1,\" \")","v":" "},{"$f":"IF(F421>0,1,\" \")","v":" "}]
[{"$nulls":3},{"$f":"IF(B419>0,1,\" \")","v":" "},{"$f":"IF(D419>0,1,\" \")","v":" "},{"$f":"IF(F419>0,1,\" \")","v":" "}]
[{"$nulls":3},{"$f":"IF(B417>0,1,\" \")","v":" "},{"$f":"IF(D417>0,1,\" \")","v":" "},{"$f":"IF(F417>0,1,\" \")","v":" "}]
[null,{"$f":"IF(F87<0.05,E87,0)","v":0},null,{"$f":"IF(F87>=0.05,E87,0)","v":0},null,{"$f":"IF(F87>0.1,E87,0)","v":0}]
[null,{"$f":"IF(D87=B426,B416,0)","v":0},null,{"$f":"IF(F416>0.99,0,IF(D87=B426,D416,0))","v":0},null,{"$f":"IF(D87=B426,F416,0)","v":0}]
[null,{"$f":"IF(F87<0.05,E87,0)","v":0},null,{"$f":"IF(F87>=0.05,E87,0)","v":0},null,{"$f":"IF(F87>0.1,E87,0)","v":0}]
[null,{"$f":"IF(D87=B427,B418,0)","v":0},null,{"$f":"IF(F418>0.99,0,IF(D87=B427,D418,0))","v":0},null,{"$f":"IF(D87=B427,F418,0)","v":0}]
[null,{"$f":"IF(F87<0.05,E87,0)","v":0},null,{"$f":"IF(F87>=0.05,E87,0)","v":0},null,{"$f":"IF(F87>0.1,E87,0)","v":0}]
[null,{"$f":"IF(D87=B428,B420,0)","v":0},null,{"$f":"IF(F420>0.99,0,IF(D87=B428,D420,0))","v":0},null,{"$f":"IF(D87=B428,F420,0)","v":0}]
[null,{"$f":"IF(B424>0,B424,0)+IF(C424>0,C424,0)+IF(D424>0,D424,0)","v":{"v":0,"d":"0.00"}}]
[null,{"$f":"IF(D90=D426,1,0)","v":{"v":0,"d":"0.00"}},{"$f":"IF(D90=D427,1,0)","v":{"v":0,"d":"0.00"}},{"$f":"IF(D90=D428,1,0)","v":{"v":0,"d":"0.00"}}]
[null,{"$f":"IF(B417>0,G87*B433,0)+IF(B419>0,G88*B433,0)+IF(B421>0,G90*B433,0)","v":0},{"$f":"IF(D417>0,G87*B434,0)+IF(D419>0,G88*B434,0)+IF(D421>0,G90*B434,0)","v":0},{"$f":"IF(F417>0,G87*B435,0)+IF(F419>0,G88*B435,0)+IF(F421>0,G90*B435,0)","v":0}]
[null,"Unidades",null,"Unidades"]
[null,"Inicial",null,"Redução"]
[null,"Intermediário",null,"Inalterado"]
[null,"Avançado",null,"Intensificação"]
[]
[]
[]
[]
[null,{"$f":"C400","v":0.55}]
[null,{"$f":"C401","v":0.45}]
[null,{"$f":"C402","v":0.35}]
[]
[null,"Fórmula - verifica a proporção da área em processo de degradação em relação à área total e ao grau de intensidade do fenômeno. Após o cálculo, multiplica o valor final pelo fator 1,2, se verificada tendência de redução do estádio de degradação ou pelo fator 0,8, se a tendência é de intensificação do estádio de degradação.\t\t\t\t\t\t\t\n\t\t\t\t\t\t\t\n\t\t\t\t\t\t\t"]
[]
[]
[]
[4,"Fator de Ponderação\t"]
[null,"Adequado",0.9]
[null,"Médio",0.6]
[null,"Baixo",0.3]
[null,"Situação crítica",0.1]
[]
[]
[null,"Fator de Ponderação"]
[null,{"$f":"E104","v":{"v":1,"d":"1.0"}}]
[null,{"$f":"E105","v":0.4}]
[null,{"$f":"E106","v":0.1}]
[]
[null,"Fórmulas"]
[null,{"$f":"D98/D458","v":{"$error":"#DIV/0!"}},null,{"$f":"B454","v":{"$error":"#DIV/0!"}}]
[null,{"$f":"D99/D458","v":{"$error":"#DIV/0!"}},null,{"$f":"B455","v":{"$error":"#DIV/0!"}}]
[null,{"$f":"D100/D458","v":{"$error":"#DIV/0!"}},null,{"$f":"B456","v":{"$error":"#DIV/0!"}}]
[null,{"$f":"D101/D458","v":{"$error":"#DIV/0!"}},null,{"$f":"B457","v":{"$error":"#DIV/0!"}}]
[null,"Área total do talhão (ha) =>",{"$f":"C6","v":{"v":0,"d":"0.00"}},{"$f":"D98+D99+D100+D101","v":{"v":0,"d":"0.0"}}]
[]
[{"$nulls":3},{"$f":"IF(D104=B464,B449,0)","v":0}]
[null,{"$f":"(D454*C442)+(D455*C443)+(D456*C444)+(D457*C445)","v":{"$error":"#DIV/0!"}},{"$f":"SUM(D460:D462)","v":{"v":0,"d":"0.00"}},{"$f":"IF(D104=B465,B450,0)","v":0}]
[{"$nulls":3},{"$f":"IF(D104=B466,B451,0)","v":0}]
[null,"Unidades"]
[null,"Suficiente"]
[null,"Insuficiente"]
[null,"Situação crítica"]
[]
[5,"Fator de Ponderação\t"]
[null,"Adequado",0.9]
[null,"Médio",0.6]
[null,"Baixo",0.3]
[null,"Situação crítica",0.1]
[]
[]
[null,{"$f":"D115/C480","v":{"$error":"#DIV/0!"}},{"$f":"B475","v":{"$error":"#DIV/0!"}}]
[null,{"$f":"D116/C480","v":{"$error":"#DIV/0!"}},{"$f":"B476","v":{"$error":"#DIV/0!"}}]
[null,{"$f":"D117/C480","v":{"$error":"#DIV/0!"}},{"$f":"B477","v":{"$error":"#DIV/0!"}}]
[null,{"$f":"D118/C480","v":{"$error":"#DIV/0!"}},{"$f":"B478","v":{"$error":"#DIV/0!"}}]
[]
[null,null,{"$f":"SUM(D115:D118)","v":{"v":0,"d":"0.0"}}]
[]
[]
[]
[null,"Análise Foliar (opcional)"]
[]
[{"$nulls":4},"Resultado"]
[null,"P (g/kg)",{"$f":"C32","v":{"v":0,"d":"0.0"}},null,{"$f":"IF(ISBLANK(C32),\"\",IF(C32<=H549,G488,IF(AND(C32>H549,C32<=H550),G489,IF(C32>H550,G490))))","v":""}]
[null,"K (g/kg)",{"v":0,"d":"0.0"},null,{"$f":"IF(ISBLANK(C33),\"\",IF(C33<=H553,G488,IF(AND(C33>H553,C33<=H554),G489,IF(C33>H554,G490))))","v":""},null,"Baixo"]
[null,"N (g/kg)",{"v":0,"d":"0.0"},null,{"$f":"IF(ISBLANK(C34),\"\",IF(C34<=H557,G488,IF(AND(C34>H557,C34<=H558),G489,IF(C34>H558,G490))))","v":""},null,"Adequado"]
[null,"S (g/kg)",{"v":0,"d":"0.0"},null,{"$f":"IF(ISBLANK(C35),\"\",IF(C35<=H561,G488,IF(AND(C35>H561,C35<=H562),G489,IF(C35>H562,G490))))","v":""},null,"Alto"]
[null,"Ca (g/kg)",{"v":0,"d":"0.0"},null,{"$f":"IF(ISBLANK(C36),\"\",IF(C36<=H565,G488,IF(AND(C36>H565,C36<=H566),G489,IF(C36>H566,G490))))","v":""}]
[null,"Mg (g/kg)",{"v":0,"d":"0.0"},null,{"$f":"IF(ISBLANK(C37),\"\",IF(C37<=H569,G488,IF(AND(C37>H569,C37<=H570),G489,IF(C37>H570,G490))))","v":""}]
[null,"B (mg/kg)",{"v":0,"d":"0.0"},null,{"$f":"IF(ISBLANK(C38),\"\",IF(C38<=H573,G488,IF(AND(C38>H573,C38<=H574),G489,IF(C38>H574,G490))))","v":""}]
[null,"Zn (mg/kg)",{"v":0,"d":"0.0"},null,{"$f":"IF(ISBLANK(C39),\"\",IF(C39<=H577,G488,IF(AND(C39>H577,C39<=H578),G489,IF(C39>H578,G490))))","v":""}]
[null,"Fe (mg/kg)",{"v":0,"d":"0.0"},null,{"$f":"IF(ISBLANK(C40),\"\",IF(C40<=H581,G488,IF(AND(C40>H581,C40<=H582),G489,IF(C40>H582,G490))))","v":""}]
[null,"Mn (mg/kg)",{"v":0,"d":"0.0"},null,{"$f":"IF(ISBLANK(C41),\"\",IF(C41<=H585,G488,IF(AND(C41>H585,C41<=H586),G489,IF(C41>H586,G490))))","v":""}]
[null,"Cu (mg/kg)",{"v":0,"d":"0.0"},null,{"$f":"IF(ISBLANK(C42),\"\",IF(C42<=H589,G488,IF(AND(C42>H589,C42<=H590),G489,IF(C42>H590,G490))))","v":""}]
[]
[]
[null,null,"Unidades","Unidades","Unidades","Unidades","Unidades"]
[null,"Nível","Soja","Milho","Café","Pastagem","Outros"]
["P (g/kg)","Baixo"]
[null,"Adequado",2.8,2.5,1.5,0.8]
[null,null,3.9,3.5,{"v":2,"d":"2.0"},{"v":3,"d":"3.0"}]
[null,"Alto"]
["K (g/kg)","Baixo"]
[null,"Adequado",14.4,17.5,{"v":19,"d":"19.0"},{"v":12,"d":"12.0"}]
[null,null,20.3,22.5,{"v":24,"d":"24.0"},{"v":25,"d":"25.0"}]
[null,"Alto"]
["N (g/kg)","Baixo"]
[null,"Adequado",{"v":50.62,"d":"50.6"},27.5,{"v":23,"d":"23.0"},{"v":12,"d":"12.0"}]
[null,null,62.4,32.5,{"v":32,"d":"32.0"},{"v":20,"d":"20.0"}]
[null,"Alto"]
["S (g/kg)","Baixo"]
[null,"Adequado",2.4,{"v":1,"d":"1.0"},1.5,0.8]
[null,null,3.3,{"v":2,"d":"2.0"},{"v":2,"d":"2.0"},2.5]
[null,"Alto"]
["Ca (g/kg)","Baixo"]
[null,"Adequado",6.2,2.5,{"v":10,"d":"10.0"},{"v":2,"d":"2.0"}]
[null,null,11.6,{"v":4,"d":"4.0"},{"v":14,"d":"14.0"},{"v":6,"d":"6.0"}]
[null,"Alto"]
["Mg (g/kg)","Baixo"]
[null,"Adequado",{"v":3,"d":"3.0"},2.5,3.1,1.5]
[null,null,4.9,{"v":4,"d":"4.0"},3.6,{"v":4,"d":"4.0"}]
[null,"Alto"]
["B (mg/kg)","Baixo"]
[null,"Adequado",{"v":37,"d":"37.0"},{"v":4,"d":"4.0"},{"v":59,"d":"59.0"},{"v":10,"d":"10.0"}]
[null,null,{"v":56,"d":"56.0"},{"v":20,"d":"20.0"},{"v":80,"d":"80.0"},{"v":20,"d":"20.0"}]
[null,"Alto"]
["Zn (mg/kg)","Baixo"]
[null,"Adequado",{"v":41,"d":"41.0"},{"v":20,"d":"20.0"},{"v":8,"d":"8.0"},{"v":20,"d":"20.0"}]
[null,null,{"v":78,"d":"78.0"},{"v":70,"d":"70.0"},{"v":16,"d":"16.0"},{"v":50,"d":"50.0"}]
[null,"Alto"]
["Fe (mg/kg)","Baixo"]
[null,"Adequado",{"v":77,"d":"77.0"},{"v":20,"d":"20.0"},{"v":90,"d":"90.0"},{"v":50,"d":"50.0"}]
[null,null,{"v":155,"d":"155.0"},{"v":250,"d":"250.0"},{"v":180,"d":"180.0"},{"v":250,"d":"250.0"}]
[null,"Alto"]
["Mn (mg/kg)","Baixo"]
[null,"Adequado",{"v":38,"d":"38.0"},{"v":20,"d":"20.0"},{"v":120,"d":"120.0"},{"v":40,"d":"40.0"}]
[null,null,{"v":97,"d":"97.0"},{"v":150,"d":"150.0"},{"v":210,"d":"210.0"},{"v":250,"d":"250.0"}]
[null,"Alto"]
["Cu (mg/kg)","Baixo"]
[null,"Adequado",{"v":7,"d":"7.0"},{"v":6,"d":"6.0"},{"v":8,"d":"8.0"},{"v":4,"d":"4.0"}]
[null,null,{"v":12,"d":"12.0"},{"v":20,"d":"20.0"},{"v":16,"d":"16.0"},{"v":12,"d":"12.0"}]
[null,"Alto"]
[null,null,"Folha sem pecíolo (Fonte Documento 458 - Tecnologias de manejo da fertilidade do solo e avaliação do estado nutricional da soja - Embrapa, 2023)","Fonte: Fertilidade de solos: nutrição e adubação do milho - Embrapa (2007)","Fonte: Documentos 14 - Estado nutricional dos solos e cafeeiros da região das Matas de Minas - Embrapa - 2021","Fonte: Cerrado: correção do solo e adubação - Embrapa - 2004"]
[null,"Nível"]
["P (g/kg)","Baixo",{"$f":"IF($C$31=$C$501,C502,\"\")","v":""},{"$f":"IF($C$31=$D$501,D502,\"\")","v":""},{"$f":"IF($C$31=$E$501,E502,\"\")","v":""},{"$f":"IF($C$31=$F$501,F502,\"\")","v":""},{"$f":"IF($C$31=$G$501,G502,\"\")","v":""},{"$f":"SUM(C548:G548)","v":{"v":0,"d":"0.0"}}]
[null,"Adequado","","","","","",{"$f":"SUM(C549:G549)","v":{"v":0,"d":"0.0"}}]
[null,null,"","","","","",{"v":0,"d":"0.0"}]
[null,"Alto","","","","","",{"v":0,"d":"0.0"}]
["K (g/kg)","Baixo","","","","","",{"v":0,"d":"0.0"}]
[null,"Adequado","","","","","",{"v":0,"d":"0.0"}]
[null,null,"","","","","",{"v":0,"d":"0.0"}]
[null,"Alto","","","","","",{"v":0,"d":"0.0"}]
["N (g/kg)","Baixo","","","","","",{"v":0,"d":"0.0"}]
[null,"Adequado","","","","","",{"v":0,"d":"0.0"}]
[null,null,"","","","","",{"v":0,"d":"0.0"}]
[null,"Alto","","","","","",{"v":0,"d":"0.0"}]
["S (g/kg)","Baixo","","","","","",{"v":0,"d":"0.0"}]
[null,"Adequado","","","","","",{"v":0,"d":"0.0"}]
[null,null,"","","","","",{"v":0,"d":"0.0"}]
[null,"Alto","","","","","",{"v":0,"d":"0.0"}]
["Ca (g/kg)","Baixo","","","","","",{"v":0,"d":"0.0"}]
[null,"Adequado","","","","","",{"v":0,"d":"0.0"}]
[null,null,"","","","","",{"v":0,"d":"0.0"}]
[null,"Alto","","","","","",{"v":0,"d":"0.0"}]
["Mg (g/kg)","Baixo","","","","","",{"v":0,"d":"0.0"}]
[null,"Adequado","","","","","",{"v":0,"d":"0.0"}]
[null,null,"","","","","",{"v":0,"d":"0.0"}]
[null,"Alto","","","","","",{"v":0,"d":"0.0"}]
["B (mg/kg)","Baixo","","","","","",{"v":0,"d":"0.0"}]
[null,"Adequado","","","","","",{"v":0,"d":"0.0"}]
[null,null,"","","","","",{"v":0,"d":"0.0"}]
[null,"Alto","","","","","",{"v":0,"d":"0.0"}]
["Zn (mg/kg)","Baixo","","","","","",{"v":0,"d":"0.0"}]
[null,"Adequado","","","","","",{"v":0,"d":"0.0"}]
[null,null,"","","","","",{"v":0,"d":"0.0"}]
[null,"Alto","","","","","",{"v":0,"d":"0.0"}]
["Fe (mg/kg)","Baixo","","","","","",{"v":0,"d":"0.0"}]
[null,"Adequado","","","","","",{"v":0,"d":"0.0"}]
[null,null,"","","","","",{"v":0,"d":"0.0"}]
[null,"Alto","","","","","",{"v":0,"d":"0.0"}]
["Mn (mg/kg)","Baixo","","","","","",{"v":0,"d":"0.0"}]
[null,"Adequado","","","","","",{"v":0,"d":"0.0"}]
[null,null,"","","","","",{"v":0,"d":"0.0"}]
[null,"Alto","","","","","",{"v":0,"d":"0.0"}]
["Cu (mg/kg)","Baixo","","","","","",{"v":0,"d":"0.0"}]
[null,"Adequado","","","","","",{"v":0,"d":"0.0"}]
[null,null,"","","","","",{"v":0,"d":"0.0"}]
[null,"Alto","","","","","",{"v":0,"d":"0.0"}]